<svg width="48" height="48" viewBox="0 0 48 48" fill="none" xmlns="http://www.w3.org/2000/svg">
<path opacity="0.9" d="M45.6062 24.5461C45.5508 24.7677 45.477 24.8477 45.2308 24.9677C44.8647 25.143 39.7416 26.3123 39.3539 26.3092C39.077 26.3061 38.9016 26.14 38.8616 25.8415C38.8185 25.5246 39.0124 25.3338 39.477 25.2415C40.4401 25.0507 42.5108 24.58 42.517 24.5492C42.5262 24.5092 39.8862 24.0846 38.9539 23.9769C37.9724 23.863 37.797 23.8046 37.637 23.5369C37.4462 23.2169 37.5231 22.9061 37.8431 22.7154C38.0893 22.5677 38.4001 22.5707 39.3877 22.7307L39.7047 22.783L39.4216 22.583C39.2124 22.4354 39.1016 22.3061 38.997 22.0815C38.8185 21.7061 38.8801 21.4784 39.2031 21.2846C39.4862 21.1154 39.7662 21.183 41.1539 21.7554C42.3908 22.263 42.6031 22.3707 44.2124 23.2754C45.5601 24.0292 45.7016 24.1584 45.6062 24.5461Z" fill="#fff"/>
<path opacity="0.9" d="M36.9877 23.1676C36.9508 23.4537 36.677 23.703 36.4093 23.6937C36.2985 23.6906 35.8554 23.6414 35.4093 23.583C34.9693 23.5276 34.2462 23.4537 33.8093 23.4199C33.3724 23.386 32.9693 23.3276 32.92 23.2876C32.397 22.8722 32.6308 22.0937 33.2924 22.0537C33.6216 22.0322 36.5262 22.4753 36.6893 22.5706C36.9077 22.6968 37.0185 22.9214 36.9877 23.1676Z" fill="#fff"/>
<path opacity="0.9" d="M31.4308 22.4876C31.4616 22.7368 31.3077 23.0507 31.0831 23.183C30.92 23.2784 30.6339 23.2599 29.0431 23.0476C27.4092 22.8291 27.2216 22.7737 27.04 22.4691C26.7723 22.023 27.0431 21.5522 27.6246 21.4476C27.8462 21.4076 28.4954 21.4783 29.9262 21.6937C31.1846 21.8876 31.3662 21.983 31.4308 22.4876Z" fill="#fff"/>
<path opacity="0.9" d="M25.8185 22.0353C25.8339 22.1645 25.8062 22.3491 25.7539 22.4599C25.5723 22.8384 25.3846 22.8784 23.9939 22.8353C23.2831 22.8137 22.5262 22.7984 22.3169 22.8014C21.7477 22.8107 21.4462 22.703 21.2862 22.4384C21.1016 22.1276 21.1692 21.8138 21.4708 21.583C21.7723 21.3553 22.3015 21.3153 24.0708 21.3861C25.4985 21.4445 25.7539 21.5399 25.8185 22.0353Z" fill="#fff"/>
<path opacity="0.9" d="M19.1908 22.5707C19.1754 22.6907 19.08 22.8784 18.9816 22.9861C18.8062 23.1769 18.7508 23.1892 17.1293 23.383C15.2216 23.6107 14.92 23.5892 14.6923 23.2107C14.5785 23.023 14.5631 22.9153 14.6154 22.7061C14.7354 22.2261 14.9816 22.1399 16.8616 21.9122C17.8739 21.7892 18.5723 21.743 18.7077 21.7861C18.9969 21.8784 19.2308 22.2599 19.1908 22.5707Z" fill="#fff"/>
<path opacity="0.9" d="M12.8769 23.9153C12.7877 24.2723 12.56 24.3984 11.8369 24.4938C11.52 24.5369 10.7477 24.663 10.12 24.7769C9.48925 24.8907 8.8831 24.9615 8.76925 24.9338C8.08618 24.7707 8.03387 23.9246 8.68925 23.6446C8.91387 23.5492 11.2185 23.1553 12.0308 23.0753C12.4431 23.0353 12.6339 23.1246 12.8277 23.4507C12.9108 23.5954 12.9262 23.7277 12.8769 23.9153Z" fill="#fff"/>
<path opacity="0.9" d="M6.80308 25.1307C6.75693 25.2476 6.66154 25.3738 6.58462 25.42C6.46462 25.4907 3.72308 26.583 3.23693 26.7553C2.76308 26.9215 2.2677 26.4938 2.3877 26.02C2.45847 25.743 2.56308 25.6784 3.4 25.4169C3.77231 25.3 4.55385 25.0261 5.15077 24.8046C6.37539 24.3492 6.53847 24.34 6.75693 24.703C6.85539 24.8723 6.86462 24.9707 6.80308 25.1307Z" fill="#fff"/>
</svg>
