<svg width="48" height="40" viewBox="0 0 48 40" fill="none" xmlns="http://www.w3.org/2000/svg">
<path fill-rule="evenodd" clip-rule="evenodd" d="M47.5649 14.7758L35.4375 9.76384C34.749 9.47926 33.954 9.66226 33.4592 10.2193L30.6281 13.4039V12.4446C30.6281 12.362 30.6123 12.2773 30.587 12.2069C28.3887 6.06437 24.5625 3.21129 23.0197 2.26992C22.4938 1.94904 21.8452 1.912 21.2845 2.1709L18.2747 3.55967L13.8618 5.59643L0.408691 11.805C0.163696 11.918 0 12.1684 0 12.4446V23.7194C0 24.6054 0.719604 25.326 1.60437 25.326H14.8821H18.1637H20.0306L19.5707 25.8434L16.1759 29.6621L15.2509 30.7032C14.5701 31.4689 14.848 32.6813 15.7947 33.0726L27.5889 37.9466C27.7368 38.0086 27.91 38.0192 28.0767 37.9646C28.0774 37.9642 28.0778 37.9642 28.0785 37.9642L46.5106 31.8378C47.4016 31.5415 48 30.7112 48 29.7713V25.4206V22.1344V15.4267C48 15.1506 47.8308 14.8858 47.5649 14.7758ZM13.0206 23.9174H14.8821H18.1637H21.2823L29.2218 14.9859V13.1487H1.40625V23.7194C1.40625 23.8286 1.49524 23.9174 1.60437 23.9174H5.47449H6.88696H11.6082H13.0206ZM46.5938 29.7713V25.4206V22.1344V17.2768L30.1293 35.7988L37.7069 33.2801L39.0421 32.8364L41.9271 31.8774L43.2612 31.4341L46.0679 30.5011C46.3824 30.3966 46.5938 30.1032 46.5938 29.7713ZM21.873 3.44965L18.9979 4.77681L14.4503 6.87519L3.90894 11.7401H28.9021C26.8253 6.67019 23.6232 4.28724 22.288 3.47239C22.1631 3.39611 22.0078 3.38768 21.873 3.44965ZM40.6256 13.4314L36.9624 11.9176L35.6642 11.3807L34.901 11.0653C34.7651 11.0096 34.6073 11.0455 34.5095 11.1555L20.792 26.5871L17.0438 30.804L16.3011 31.6394C16.2627 31.6827 16.2781 31.7487 16.3312 31.7707L27.6636 36.4541L46.1129 15.6992L41.926 13.969L40.6256 13.4314Z" fill="#2F2D2F"/>
</svg>
