<svg width="24" height="24" viewBox="0 0 24 24" fill="none" xmlns="http://www.w3.org/2000/svg">
<path d="M6 6L18.7279 18.7279" stroke="#2F2D2F" stroke-width="2" stroke-linecap="round" stroke-linejoin="round"/>
<path d="M6 19L18.7279 6.27208" stroke="#2F2D2F" stroke-width="2" stroke-linecap="round" stroke-linejoin="round"/>
</svg>
