<svg width="721" height="564" viewBox="0 0 721 564" fill="none" xmlns="http://www.w3.org/2000/svg">
<g opacity="0.6" filter="url(#filter0_f_927_3205)">
<path d="M91.2985 124.321C328.89 52.8368 448.952 65.2604 639.33 182.306C640.669 189.951 640.975 195.673 639.386 198.873L330.9 483.571L80.1787 142.42C81.9804 134.425 85.7631 129.782 91.2985 124.321Z" fill="#B35853"/>
</g>
<defs>
<filter id="filter0_f_927_3205" x="0.178711" y="0.132812" width="720.281" height="563.438" filterUnits="userSpaceOnUse" color-interpolation-filters="sRGB">
<feFlood flood-opacity="0" result="BackgroundImageFix"/>
<feBlend mode="normal" in="SourceGraphic" in2="BackgroundImageFix" result="shape"/>
<feGaussianBlur stdDeviation="40" result="effect1_foregroundBlur_927_3205"/>
</filter>
</defs>
</svg>
