<svg width="484" height="235" viewBox="0 0 484 235" fill="none" xmlns="http://www.w3.org/2000/svg">
<path d="M222.512 222.32C222.512 223.344 223.568 224.144 225.68 224.72C226.469 224.891 227.131 225.072 227.664 225.264C228.219 225.435 228.816 225.701 229.456 226.064C230.117 226.427 230.619 226.907 230.96 227.504C231.301 228.101 231.472 228.805 231.472 229.616C231.472 231.067 230.907 232.229 229.776 233.104C228.645 233.979 227.216 234.416 225.488 234.416C223.952 234.416 222.619 234.085 221.488 233.424C220.379 232.741 219.589 231.824 219.12 230.672L221.52 229.296C221.776 230.064 222.256 230.672 222.96 231.12C223.664 231.568 224.507 231.792 225.488 231.792C226.448 231.792 227.216 231.611 227.792 231.248C228.368 230.885 228.656 230.341 228.656 229.616C228.656 228.528 227.6 227.739 225.488 227.248C224.784 227.056 224.251 226.907 223.888 226.8C223.525 226.693 223.024 226.501 222.384 226.224C221.765 225.947 221.296 225.659 220.976 225.36C220.656 225.04 220.357 224.624 220.08 224.112C219.824 223.579 219.696 222.992 219.696 222.352C219.696 220.965 220.229 219.824 221.296 218.928C222.384 218.032 223.739 217.584 225.36 217.584C226.661 217.584 227.813 217.883 228.816 218.48C229.84 219.056 230.608 219.867 231.12 220.912L228.784 222.224C228.208 220.859 227.067 220.176 225.36 220.176C224.549 220.176 223.867 220.368 223.312 220.752C222.779 221.136 222.512 221.659 222.512 222.32Z" fill="black"/>
<path d="M252.891 227.28H239.483C239.76 228.688 240.411 229.797 241.435 230.608C242.459 231.397 243.739 231.792 245.275 231.792C247.387 231.792 248.923 231.013 249.883 229.456L252.251 230.8C250.672 233.211 248.325 234.416 245.211 234.416C242.693 234.416 240.624 233.627 239.003 232.048C237.424 230.427 236.635 228.411 236.635 226C236.635 223.568 237.413 221.563 238.971 219.984C240.528 218.384 242.544 217.584 245.019 217.584C247.365 217.584 249.275 218.416 250.747 220.08C252.24 221.701 252.987 223.685 252.987 226.032C252.987 226.437 252.955 226.853 252.891 227.28ZM245.019 220.208C243.547 220.208 242.309 220.624 241.307 221.456C240.325 222.288 239.717 223.419 239.483 224.848H250.171C249.936 223.376 249.349 222.235 248.411 221.424C247.472 220.613 246.341 220.208 245.019 220.208Z" fill="black"/>
<path d="M262.171 234H259.387V210.64H262.171V234Z" fill="black"/>
<path d="M284.978 227.28H271.57C271.848 228.688 272.498 229.797 273.522 230.608C274.546 231.397 275.826 231.792 277.362 231.792C279.474 231.792 281.01 231.013 281.97 229.456L284.338 230.8C282.76 233.211 280.413 234.416 277.298 234.416C274.781 234.416 272.712 233.627 271.09 232.048C269.512 230.427 268.722 228.411 268.722 226C268.722 223.568 269.501 221.563 271.058 219.984C272.616 218.384 274.632 217.584 277.106 217.584C279.453 217.584 281.362 218.416 282.834 220.08C284.328 221.701 285.074 223.685 285.074 226.032C285.074 226.437 285.042 226.853 284.978 227.28ZM277.106 220.208C275.634 220.208 274.397 220.624 273.394 221.456C272.413 222.288 271.805 223.419 271.57 224.848H282.258C282.024 223.376 281.437 222.235 280.498 221.424C279.56 220.613 278.429 220.208 277.106 220.208Z" fill="black"/>
<path d="M298.963 234.416C296.553 234.416 294.547 233.616 292.947 232.016C291.347 230.395 290.547 228.389 290.547 226C290.547 223.611 291.347 221.616 292.947 220.016C294.547 218.395 296.553 217.584 298.963 217.584C300.542 217.584 301.961 217.968 303.219 218.736C304.478 219.483 305.417 220.496 306.035 221.776L303.699 223.12C303.294 222.267 302.665 221.584 301.811 221.072C300.979 220.56 300.03 220.304 298.963 220.304C297.363 220.304 296.019 220.848 294.931 221.936C293.865 223.045 293.331 224.4 293.331 226C293.331 227.579 293.865 228.923 294.931 230.032C296.019 231.12 297.363 231.664 298.963 231.664C300.03 231.664 300.99 231.419 301.843 230.928C302.697 230.416 303.347 229.733 303.795 228.88L306.163 230.256C305.459 231.536 304.467 232.549 303.187 233.296C301.907 234.043 300.499 234.416 298.963 234.416Z" fill="black"/>
<path d="M320.816 218V220.688H316.56V229.36C316.56 230.149 316.709 230.715 317.008 231.056C317.328 231.376 317.808 231.547 318.448 231.568C319.088 231.568 319.877 231.547 320.816 231.504V234C318.363 234.32 316.571 234.117 315.44 233.392C314.331 232.667 313.776 231.323 313.776 229.36V220.688H310.608V218H313.776V214.352L316.56 213.52V218H320.816Z" fill="black"/>
<path d="M341.859 227.28H328.452C328.729 228.688 329.38 229.797 330.404 230.608C331.428 231.397 332.707 231.792 334.243 231.792C336.355 231.792 337.892 231.013 338.852 229.456L341.22 230.8C339.641 233.211 337.294 234.416 334.18 234.416C331.662 234.416 329.593 233.627 327.971 232.048C326.393 230.427 325.603 228.411 325.603 226C325.603 223.568 326.382 221.563 327.939 219.984C329.497 218.384 331.513 217.584 333.987 217.584C336.334 217.584 338.243 218.416 339.715 220.08C341.209 221.701 341.956 223.685 341.956 226.032C341.956 226.437 341.923 226.853 341.859 227.28ZM333.987 220.208C332.515 220.208 331.278 220.624 330.276 221.456C329.294 222.288 328.686 223.419 328.452 224.848H339.139C338.905 223.376 338.318 222.235 337.379 221.424C336.441 220.613 335.31 220.208 333.987 220.208Z" fill="black"/>
<path d="M361.573 220.752V211.6H364.357V234H361.573V231.248C360.207 233.36 358.191 234.416 355.525 234.416C353.263 234.416 351.354 233.605 349.797 231.984C348.218 230.341 347.428 228.347 347.428 226C347.428 223.675 348.218 221.691 349.797 220.048C351.375 218.405 353.285 217.584 355.525 217.584C358.191 217.584 360.207 218.64 361.573 220.752ZM355.876 231.728C357.498 231.728 358.852 231.184 359.94 230.096C361.028 228.965 361.573 227.6 361.573 226C361.573 224.379 361.028 223.024 359.94 221.936C358.852 220.827 357.498 220.272 355.876 220.272C354.276 220.272 352.932 220.827 351.844 221.936C350.756 223.024 350.212 224.379 350.212 226C350.212 227.6 350.756 228.965 351.844 230.096C352.932 231.184 354.276 231.728 355.876 231.728Z" fill="black"/>
<path d="M420.392 217.584C422.205 217.584 423.656 218.171 424.744 219.344C425.853 220.517 426.408 222.085 426.408 224.048V234H423.624V224.144C423.624 222.928 423.304 221.979 422.664 221.296C422.045 220.592 421.192 220.24 420.104 220.24C418.867 220.24 417.896 220.656 417.192 221.488C416.509 222.299 416.168 223.504 416.168 225.104V234H413.384V224.144C413.384 222.928 413.075 221.979 412.456 221.296C411.859 220.592 411.037 220.24 409.992 220.24C408.776 220.24 407.784 220.667 407.016 221.52C406.269 222.352 405.896 223.547 405.896 225.104V234H403.112V218H405.896V220.144C406.984 218.437 408.573 217.584 410.664 217.584C412.819 217.584 414.387 218.491 415.368 220.304C416.477 218.491 418.152 217.584 420.392 217.584Z" fill="black"/>
<path d="M434.876 215.088C434.343 215.088 433.895 214.907 433.532 214.544C433.17 214.181 432.988 213.744 432.988 213.232C432.988 212.72 433.17 212.283 433.532 211.92C433.895 211.536 434.343 211.344 434.876 211.344C435.388 211.344 435.826 211.536 436.188 211.92C436.551 212.283 436.732 212.72 436.732 213.232C436.732 213.744 436.551 214.181 436.188 214.544C435.826 214.907 435.388 215.088 434.876 215.088ZM436.252 234H433.468V218H436.252V234Z" fill="black"/>
<path d="M446.483 234H443.699V210.64H446.483V234Z" fill="black"/>
<path d="M459.563 225.744L467.467 234H464.011L456.715 226.416V234H453.931V211.6H456.715V225.072L463.627 218H467.211L459.563 225.744Z" fill="black"/>
<path d="M386 222C386 223.105 385.105 224 384 224C382.895 224 382 223.105 382 222C382 220.895 382.895 220 384 220C385.105 220 386 220.895 386 222Z" fill="black"/>
<path fill-rule="evenodd" clip-rule="evenodd" d="M71.7506 0.978729C71.1256 1.648 70.6828 2.72339 70.5379 3.92305C70.4123 4.9627 69.906 7.09277 69.4132 8.65631C68.3147 12.1391 60.6908 27.1861 52.437 42.1607C17.7446 105.103 3.69551 136.844 0.494177 159.513C-0.329279 165.343 -0.0894468 175.804 0.959519 179.833C3.33084 188.937 10.0192 195.888 17.2171 196.728C21.9212 197.276 23.0521 195.93 19.349 194.19C16.4959 192.85 14.4115 190.466 13.5647 187.575C13.0372 185.775 12.9541 184.086 13.1342 178.832C13.8156 158.916 22.1386 133.483 38.8537 100.235C43.4932 91.006 51.4814 76.5346 51.7752 76.8261C51.8366 76.8871 51.5166 78.2041 51.0647 79.753C45.2993 99.5035 42.5285 118.218 43.018 134.098C43.1891 139.636 43.4514 142.232 44.0797 144.596C45.9726 151.719 49.3593 157.42 52.7026 159.113C54.7011 160.125 57.5214 160.172 58.696 159.214C61.2401 157.138 71.55 143.432 79.6913 131.303C90.6381 114.993 100.228 98.4675 110.092 78.914C113.021 73.1066 115.321 68.8119 115.201 69.3703C115.082 69.9287 112.934 79.8817 110.429 91.4881C104.167 120.495 103.73 123.315 103.719 134.755C103.712 142.867 103.809 144.241 104.587 147.001C107.381 156.919 112.827 160.885 122.277 159.883C127.693 159.309 129.753 157.447 128.304 154.432C127.869 153.528 127.108 152.778 126.274 152.432C123.65 151.344 122.908 149.861 122.294 144.479C120.982 132.992 126.11 103.29 136.417 62.6694C140.656 45.9623 146.372 25.2412 149.973 13.5297C153.128 3.26677 153.506 1.03883 152.209 0.349657C150.085 -0.777714 145.66 1.86203 141.179 6.92951C132.056 17.2464 121.67 34.8234 97.324 81.1476C78.5044 116.957 71.4084 129.233 66.2651 134.883C64.6526 136.654 62.916 137.671 62.2272 137.249C60.2492 136.036 59.5653 128.089 60.6814 119.294C62.5505 104.566 68.1694 82.9438 76.6631 57.7961C83.4177 37.7958 87.508 23.9059 87.508 20.9668C87.508 15.6065 84.7786 8.74646 81.0534 4.743C76.7654 0.13523 73.6979 -1.10585 71.7506 0.978729ZM241.599 0.316356C231.639 2.45617 222.003 10.2198 213.354 23.0733C207.228 32.1764 203.757 40.1715 199.51 54.9581C197.121 63.2762 194.871 72.2501 192.489 82.9589C190.138 93.5263 189.529 95.3632 186.686 100.438C181.644 109.439 161.184 140.846 160.363 140.846C159.685 140.846 159.882 134.085 160.756 127.329C162.608 113.023 166.799 96.653 172.73 80.5632C175.174 73.9346 174.925 71.556 171.465 68.4529C169.044 66.2834 165.76 65.5959 162.33 66.5413C159.156 67.4161 155.896 72.4239 152.027 82.3659C151.028 84.9346 148.289 91.6964 145.942 97.3922C140.449 110.724 136.013 122.509 136.358 122.852C136.716 123.207 137.103 122.699 142.349 114.991C147.209 107.852 147.967 107.003 147.516 109.208C147.36 109.969 146.693 113.71 146.034 117.522C142.291 139.171 142.992 150.207 148.507 156.439C150.031 158.161 152.76 159.528 154.678 159.528C160.153 159.528 167.976 148.734 180.947 123.281C183.879 117.529 186.351 112.896 186.441 112.986C186.532 113.075 186.406 114.492 186.162 116.134C185.413 121.161 185.156 133.687 185.705 138.355C187.241 151.408 192.252 159.528 198.771 159.528C199.722 159.528 201.203 159.172 202.062 158.737C205.442 157.025 213.467 147.451 219.528 137.896C221.12 135.387 222.679 133.333 222.992 133.333C223.614 133.333 223.881 134.367 224.613 139.615C225.558 146.387 228.198 152.821 231.347 156.03C233.64 158.366 235.699 159.259 239.247 159.454C241.963 159.603 242.469 159.497 245.182 158.214C249.036 156.392 254.131 152.551 257.587 148.862C260.72 145.517 265.276 139.588 267.022 136.582L268.202 134.552L268.438 139.425C268.719 145.196 269.275 147.776 271.064 151.608C273.463 156.744 276.75 159.528 280.414 159.528C282.823 159.528 284.637 158.734 289.279 155.651C294.724 152.035 299.14 148.293 306.356 141.183C310.32 137.277 312.655 135.248 312.774 135.609C312.876 135.921 313.045 138.095 313.15 140.44C313.634 151.236 319.649 159.528 326.998 159.528C332.686 159.528 339.347 155.089 352.154 142.766L355.888 139.172L356.067 143.969C356.223 148.135 356.398 149.099 357.4 151.297C360.234 157.522 367.453 160.941 373.529 158.938C378.321 157.359 386.143 150.948 391.886 143.892C401.645 131.902 411.992 112.658 420.664 90.3664C423.496 83.0864 423.829 82.6145 425.897 82.9637C430.417 83.726 433.083 84.6292 433.852 85.6583L434.644 86.717L431.549 98.2478C421.66 135.107 420.334 145.638 424.551 153.842C426.462 157.559 429.163 159.121 433.675 159.121C444.442 159.121 460.718 145.739 473.682 126.226C483.332 111.702 485.739 101.505 480.58 97.0108C478.906 95.5521 477.669 95.1837 475.442 95.4802C472.918 95.816 472.376 96.5499 472.114 99.9864C471.25 111.32 457.267 135.882 446.936 144.213C443.238 147.195 441.693 147.955 440.46 147.397C439.184 146.821 438.91 145.483 439.209 141.302C439.624 135.501 440.728 130.669 444.928 116.276C448.954 102.48 450.296 95.3551 450.049 89.0916C449.918 85.7619 449.691 84.5805 448.819 82.7091C446.48 77.6895 442.424 75.4506 436.843 76.0992C433.141 76.5293 426.913 76.567 425.477 76.1678C423.964 75.7475 423.574 74.8654 422.881 70.2841C421.367 60.2746 417.923 52.675 412.828 48.0997C407.724 43.5163 402.606 41.9377 398.791 43.7701C396.629 44.8085 394.475 47.231 393.15 50.1124C391.877 52.8821 391.894 58.404 393.186 61.7134C395.906 68.686 402.453 74.9629 409.907 77.746C411.429 78.3145 412.726 78.8299 412.788 78.8912C413.043 79.1434 410.708 89.1667 409.208 94.2574C403.619 113.223 394.09 129.9 381.944 141.971C375.286 148.589 372.261 149.972 371.179 146.892C370.583 145.195 371.11 143.011 374.196 134.392C381.453 114.12 382.348 110.22 380.574 106.584C379.315 104.003 376.774 101.555 374.062 100.31C372.182 99.4479 371.125 99.2456 368.435 99.2339C364.181 99.2156 363.875 99.4646 363.832 102.986C363.743 110.062 359.303 120.118 351.777 130.287C348.203 135.117 338.635 144.676 335.157 146.892C332.404 148.646 330.304 149.048 329.42 147.991C327.183 145.316 328.844 133.191 333.265 119.931C339.706 100.609 348.451 86.9225 357.032 82.7343C359.624 81.4684 360.128 81.362 362.942 81.4851C371.03 81.8388 371.339 81.8193 371.339 80.9608C371.339 79.8858 369.66 78.836 364.35 76.5902C356.8 73.3969 353.201 72.4848 348.01 72.4478C343.748 72.4178 343.389 72.4811 341.269 73.6345C338.347 75.2244 334.048 79.2632 330.99 83.2903C326.357 89.3905 320.176 100.659 316.737 109.274C312.81 119.11 302.257 135.631 294.79 143.635C283.672 155.551 280.403 144.912 287.647 120.384C288.512 117.455 291.34 108.986 293.931 101.565C307.121 63.7935 314.297 35.9317 314.408 22.0581C314.448 16.9114 314.416 16.7091 313.129 14.0109C310.775 9.08029 303.536 3.37683 299.632 3.37683C297.259 3.37683 295.643 4.92128 295.711 7.12242C295.987 16.0045 295.806 24.05 295.222 28.962C292.55 51.4091 283.478 81.4684 270.7 110.207C263.759 125.821 251.769 143.75 245.498 147.894C244.005 148.881 242.752 148.73 241.916 147.462C240.907 145.933 240.94 135.86 241.972 130.084C245.275 111.612 252.533 94.752 260.56 86.9051C265.059 82.5069 270.165 80.5705 274.819 81.4977C278.304 82.1925 279.457 82.1125 279.457 81.1772C279.457 80.7464 278.993 80.0324 278.426 79.5902C276.577 78.1464 270.255 75.1111 266.321 73.7783C262.989 72.6489 261.895 72.4698 258.175 72.445C254.031 72.4174 253.785 72.4657 251.288 73.8091C242.73 78.4132 233.908 93.0751 226.835 114.449C225.277 119.159 224.44 120.988 222.658 123.586C216.945 131.915 208.942 140.961 206.819 141.49C201.839 142.73 201.179 127.839 205.179 104.499C207.538 90.7315 207.939 89.5355 212.762 81.8745C218.397 72.925 230.997 54.7831 237.101 46.831C250.669 29.1557 257.356 16.5309 257.356 8.5893C257.356 4.58055 256.279 2.68765 253.059 1.03761C251.791 0.387832 250.498 0.172187 247.329 0.0816238C245.078 0.0170518 242.5 0.123046 241.599 0.316356ZM246.228 7.51391C246.498 10.2832 241.688 19.7696 233.706 32.2109C227.233 42.2996 217.36 56.2159 216.959 55.8175C216.707 55.5681 219.396 45.5257 221.181 40.0444C226.817 22.7452 234.52 10.4513 241.867 7.02576C244.795 5.66041 246.06 5.80214 246.228 7.51391ZM170.308 43.5955C167.238 45.1135 165.386 48.148 164.692 52.7992C164.102 56.7548 165.868 59.49 170.254 61.4121C176.724 64.2476 181.393 62.5683 183.645 56.5956C184.64 53.9571 184.781 50.0978 183.954 48.1379C183.128 46.1808 180.364 43.9228 177.907 43.1987C174.834 42.2931 172.719 42.4035 170.308 43.5955ZM411.59 58.1283C412.395 59.0912 412.916 62.6459 412.795 66.348L412.675 69.9795L411.577 67.0839C410.3 63.72 409.452 59.5265 409.816 58.3861C410.109 57.472 410.94 57.3514 411.59 58.1283ZM403.262 173.173C369.248 174.3 346.988 176.488 298.283 183.492C244.273 191.258 190.959 198.004 157.289 201.329C129.686 204.056 112.487 205.062 93.4424 205.064C79.4486 205.065 71.5198 204.664 64.0051 203.572C58.9674 202.84 59.2682 202.827 59.2682 203.778C59.2682 204.733 60.2742 205.037 67.249 206.193C82.0929 208.652 93.7911 209.23 123.083 208.953C161.004 208.595 190.63 206.581 261.992 199.511C274.333 198.289 295.421 196.278 308.853 195.043C336.577 192.493 347.372 191.355 376.045 187.957C419.836 182.767 431.247 181.748 446.031 181.706C456.965 181.676 459.738 181.927 464.178 183.349C466.8 184.19 468.83 186.005 469.37 187.992C470.184 190.995 471.728 189.486 471.192 186.212C470.75 183.518 467.225 180.328 462.829 178.646C456.487 176.219 448.06 174.641 436.822 173.776C431.072 173.333 409.911 172.953 403.262 173.173Z" fill="black"/>
</svg>
