<svg width="190" height="100" viewBox="0 0 190 100" fill="none" xmlns="http://www.w3.org/2000/svg">
<path fill-rule="evenodd" clip-rule="evenodd" d="M100.54 0.143959C131.523 -0.800676 166.515 2.7151 183.461 16.3124C199.458 29.1469 181.959 44.9022 174.847 59.7638C168.049 73.9686 169.58 92.1216 144.214 98.322C118.956 104.496 93.5322 92.1097 68.4152 85.7795C43.3138 79.4533 10.9422 76.4823 2.4742 62.5997C-6.45521 47.9607 10.2701 32.8995 28.9162 21.0242C47.1657 9.40152 71.831 1.01924 100.54 0.143959Z" fill="#2F2D2F"/>
</svg>
