<svg width="60" height="950" viewBox="0 0 60 950" fill="none" xmlns="http://www.w3.org/2000/svg">
<path d="M0 0L43.4476 7.60333C53.0178 9.27811 60 17.5883 60 27.3039V922.196C60 931.912 53.0178 940.222 43.4476 941.897L1.8963e-10 949.5L0 0Z" fill="white"/>
</svg>
