<svg width="48" height="48" viewBox="0 0 48 48" fill="none" xmlns="http://www.w3.org/2000/svg">
<path opacity="0.9" d="M2.39251 24.546C2.44789 24.7675 2.52174 24.8475 2.76789 24.9675C3.13405 25.1429 8.25712 26.3122 8.64482 26.3091C8.92174 26.306 9.09712 26.1398 9.13712 25.8414C9.1802 25.5245 8.98635 25.3337 8.52174 25.2414C7.55866 25.0506 5.48789 24.5798 5.48174 24.5491C5.47251 24.5091 8.11251 24.0845 9.04482 23.9768C10.0264 23.8629 10.2017 23.8045 10.3617 23.5368C10.5525 23.2168 10.4756 22.906 10.1556 22.7152C9.90943 22.5675 9.59866 22.5706 8.61097 22.7306L8.29405 22.7829L8.57712 22.5829C8.78636 22.4352 8.89712 22.306 9.00174 22.0814C9.1802 21.706 9.11866 21.4783 8.79558 21.2845C8.51251 21.1152 8.23251 21.1829 6.84482 21.7552C5.60789 22.2629 5.39558 22.3706 3.78635 23.2752C2.43866 24.0291 2.29712 24.1583 2.39251 24.546Z" fill="#2F2D2F"/>
<path opacity="0.9" d="M11.013 23.1674C11.0499 23.4536 11.3238 23.7028 11.5915 23.6936C11.7022 23.6905 12.1453 23.6413 12.5915 23.5828C13.0315 23.5274 13.7545 23.4536 14.1915 23.4198C14.6284 23.3859 15.0315 23.3274 15.0807 23.2874C15.6038 22.8721 15.3699 22.0936 14.7084 22.0536C14.3791 22.0321 11.4745 22.4751 11.3115 22.5705C11.093 22.6967 10.9822 22.9213 11.013 23.1674Z" fill="#2F2D2F"/>
<path opacity="0.9" d="M16.5681 22.4878C16.5374 22.7371 16.6912 23.0509 16.9158 23.1832C17.0789 23.2786 17.365 23.2601 18.9558 23.0478C20.5897 22.8294 20.7773 22.774 20.9589 22.4694C21.2266 22.0232 20.9558 21.5524 20.3743 21.4478C20.1527 21.4078 19.5035 21.4786 18.0727 21.694C16.8143 21.8878 16.6327 21.9832 16.5681 22.4878Z" fill="#2F2D2F"/>
<path opacity="0.9" d="M22.1819 22.0353C22.1665 22.1645 22.1942 22.3491 22.2465 22.4599C22.428 22.8384 22.6157 22.8784 24.0065 22.8353C24.7172 22.8137 25.4742 22.7984 25.6834 22.8014C26.2526 22.8107 26.5542 22.703 26.7142 22.4384C26.8988 22.1276 26.8311 21.8138 26.5296 21.583C26.228 21.3553 25.6988 21.3153 23.9296 21.3861C22.5019 21.4445 22.2465 21.5399 22.1819 22.0353Z" fill="#2F2D2F"/>
<path opacity="0.9" d="M28.8099 22.5709C28.8253 22.6909 28.9207 22.8786 29.0192 22.9863C29.1946 23.1771 29.2499 23.1894 30.8715 23.3833C32.7792 23.6109 33.0807 23.5894 33.3084 23.2109C33.4222 23.0233 33.4376 22.9156 33.3853 22.7063C33.2653 22.2263 33.0192 22.1402 31.1392 21.9125C30.1269 21.7894 29.4284 21.7433 29.293 21.7863C29.0038 21.8786 28.7699 22.2602 28.8099 22.5709Z" fill="#2F2D2F"/>
<path opacity="0.9" d="M35.1226 23.9155C35.2118 24.2724 35.4395 24.3986 36.1626 24.4939C36.4795 24.537 37.2518 24.6632 37.8795 24.777C38.5103 24.8909 39.1164 24.9616 39.2303 24.9339C39.9134 24.7709 39.9657 23.9247 39.3103 23.6447C39.0857 23.5493 36.7811 23.1555 35.9687 23.0755C35.5564 23.0355 35.3657 23.1247 35.1718 23.4509C35.0887 23.5955 35.0734 23.7278 35.1226 23.9155Z" fill="#2F2D2F"/>
<path opacity="0.9" d="M41.1953 25.1308C41.2415 25.2478 41.3369 25.3739 41.4138 25.4201C41.5338 25.4908 44.2753 26.5832 44.7615 26.7555C45.2353 26.9216 45.7307 26.4939 45.6107 26.0201C45.5399 25.7432 45.4353 25.6785 44.5984 25.417C44.2261 25.3001 43.4446 25.0262 42.8476 24.8047C41.623 24.3493 41.4599 24.3401 41.2415 24.7032C41.143 24.8724 41.1338 24.9708 41.1953 25.1308Z" fill="#2F2D2F"/>
</svg>
