<svg width="34" height="34" viewBox="0 0 34 34" fill="none" xmlns="http://www.w3.org/2000/svg">
<g opacity="1">
<path d="M11.0447 25.8652L8.11133 27.074V15.2222L28.2595 6.9259V11.1724" stroke="#0057A5" stroke-miterlimit="10" stroke-linecap="round" stroke-linejoin="round"/>
<path d="M28.2593 6.92593L21.1481 1L1 9.2963V21.1481L8.11111 27.0741" stroke="#0057A5" stroke-miterlimit="10" stroke-linecap="round" stroke-linejoin="round"/>
<path d="M8.11111 15.2222L1 9.29626" stroke="#0057A5" stroke-miterlimit="10" stroke-linecap="round" stroke-linejoin="round"/>
<path d="M30.63 15.2222L33.0003 25.8888C33.0003 25.8888 18.8599 32.5899 17.5929 33L14.0374 30.6296L11.667 19.9629L15.2225 22.3333C16.4895 21.9232 30.63 15.2222 30.63 15.2222ZM30.63 15.2222L27.0744 12.8518C27.0744 12.8518 12.934 19.5528 11.667 19.9629" stroke="#0057A5" stroke-miterlimit="10" stroke-linecap="round" stroke-linejoin="round"/>
<path d="M15.2217 22.3334L17.5921 33" stroke="#0057A5" stroke-miterlimit="10" stroke-linecap="round" stroke-linejoin="round"/>
<path d="M7.51837 11.0741C7.84565 11.0741 8.11097 10.8088 8.11097 10.4815C8.11097 10.1542 7.84565 9.88892 7.51837 9.88892C7.19109 9.88892 6.92578 10.1542 6.92578 10.4815C6.92578 10.8088 7.19109 11.0741 7.51837 11.0741Z" fill="#0057A5"/>
<path d="M12.2596 8.70374C12.5869 8.70374 12.8522 8.43843 12.8522 8.11115C12.8522 7.78387 12.5869 7.51855 12.2596 7.51855C11.9323 7.51855 11.667 7.78387 11.667 8.11115C11.667 8.43843 11.9323 8.70374 12.2596 8.70374Z" fill="#0057A5"/>
<path d="M17.5926 9.29627C17.9199 9.29627 18.1852 9.03096 18.1852 8.70368C18.1852 8.3764 17.9199 8.11108 17.5926 8.11108C17.2653 8.11108 17 8.3764 17 8.70368C17 9.03096 17.2653 9.29627 17.5926 9.29627Z" fill="#0057A5"/>
<path d="M19.9627 5.1482C20.29 5.1482 20.5553 4.88289 20.5553 4.55561C20.5553 4.22833 20.29 3.96301 19.9627 3.96301C19.6354 3.96301 19.3701 4.22833 19.3701 4.55561C19.3701 4.88289 19.6354 5.1482 19.9627 5.1482Z" fill="#0057A5"/>
<path d="M3.37091 16.4074C3.69819 16.4074 3.96351 16.142 3.96351 15.8148C3.96351 15.4875 3.69819 15.2222 3.37091 15.2222C3.04363 15.2222 2.77832 15.4875 2.77832 15.8148C2.77832 16.142 3.04363 16.4074 3.37091 16.4074Z" fill="#0057A5"/>
<path d="M5.14826 21.7407C5.47554 21.7407 5.74085 21.4754 5.74085 21.1481C5.74085 20.8209 5.47554 20.5555 5.14826 20.5555C4.82098 20.5555 4.55566 20.8209 4.55566 21.1481C4.55566 21.4754 4.82098 21.7407 5.14826 21.7407Z" fill="#0057A5"/>
<path d="M11.6668 17.5927C11.9941 17.5927 12.2594 17.3273 12.2594 17.0001C12.2594 16.6728 11.9941 16.4075 11.6668 16.4075C11.3395 16.4075 11.0742 16.6728 11.0742 17.0001C11.0742 17.3273 11.3395 17.5927 11.6668 17.5927Z" fill="#0057A5"/>
<path d="M18.7781 14.6296C19.1054 14.6296 19.3707 14.3643 19.3707 14.0371C19.3707 13.7098 19.1054 13.4445 18.7781 13.4445C18.4509 13.4445 18.1855 13.7098 18.1855 14.0371C18.1855 14.3643 18.4509 14.6296 18.7781 14.6296Z" fill="#0057A5"/>
<path d="M28.2596 21.7407C28.5869 21.7407 28.8522 21.4754 28.8522 21.1481C28.8522 20.8209 28.5869 20.5555 28.2596 20.5555C27.9323 20.5555 27.667 20.8209 27.667 21.1481C27.667 21.4754 27.9323 21.7407 28.2596 21.7407Z" fill="#0057A5"/>
<path d="M25.2967 26.4815C25.624 26.4815 25.8893 26.2161 25.8893 25.8889C25.8893 25.5616 25.624 25.2963 25.2967 25.2963C24.9694 25.2963 24.7041 25.5616 24.7041 25.8889C24.7041 26.2161 24.9694 26.4815 25.2967 26.4815Z" fill="#0057A5"/>
<path d="M19.9627 25.2963C20.29 25.2963 20.5553 25.031 20.5553 24.7037C20.5553 24.3764 20.29 24.1111 19.9627 24.1111C19.6354 24.1111 19.3701 24.3764 19.3701 24.7037C19.3701 25.031 19.6354 25.2963 19.9627 25.2963Z" fill="#0057A5"/>
</g>
</svg>
