<svg width="25" height="34" viewBox="0 0 25 34" fill="none" xmlns="http://www.w3.org/2000/svg">
<path d="M12.6364 32.9998C19.063 32.9998 24.2727 27.79 24.2727 21.3634C24.2727 14.9368 19.063 9.72705 12.6364 9.72705C6.20978 9.72705 1 14.9368 1 21.3634C1 27.79 6.20978 32.9998 12.6364 32.9998Z" stroke="#0057A5" stroke-miterlimit="10"/>
<path d="M12.6355 30.0908C17.4554 30.0908 21.3627 26.1834 21.3627 21.3635C21.3627 16.5436 17.4554 12.6362 12.6355 12.6362C7.81554 12.6362 3.9082 16.5436 3.9082 21.3635C3.9082 26.1834 7.81554 30.0908 12.6355 30.0908Z" stroke="#0057A5" stroke-miterlimit="10"/>
<path d="M12.6367 14.8184V21.3638" stroke="#0057A5" stroke-miterlimit="10"/>
<path d="M12.6367 8.27264V6.09082" stroke="#0057A5" stroke-miterlimit="10"/>
<path d="M11.1816 6.09082H14.0907" stroke="#0057A5" stroke-miterlimit="10"/>
<path d="M22.4549 10.8184L20.6367 12.6365" stroke="#0057A5" stroke-miterlimit="10"/>
<path d="M21.3633 9.72705L23.5451 11.9089" stroke="#0057A5" stroke-miterlimit="10"/>
<path d="M12.6371 9.72727C15.047 9.72727 17.0007 7.77361 17.0007 5.36364C17.0007 2.95367 15.047 1 12.6371 1C10.2271 1 8.27344 2.95367 8.27344 5.36364C8.27344 7.77361 10.2271 9.72727 12.6371 9.72727Z" stroke="#0057A5" stroke-miterlimit="10"/>
</svg>
