<?xml version="1.0" encoding="UTF-8"?>

<svg xmlns="https://www.w3.org/2000/svg" viewBox="0 0 513 342">
<rect y="0" fill="#ffc72c" width="513" height="342"/>
<g>
	<rect y="0" fill="#00778b" width="513" height="114"/>
	<rect y="228" fill="#00778b" width="513" height="114"/>
</g>
<polygon points="256,171 0,342 0,0 "/>
</svg>
