<?xml version="1.0" encoding="UTF-8"?>

<svg xmlns="https://www.w3.org/2000/svg" viewBox="85.333 85.333 341.333 341.333">
<g>
	<rect y="85.337" fill="#FFFFFF" width="512" height="341.326"/>
	<rect y="85.337" fill="#FFFFFF" width="512" height="170.663"/>
</g>
<rect y="256" fill="#D80027" width="512" height="170.663"/>
</svg>
