<?xml version="1.0" encoding="UTF-8"?>

<svg xmlns="https://www.w3.org/2000/svg" viewBox="5.13 0 342 342">
	<rect y="0" fill="#11457e" width="513" height="342"/>
	<polygon fill="#d7141a" points="513,171 513,342 0,342 215,171 "/>
	<polygon fill="#FFFFFF" points="513,0 513,171 215.185,171 0,0 "/>
</svg>
