<?xml version="1.0" encoding="UTF-8"?>

<svg xmlns="https://www.w3.org/2000/svg" viewBox="85.333 85.333 341.333 341.333">
<rect y="85.331" fill="#338AF3" width="512" height="341.337"/>
<polygon fill="#FFFFFF" points="256,157.273 278.663,227.021 352,227.021 292.668,270.127 315.332,339.876 256,296.769   196.668,339.876 219.332,270.127 160,227.021 233.337,227.021 "/>
</svg>
