<?xml version="1.0" encoding="utf-8"?>
<svg version="1.1" xmlns="https://www.w3.org/2000/svg" viewBox="85.5 0 342 342">
<rect y="0" fill="#0052B4" width="513" height="342"/>
<g fill="#D80027">
	<rect y="0.1" width="513" height="90.7"/>
	<rect x="0" y="251.3" width="513" height="90.7"/>
</g>
<circle fill="#FFFFFF" cx="256.5" cy="171" r="65.9"/>
</svg>
