<?xml version="1.0" encoding="UTF-8"?>

<svg xmlns="https://www.w3.org/2000/svg" viewBox="0 85.333 512 341.333">
<rect y="85.331" fill="#FFDA44" width="512" height="341.326"/>
<rect x="330.207" y="85.331" fill="#D80027" width="181.793" height="341.337"/>
<g>
	<rect y="85.331" fill="#496E2D" width="181.793" height="341.337"/>
	<polygon fill="#496E2D" points="255.999,196.632 270.732,241.979 318.417,241.979 279.841,270.008 294.575,315.356    255.999,287.33 217.422,315.356 232.159,270.008 193.583,241.979 241.264,241.979  "/>
</g>
</svg>
