<?xml version="1.0" encoding="UTF-8"?>

<svg xmlns="https://www.w3.org/2000/svg" viewBox="0 85.333 512 341.333">
<rect y="85.331" fill="#FFFFFF" width="512" height="341.337"/>
<rect y="196.636" fill="#A2001D" width="512" height="118.728"/>
<g>
	<rect y="352.462" fill="#6DA544" width="512" height="74.207"/>
	<rect y="85.331" fill="#6DA544" width="512" height="74.207"/>
</g>
<polygon fill="#FFDA44" points="256.742,218.003 266.172,247.024 296.69,247.024 272,264.963 281.431,293.986   256.742,276.049 232.053,293.986 241.484,264.963 216.794,247.024 247.312,247.024 "/>
</svg>
