<?xml version="1.0" encoding="UTF-8"?>
<svg xmlns="https://www.w3.org/2000/svg" viewBox="85.5 0 342 342">
<rect y="0" fill="#FFFFFF" width="512" height="342"/>
<rect y="0" fill="#338AF3" width="512" height="114"/>
<rect y="228" fill="#338AF3" width="512" height="114"/>
<circle fill="#FFDA44" stroke="#d6ab00" stroke-width="5" cx="256.5" cy="171" r="40"/>
</svg>
