<?xml version="1.0" encoding="UTF-8"?>

<svg xmlns="https://www.w3.org/2000/svg" viewBox="0 0 513 342">
<rect y="0" fill="#FFFFFF" width="513" height="342"/>
<g fill="#6da9d2">
	<rect y="238" width="513" height="104"/>
	<rect y="0" width="513" height="104"/>
</g>
<rect y="125.5" width="513" height="89.656"/>
</svg>
