<?xml version="1.0" encoding="UTF-8"?>

<svg xmlns="https://www.w3.org/2000/svg" viewBox="0 0 342 342">
<rect y="0" fill="#FFFFFF" width="513" height="342"/>
<rect y="0" width="513" height="114"/>
<rect y="228" fill="#6DA544" width="513" height="114"/>
<polygon fill="#D80027" points="256.5,170.7 0,341.3 0,0 "/>
<polygon fill="#FFFFFF" points="77.9,139.5 85.8,155.9 103.6,151.8 95.6,168.3 109.9,179.6 92.1,183.6 92.2,201.9 77.9,190.4
	63.7,201.9 63.7,183.6 45.9,179.6 60.2,168.3 52.3,151.8 70,155.9 "/>
</svg>
