<?xml version="1.0" encoding="UTF-8"?>

<svg xmlns="https://www.w3.org/2000/svg" viewBox="0 0 513 342">
<rect y="0" fill="#FFDA44" width="513" height="342"/>
<rect y="0" fill="#6DA544" width="513" height="114"/>
<rect y="228" fill="#0052B4" width="513" height="114"/>
</svg>
