<?xml version="1.0" encoding="UTF-8"?>

<svg xmlns="https://www.w3.org/2000/svg" viewBox="85.333 85.333 341.333 341.333">
<rect y="85.331" fill="#f7ce00" width="512" height="341.326"/>
<rect y="85.331" fill="#e32737" width="512" height="85.337"/>
<rect y="170.657" fill="#191f6a" width="512" height="85.337"/>
<rect y="341.331" fill="#00a04e" width="512" height="85.337"/>
</svg>
