<?xml version="1.0" encoding="UTF-8"?>

<svg xmlns="https://www.w3.org/2000/svg" viewBox="0 85.333 512 341.333">
<rect y="85.331" fill="#FFFFFF" width="512" height="341.337"/>
<rect y="85.331" fill="#D80027" width="512" height="113.775"/>
<rect y="312.882" width="512" height="113.775"/>
<g>
	<polygon fill="#6DA544" points="187.31,215.184 196.518,243.525 226.32,243.525 202.21,261.043 211.419,289.385    187.31,271.869 163.2,289.385 172.409,261.043 148.3,243.525 178.101,243.525  "/>
	<polygon fill="#6DA544" points="324.69,215.184 333.899,243.525 363.7,243.525 339.591,261.043 348.8,289.385    324.69,271.869 300.581,289.385 309.79,261.043 285.68,243.525 315.482,243.525  "/>
</g>
</svg>
