<?xml version="1.0" encoding="UTF-8"?>
<svg xmlns="https://www.w3.org/2000/svg" viewBox="85.5 0 342 342">
<rect fill="#FFDA44" width="512" height="342"/>
<rect x="342" fill="#6DA544" width="171" height="342"/>
<rect fill="#D80027" width="171" height="342"/>
</svg>
