<?xml version="1.0" encoding="UTF-8"?>

<svg xmlns="https://www.w3.org/2000/svg" viewBox="0 85.333 512 341.333">
<rect y="85.331" fill="#d01920" width="512" height="341.333"/>
<rect x="144.696" y="174.375" fill="#017c3b" width="222.609" height="163.25"/>
<path fill="#FFFFFF" d="M283.484,304.226c-26.637,0-48.232-21.594-48.232-48.232s21.594-48.232,48.232-48.232  c8.306,0,16.12,2.1,22.943,5.797c-10.703-10.467-25.341-16.927-41.494-16.927c-32.784,0-59.362,26.577-59.362,59.362  s26.578,59.362,59.362,59.362c16.154,0,30.791-6.461,41.494-16.927C299.605,302.127,291.791,304.226,283.484,304.226z"/>
</svg>
