<?xml version="1.0" encoding="UTF-8"?>

<svg xmlns="https://www.w3.org/2000/svg" viewBox="85.333 85.333 341.333 341.333">
<rect y="85.337" fill="#FFDA44" width="512" height="341.326"/>
<g>
	<rect y="85.337" fill="#6DA544" width="512" height="113.775"/>
	<rect y="312.888" fill="#6DA544" width="512" height="113.775"/>
</g>
<polygon fill="#D80027" points="256,256.006 0,426.668 0,85.331 "/>
<polygon points="302.049,226.318 309.417,248.992 333.259,248.992 313.971,263.008 321.337,285.682 302.049,271.667   282.762,285.682 290.128,263.008 270.84,248.992 294.682,248.992 "/>
<polygon points="376.252,226.318 383.619,248.992 407.461,248.992 388.173,263.008 395.54,285.682 376.252,271.667 356.964,285.682   364.331,263.008 345.043,248.992 368.885,248.992 "/>
</svg>
