{
  "ACTIVAR_SERVICIOS_MOODLE": 0,
  "ACTIVAR_SERVICIOS_FACTURACION": 0,
  "URL_IDIOMAS": "",
  "URL_ACADSIS": "http://127.0.0.1:8080",
  "URL_MOODLE": "http://localhost/moodle",
  "URL_FACTURACION":"http://publicacion.cloudapp.net:8080",
  "TOKEN_FACTURACION":"Qjc3NTM1QUE1MjQyNDVBNzhFQkUyNzA3QzRDREQzOUE6VURMMjAxOCo=",
  "TOKEN_MOODLE": "",
  "TIME_ZONE": "America/Lima",
  "LANGUAGE_CODE": "es-PE",
  "SECRET_KEY": "jcxw@ac_rkrm=r9pld6h7imz375wihv=7f+tm&u3^r02gk0dm!",
  "DB": {
    "default": {
      "ENGINE": "django.db.backends.mysql",
      "NAME": "acadsis",
      "USER": "root",
      "PASSWORD": "root",
      "HOST": "172.17.0.3",
      "PORT": ""
    },
    "escuelapre": {
      "ENGINE": "django.db.backends.mysql",
      "NAME": "escuelapre",
      "USER": "root",
      "PASSWORD": "root",
      "HOST": "172.17.0.3",
      "PORT": ""
    },
    "moodle": {
      "ENGINE": "django.db.backends.mysql",
      "NAME": "udl_com_pe",
      "USER": "root",
      "PASSWORD": "root",
      "HOST": "172.17.0.3",
      "PORT": ""
    },
    "campus": {
      "ENGINE": "django.db.backends.mysql",
      "NAME": "campusudl",
      "USER": "root",
      "PASSWORD": "root",
      "HOST": "172.17.0.3",
      "PORT": ""
    },
    "idiomas": {
      "ENGINE": "django.db.backends.mysql",
      "NAME": "idiomas",
      "USER": "root",
      "PASSWORD": "root",
      "HOST": "172.17.0.3",
      "PORT": ""
    }
  },
  "AUTH_PASSWORD_VALIDATORS": [
    {
      "NAME": "django.contrib.auth.password_validation.UserAttributeSimilarityValidator"
    },
    {
      "NAME": "django.contrib.auth.password_validation.CommonPasswordValidator"
    },
    {
      "NAME": "django.contrib.auth.password_validation.NumericPasswordValidator"
    }
  ],
  "SECURITY": {
    "ALLOWED_HOSTS": [
      "localhost"
    ]
  },
  "DEBUG": true,
  "URL_SERVER": "http://localhost:8000",
  "DEFAULT_URL_USERPROFILE": "/static/img/user-default.jpg",
  "EMAIL": {
    "EMAIL_USE_TLS": true,
    "EMAIL_HOST": "smtp.gmail.com",
    "EMAIL_PORT": 587,
    "EMAIL_BACKEND": "django.core.mail.backends.smtp.EmailBackend",
    "EMAIL_HOST_USER": "demo@demo.com",
    "EMAIL_HOST_PASSWORD": "password",
    "DEFAULT_FROM_EMAIL": "demo.server.com",
    "CONTACT_EMAIL": "demo@demo.com"
  }
}