;PRIMER SEMESTRE;;;
EG 0101;Matemática I;Ning.;4;01
EG 0102;Taller de Comunicación;Ning.;3;01
IS 0101;Ecologia General;Ning.;3;01
EG 0103;Metodología del Trabajo Universitario;Ning.;3;01
IS 0102;Introducción a la Ing. De Sistemas;Ning.;4;01
EG 0106;Filososfia y Logica;Ning.;3;01
;SEGUNDO SEMESTRE;;;
EG 0201;Matemática II;EG 0101;4;02
IS 0201;Analisis Ambiental;IS 0101;4;02
EG 0206;Teoría Económica;Ning.;4;02
EG 0205;Informática Aplicada;Ning.;3;02
EG 0207;Constitución Política, Desarrollo y Defensa Nacional;Ning.;3;02
EG 0208;Actividades;Ning.;2;02
;TERCER SEMESTRE;;;
EG 0301;Análisis Matemático I;EG 0201;4;03
IS 0301;Herramientas y Lenguajes de Programación;EG 0205;4;03
IS 0302;Circuitos Lógicos;Ning.;4;03
IS 0303;Diseño Gráfico;EG 0205;4;03
IS 0304;Sicología General;Ning.;4;03
;CUARTO SEMESTRE;;;
EG 0401;Física I;EG 0301;4;04
IS 0401;Programación I;IS 0301;4;04
IS 0402;Arquitectura del Computador;IS 0302;3;04
IS 0403;Teoria General de Sistemas;Ning.;3;04
EG0305;Creatividad e Innovación;IS 0304;3;04
IS 0405;Inglés Técnico I;Ning.;3;04
;QUINTO SEMESTRE;;;
EG 0501;Fisica II;EG 0401;4;05
IS 0501;Programación II;IS 0401;4;05
IS 0502;Algoritmos y Estructura de Datos;IS 0401|IS 0402;3;05
IS 0503;Sistemas Operativos;IS 0402;3;05
IS 0504;Economía General ;Ning.;3;05
IS 0505;Inglés Técnico II;IS 0405;3;05
;SEXTO SEMESTRE;;;
EG 0303;Estadística I;EG 0301;3;06
IS 0601;Ingenieria de Control;IS 0501;3;06
IS 0602;Base de Datos I;IS 0502|IS 0503;4;06
IS 0603;Administración y Planificación;Ning.;4;06
IS 0604;Contabilidad General;IS 0504;3;06
IS 0605;Inglés Técnico III;IS 0505;3;06
;SÉPTIMO SEMESTRE;;;
EG 0403;Estadística II y Probabilidades;EG 0303;3;07
IS 0701;Ingeniería de Software I;IS 0601;4;07
IS 0702;Base de Datos II;IS 0602;4;07
IS 0703;Presupuestos y Costos;IS 0603|IS 0604;3;07
IS 0704;Finanzas de Empresas I;IS 0604;3;07
IS 0705;Cultura Organizacional;Ning.;3;07
;OCTAVO SEMESTRE;;;
IS 0801;Proyectos de Ingenieria de Sistemas I;IS0701;3;08
IS 0802;Ingeniería de Software II;IS0701;4;08
IS 0803;Transmisión de Datos;IS 0602;4;08
IS 0804;Marketing;IS 0704;3;08
IS 0805;Finanzas de Empresas II;IS0 704;3;08
IS 0806;Gestion del Conocimiento;Ning.;3;08
;NOVENO SEMESTRE;;;
IS0901; Proyectos de Ingenieria de Sistemas II;IS0801;4;09
IS0902;Planeamiento de Tecnología de Información;IS0802;4;09
IS0903;Redes ;IS0803;4;09
IS0904;Seminario de Tesis I;Ning.;4;09
IS0905;Bioingeniería;Ning.;3;09
IS0906;Electivo;Ning.;3;09
;DÉCIMO SEMESTRE;;;
IS1001;Formulación y Evaluación de Proyectos de Sistemas;IS0901;4;10
IS1002;Auditoría de Tecnología de Información ;IS0902;4;10
IS1003;Electivo;Ning.;4;10
IS 1004;Seminario de Tesis II;IS0904;4;10
IS 1005;Prácticas Pre Profesionales;IS0904;4;10
;Cursos Electivos;;;
IS 0906-1;E-Business;Ning.;3;09;IS0906
IS 0906-2;Automatización y robotización;IS 0903;3;09;IS0906
IS 0906-3;Tópicos de Tecnología de Información;Ning.;3;09;IS0906
IS 1003- 1;Calidad de Sistemas de Información;Ning.;3;10;IS1003
IS 1003- 2;Innovación de Procesos;Ning.;3;10;IS1003
IS 1003- 3;Simulación de Sistemas;IS 0802;3;10;IS1003
