100001J,CATEGORIA C
100003B,CATEGORIA C
100004I,CATEGORIA A
100005E,CATEGORIA B
100006A,CATEGORIA D
100008D,CATEGORIA B
100010I,CATEGORIA C
100012A,CATEGORIA C
100013H,CATEGORIA E
100016G,CATEGORIA A
100017C,CATEGORIA E
100018J,CATEGORIA A
100020D,CATEGORIA C
100022G,CATEGORIA A
100023C,CATEGORIA A
100025F,CATEGORIA B
100027I,CATEGORIA B
100028E,CATEGORIA D
100031F,CATEGORIA C
100032B,CATEGORIA A
100034E,CATEGORIA B
100035A,CATEGORIA D
100039G,CATEGORIA D
100040E,CATEGORIA B
100046C,CATEGORIA C
100047J,CATEGORIA F
100049B,CATEGORIA D
100051G,CATEGORIA D
100052C,CATEGORIA B
100053J,CATEGORIA A
101001C,CATEGORIA B
101002J,CATEGORIA A
101004B,CATEGORIA D
101007A,CATEGORIA A
101018C,CATEGORIA E
101025J,CATEGORIA B
101028I,CATEGORIA C
101031J,CATEGORIA C
101032F,CATEGORIA C
101033B,CATEGORIA B
101034I,CATEGORIA C
102001G,CATEGORIA F
102501J,CATEGORIA A
103002G,CATEGORIA A
103501C,CATEGORIA B
104001D,CATEGORIA D
107002A,CATEGORIA A
107012G,CATEGORIA D
107018E,CATEGORIA A
107019A,CATEGORIA B
107025A,CATEGORIA F
107026H,CATEGORIA D
107030E,CATEGORIA B
107031A,CATEGORIA C
107032H,CATEGORIA A
107033D,CATEGORIA B
107035G,CATEGORIA C
107036C,CATEGORIA D
107045B,CATEGORIA B
107046I,CATEGORIA C
107049H,CATEGORIA A
107058G,CATEGORIA D
107060A,CATEGORIA D
107501H,CATEGORIA B
107502D,CATEGORIA C
107504G,CATEGORIA E
107505C,CATEGORIA E
107506J,CATEGORIA B
107510G,CATEGORIA A
107511C,CATEGORIA B
107513F,CATEGORIA C
107517A,CATEGORIA D
107518H,CATEGORIA A
107529J,CATEGORIA E
107530H,CATEGORIA A
107531D,CATEGORIA C
107540C,CATEGORIA B
107541J,CATEGORIA C
107543B,CATEGORIA A
107548D,CATEGORIA B
107557C,CATEGORIA D
107558J,CATEGORIA C
107559F,CATEGORIA C
107566B,CATEGORIA D
107575A,CATEGORIA C
107580E,CATEGORIA C
107582H,CATEGORIA C
107584K,CATEGORIA C
110001B,CATEGORIA B
110003E,BECA 0
110005H,BECA 0
110006D,CATEGORIA B
110007K,BECA 0
110008G,CATEGORIA A
110010A,CATEGORIA C
110013K,CATEGORIA C
110016J,CATEGORIA B
110020G,CATEGORIA A
110021C,CATEGORIA B
110022J,CATEGORIA B
110025I,CATEGORIA D
110027A,CATEGORIA D
110031I,CATEGORIA D
110034H,CATEGORIA B
110037G,CATEGORIA C
110039J,CATEGORIA B
110040H,CATEGORIA C
110044C,CATEGORIA D
110046F,CATEGORIA A
110048I,BECA 0
111001F,CATEGORIA C
111006H,CATEGORIA D
111009G,CATEGORIA C
111019B,CATEGORIA C
111020K,CATEGORIA E
111026I,CATEGORIA B
111029H,CATEGORIA D
111031B,CATEGORIA C
111036D,CATEGORIA C
111039C,CATEGORIA D
111053F,CATEGORIA B
111060B,CATEGORIA D
111065D,CATEGORIA F
111068C,CATEGORIA C
111070H,CATEGORIA B
111088D,CATEGORIA B
111089K,CATEGORIA F
111093H,CATEGORIA D
111099F,CATEGORIA D
111100D,CATEGORIA D
111101K,CATEGORIA B
111105F,CATEGORIA A
111106B,CATEGORIA C
111108E,CATEGORIA E
111110J,CATEGORIA C
111111F,CATEGORIA C
111115A,CATEGORIA B
111116H,CATEGORIA D
111117D,CATEGORIA F
111123D,CATEGORIA B
111124K,CATEGORIA D
111125G,CATEGORIA D
111126C,CATEGORIA B
111127J,CATEGORIA B
113002J,CATEGORIA D
113004B,CATEGORIA A
113503I,CATEGORIA B
113506H,CATEGORIA D
117001H,CATEGORIA B
117002D,CATEGORIA B
117003K,CATEGORIA C
117004G,BECA 0
117005C,CATEGORIA F
117007F,CATEGORIA A
117010G,CATEGORIA C
117012J,CATEGORIA A
117014B,CATEGORIA C
117016E,CATEGORIA A
117018H,CATEGORIA B
117019D,CATEGORIA C
117022E,CATEGORIA D
117025D,CATEGORIA D
117028C,CATEGORIA A
117029J,CATEGORIA A
117030H,CATEGORIA D
117031D,CATEGORIA C
117033G,CATEGORIA A
117035J,CATEGORIA C
117039E,CATEGORIA A
117040C,CATEGORIA B
117043B,CATEGORIA B
117046A,CATEGORIA C
117502G,CATEGORIA B
117504J,CATEGORIA A
117509A,CATEGORIA C
117510J,CATEGORIA A
117511F,CATEGORIA A
117512B,CATEGORIA A
117513I,CATEGORIA D
117517D,CATEGORIA C
117520E,CATEGORIA C
117521A,CATEGORIA C
117522H,CATEGORIA B
117523D,CATEGORIA E
117525G,CATEGORIA B
117526C,CATEGORIA C
117528F,CATEGORIA B
117529B,CATEGORIA D
117533J,CATEGORIA B
117534F,CATEGORIA A
117536I,CATEGORIA C
120001E,CATEGORIA F
120002A,CATEGORIA B
120006G,CATEGORIA C
120008J,CATEGORIA B
120009F,CATEGORIA B
120011K,CATEGORIA A
120012G,CATEGORIA C
120013C,CATEGORIA C
120016B,CATEGORIA C
120017I,CATEGORIA D
120018E,CATEGORIA A
120019A,CATEGORIA D
120020J,CATEGORIA E
120021F,CATEGORIA F
120022B,CATEGORIA C
120023I,CATEGORIA D
120025A,CATEGORIA C
120027D,CATEGORIA A
120028K,CATEGORIA B
120029G,CATEGORIA C
120030E,CATEGORIA D
120031A,CATEGORIA F
120033D,CATEGORIA E
120035G,CATEGORIA E
120038F,CATEGORIA B
120043J,CATEGORIA D
120047E,CATEGORIA D
120048A,CATEGORIA F
120050F,CATEGORIA B
120057K,CATEGORIA A
120059C,CATEGORIA D
120062D,CATEGORIA E
120063K,CATEGORIA D
120068B,CATEGORIA D
120069I,CATEGORIA B
120071C,CATEGORIA C
120074B,BECA 0
120075I,CATEGORIA D
120076E,CATEGORIA D
120078H,CATEGORIA B
120081I,CATEGORIA E
120082E,CATEGORIA B
120085D,CATEGORIA B
120086K,CATEGORIA A
120088C,CATEGORIA C
120091D,CATEGORIA A
120092K,BECA 0
120094C,CATEGORIA D
120095J,BECA 0
120096F,CATEGORIA B
120099E,CATEGORIA C
120100C,CATEGORIA A
120104I,CATEGORIA D
120105E,CATEGORIA C
120108D,CATEGORIA F
120109K,CATEGORIA B
120112A,CATEGORIA C
120115K,CATEGORIA C
120116G,CATEGORIA C
120117C,CATEGORIA C
120119F,CATEGORIA B
120120D,CATEGORIA C
120121K,CATEGORIA B
120122G,CATEGORIA E
120123C,CATEGORIA C
120124J,CATEGORIA A
120125F,CATEGORIA D
120128E,CATEGORIA A
120130J,CATEGORIA C
120131F,CATEGORIA C
120133I,CATEGORIA B
120135A,CATEGORIA B
120139G,CATEGORIA A
120141A,CATEGORIA B
120142H,CATEGORIA B
120146C,CATEGORIA C
120148F,CATEGORIA C
120151G,CATEGORIA D
120152C,CATEGORIA A
120154F,CATEGORIA A
120155B,CATEGORIA D
120156I,CATEGORIA E
120158A,CATEGORIA E
121001I,CATEGORIA E
121009J,CATEGORIA D
121010H,CATEGORIA C
121012K,CATEGORIA D
121015J,CATEGORIA B
121017B,CATEGORIA D
121018I,CATEGORIA C
121019E,CATEGORIA C
121020C,CATEGORIA B
121021J,CATEGORIA C
121024I,CATEGORIA C
121026A,CATEGORIA C
121029K,CATEGORIA A
121030I,CATEGORIA D
121034D,CATEGORIA B
121036G,CATEGORIA B
121041K,CATEGORIA B
121043C,CATEGORIA C
121045F,CATEGORIA C
121049A,CATEGORIA C
121050J,CATEGORIA C
121051F,CATEGORIA C
121056H,CATEGORIA A
121057D,CATEGORIA D
121058K,CATEGORIA D
121062H,CATEGORIA D
121064K,CATEGORIA B
121066C,CATEGORIA C
121068F,CATEGORIA E
121070K,CATEGORIA C
121072C,CATEGORIA C
121074F,CATEGORIA C
121079H,CATEGORIA E
121082I,CATEGORIA A
121084A,CATEGORIA D
121085H,BECA 0
121092D,CATEGORIA D
121094G,CATEGORIA B
121095C,CATEGORIA A
121099I,CATEGORIA A
121103F,CATEGORIA F
122002I,CATEGORIA C
123003I,CATEGORIA B
123501I,CATEGORIA C
124001J,CATEGORIA F
124002F,CATEGORIA A
124003B,CATEGORIA D
126001G,CATEGORIA B
126003J,CATEGORIA C
126004F,CATEGORIA C
127002G,CATEGORIA C
127004J,CATEGORIA A
127005F,CATEGORIA B
127006B,CATEGORIA B
127008E,CATEGORIA C
127011F,CATEGORIA A
127012B,CATEGORIA A
127013I,CATEGORIA B
127014E,CATEGORIA D
127016H,CATEGORIA B
127017D,CATEGORIA D
127018K,CATEGORIA D
127022H,CATEGORIA C
127023D,CATEGORIA C
127025G,CATEGORIA B
127026C,CATEGORIA C
127027J,CATEGORIA B
127029B,CATEGORIA D
127030K,CATEGORIA C
127032C,CATEGORIA B
127034F,CATEGORIA C
127036I,CATEGORIA B
127037E,CATEGORIA C
127039H,CATEGORIA C
127040F,CATEGORIA B
127043E,CATEGORIA C
127044A,CATEGORIA D
127045H,CATEGORIA C
127048G,CATEGORIA F
127050A,CATEGORIA D
127052D,CATEGORIA D
127056J,CATEGORIA C
127501C,CATEGORIA D
127502J,CATEGORIA C
127503F,CATEGORIA C
127509D,CATEGORIA A
127510B,CATEGORIA B
127516K,CATEGORIA C
127519J,CATEGORIA C
127526F,CATEGORIA A
127527B,CATEGORIA C
130014B,CATEGORIA B
130015I,CATEGORIA C
130016E,CATEGORIA C
130017A,CATEGORIA C
130020B,CATEGORIA A
130026K,CATEGORIA C
130027G,CATEGORIA D
130029J,CATEGORIA B
130033G,CATEGORIA B
130036F,CATEGORIA A
130037B,CATEGORIA D
130040C,CATEGORIA A
130043B,CATEGORIA B
130044I,BECA 0
130047H,CATEGORIA B
130049K,CATEGORIA C
130051E,CATEGORIA C
130055K,CATEGORIA C
130060D,CATEGORIA B
130061K,CATEGORIA B
130062G,CATEGORIA B
130067I,CATEGORIA B
130069A,CATEGORIA E
130071F,CATEGORIA A
130072B,CATEGORIA A
130075A,CATEGORIA D
130076H,CATEGORIA D
130077D,CATEGORIA C
130078K,CATEGORIA C
130079G,CATEGORIA C
130080E,CATEGORIA D
130083D,CATEGORIA C
130087J,CATEGORIA A
130090K,CATEGORIA C
130092C,CATEGORIA D
130095B,CATEGORIA A
130096I,CATEGORIA F
130097E,CATEGORIA C
130104A,CATEGORIA C
130107K,CATEGORIA B
130110A,CATEGORIA A
130111H,CATEGORIA C
130112D,CATEGORIA A
130113K,CATEGORIA A
130114G,CATEGORIA A
130115C,CATEGORIA A
130116J,CATEGORIA B
130117F,CATEGORIA A
130118B,CATEGORIA B
130121C,CATEGORIA D
131001A,CATEGORIA B
131005G,CATEGORIA C
131010K,CATEGORIA C
131011G,CATEGORIA C
131016I,CATEGORIA C
131018A,CATEGORIA C
131019H,CATEGORIA D
131021B,CATEGORIA C
131022I,CATEGORIA D
131026D,CATEGORIA C
131027K,CATEGORIA C
131028G,CATEGORIA B
131031H,CATEGORIA D
131032D,CATEGORIA B
131034G,CATEGORIA B
131035C,BECA 0
131036J,CATEGORIA C
131039I,CATEGORIA C
131040G,CATEGORIA D
131041C,CATEGORIA C
131042J,CATEGORIA C
131043F,CATEGORIA A
131046E,CATEGORIA F
131047A,CATEGORIA C
131050B,CATEGORIA B
131051I,CATEGORIA B
131052E,CATEGORIA C
131055D,CATEGORIA B
131056K,CATEGORIA A
131058C,CATEGORIA C
131062K,CATEGORIA B
131065J,CATEGORIA A
131076A,CATEGORIA D
131077H,CATEGORIA C
131078D,CATEGORIA C
131086G,CATEGORIA C
132001E,CATEGORIA B
132501H,CATEGORIA D
132502D,CATEGORIA C
133501A,CATEGORIA C
133502H,CATEGORIA A
137003F,CATEGORIA F
137009D,CATEGORIA B
137013A,CATEGORIA A
137016K,CATEGORIA C
137019J,CATEGORIA C
137021D,CATEGORIA D
137022K,CATEGORIA A
137023G,CATEGORIA B
137024C,CATEGORIA A
137027B,BECA 0
137030C,CATEGORIA C
137033B,CATEGORIA B
137035E,CATEGORIA A
137036A,CATEGORIA D
137037H,CATEGORIA A
137038D,CATEGORIA A
137041E,CATEGORIA B
137043H,CATEGORIA D
137047C,CATEGORIA B
137501F,CATEGORIA C
137504E,CATEGORIA C
137509G,CATEGORIA A
137510E,CATEGORIA D
137512H,CATEGORIA A
137517J,CATEGORIA A
137518F,CATEGORIA B
137519B,CATEGORIA A
137522C,CATEGORIA C
137523J,CATEGORIA B
137525B,CATEGORIA D
137527E,CATEGORIA B
137529H,CATEGORIA C
137530F,CATEGORIA A
137533E,CATEGORIA C
137536D,CATEGORIA D
140008E,CATEGORIA C
140009A,CATEGORIA A
140012B,CATEGORIA F
140014E,CATEGORIA D
140018K,CATEGORIA C
140019G,CATEGORIA C
140020E,CATEGORIA B
140021A,CATEGORIA A
140026C,CATEGORIA C
140031G,CATEGORIA C
140032C,CATEGORIA C
140034F,CATEGORIA C
140036I,CATEGORIA C
140041B,CATEGORIA A
140044A,CATEGORIA C
140046D,CATEGORIA C
140050A,CATEGORIA C
140051H,CATEGORIA A
140053K,CATEGORIA A
140056J,CATEGORIA B
140058B,CATEGORIA C
140059I,CATEGORIA B
140061C,CATEGORIA C
140062J,CATEGORIA B
140067A,CATEGORIA C
140069D,CATEGORIA B
140071I,CATEGORIA B
140074H,BECA 0
140075D,CATEGORIA F
140077G,CATEGORIA A
140078C,CATEGORIA B
140079J,CATEGORIA B
140081D,CATEGORIA C
140082K,CATEGORIA B
140083G,CATEGORIA B
140085J,CATEGORIA B
140086F,CATEGORIA B
140087B,CATEGORIA A
140088I,CATEGORIA A
140089E,CATEGORIA B
140091J,CATEGORIA E
140093B,CATEGORIA C
140096A,CATEGORIA C
140106G,CATEGORIA C
141001D,CATEGORIA A
141003G,CATEGORIA C
141004C,CATEGORIA C
141005J,CATEGORIA A
141006F,CATEGORIA B
141008I,CATEGORIA B
141010C,CATEGORIA C
141012F,CATEGORIA B
141015E,CATEGORIA C
141016A,CATEGORIA C
141017H,BECA 0
141018D,CATEGORIA A
141019K,CATEGORIA C
141020I,CATEGORIA C
141021E,CATEGORIA C
141022A,CATEGORIA B
141025K,CATEGORIA E
141026G,CATEGORIA A
141027C,CATEGORIA B
141029F,CATEGORIA B
143001A,CATEGORIA B
143003D,CATEGORIA A
143004K,CATEGORIA B
144001E,CATEGORIA C
144002A,CATEGORIA D
147005A,CATEGORIA A
147006H,CATEGORIA B
147007D,CATEGORIA D
147008K,CATEGORIA C
147009G,CATEGORIA B
147014K,CATEGORIA C
147016C,CATEGORIA B
147018F,CATEGORIA C
147020K,CATEGORIA B
147021G,CATEGORIA D
147022C,CATEGORIA D
147023J,CATEGORIA A
147025B,CATEGORIA C
147027E,CATEGORIA A
147028A,CATEGORIA B
147029H,CATEGORIA E
147030F,CATEGORIA E
147031B,CATEGORIA E
147032I,CATEGORIA E
147033E,CATEGORIA C
147034A,CATEGORIA C
147035H,CATEGORIA B
147036D,CATEGORIA C
147037K,CATEGORIA C
147040A,CATEGORIA C
147041H,CATEGORIA A
147042D,CATEGORIA D
147043K,CATEGORIA E
147045C,CATEGORIA A
147046J,CATEGORIA C
147048B,CATEGORIA D
147049I,CATEGORIA C
147050G,CATEGORIA E
147051C,CATEGORIA B
147052J,CATEGORIA D
147053F,CATEGORIA B
147056E,CATEGORIA E
147057A,CATEGORIA C
147058H,CATEGORIA D
147069J,CATEGORIA A
147501I,CATEGORIA C
147503A,CATEGORIA C
147504H,CATEGORIA C
147505D,CATEGORIA C
147508C,CATEGORIA C
147509J,CATEGORIA B
147510H,CATEGORIA B
147512K,CATEGORIA C
147514C,CATEGORIA B
147517B,CATEGORIA C
147518I,CATEGORIA B
149011L,CATEGORIA B
149012L,CATEGORIA C
149014L,CATEGORIA B
