%YAML 1.1
%TAG !u! tag:unity3d.com,2011:
--- !u!114 &11400000
MonoBehaviour:
  m_ObjectHideFlags: 0
  m_CorrespondingSourceObject: {fileID: 0}
  m_PrefabInstance: {fileID: 0}
  m_PrefabAsset: {fileID: 0}
  m_GameObject: {fileID: 0}
  m_Enabled: 1
  m_EditorHideFlags: 0
  m_Script: {fileID: 11500000, guid: d0f8ba1471d6bb044bf1bcc0ce405639, type: 3}
  m_Name: KLMQuest
  m_EditorClassIdentifier: 
  QuestTitle: Mirror On Flight
  QuestDescription: Mirrors can be extremely handy in an Airport. The mirror is person
    bind, so it can display personalized ads and ticket information.
  QuestAssignmentProgress:
  - Press the Button
  StepsNeededToComplete: 1
  QuestDialogs:
  - {fileID: 11400000, guid: d66c7a667ccdf8a49b3508176b565c20, type: 2}
  - {fileID: 11400000, guid: e2566647ba5eb6843aa29a3e2cec23ae, type: 2}
  BuildingsToSetActive: []
  TESTMODE: 1
