%YAML 1.1
%TAG !u! tag:unity3d.com,2011:
--- !u!114 &11400000
MonoBehaviour:
  m_ObjectHideFlags: 0
  m_CorrespondingSourceObject: {fileID: 0}
  m_PrefabInstance: {fileID: 0}
  m_PrefabAsset: {fileID: 0}
  m_GameObject: {fileID: 0}
  m_Enabled: 1
  m_EditorHideFlags: 0
  m_Script: {fileID: 11500000, guid: b107c067dc9db9a4480ca0253837c048, type: 3}
  m_Name: AluminiumDroppedRight
  m_EditorClassIdentifier: 
  CharacterNames:
  - Steff
  - Steff
  - Steff
  CharacterSprites:
  - {fileID: -5909113406188612290, guid: 115941eab212a42b7a838f5f74c8da3e, type: 3}
  - {fileID: -5909113406188612290, guid: 115941eab212a42b7a838f5f74c8da3e, type: 3}
  - {fileID: -5909113406188612290, guid: 115941eab212a42b7a838f5f74c8da3e, type: 3}
  CharacterSentences:
  - I can already see all the aluminium that is going to be made here. Nice!
  - Okay so now that we have aluminium in our supply chain, we can process it so
    that is becomes a soda can.
  - Let's place a Soda Factory!
