%YAML 1.1
%TAG !u! tag:unity3d.com,2011:
--- !u!114 &11400000
MonoBehaviour:
  m_ObjectHideFlags: 0
  m_CorrespondingSourceObject: {fileID: 0}
  m_PrefabInstance: {fileID: 0}
  m_PrefabAsset: {fileID: 0}
  m_GameObject: {fileID: 0}
  m_Enabled: 1
  m_EditorHideFlags: 0
  m_Script: {fileID: 11500000, guid: 1e65c896d1a684aa6b762ae54a82b49c, type: 3}
  m_Name: Customer
  m_EditorClassIdentifier: 
  BuildingName: Customer
  ProductBToProduce: Money
  AmountToProduce: 1
  ProductDemandName: Soda can
