%YAML 1.1
%TAG !u! tag:unity3d.com,2011:
--- !u!114 &11400000
MonoBehaviour:
  m_ObjectHideFlags: 0
  m_CorrespondingSourceObject: {fileID: 0}
  m_PrefabInstance: {fileID: 0}
  m_PrefabAsset: {fileID: 0}
  m_GameObject: {fileID: 0}
  m_Enabled: 1
  m_EditorHideFlags: 0
  m_Script: {fileID: 11500000, guid: d0f8ba1471d6bb044bf1bcc0ce405639, type: 3}
  m_Name: BlockTrainQuest
  m_EditorClassIdentifier: 
  QuestTitle: Chain in Training
  QuestDescription: Help the Train station with the technology of BlockChain.
  QuestAssignmentProgress:
  - Find QR 0/1
  - Explore the process 0/2
  - Explore the process 1/2
  - Make sure the Mall will have Soda Cans for the Customer
  StepsNeededToComplete: 4
  QuestDialogs:
  - {fileID: 11400000, guid: 1641fa7d78330436590155b9d096d785, type: 2}
  - {fileID: 11400000, guid: 160a2ddf4490243c195abb70f877c2fe, type: 2}
  - {fileID: 0}
  - {fileID: 0}
  - {fileID: 11400000, guid: 9d7f3e00a6aef4cb4b24482e31c1fb34, type: 2}
  BuildingsToSetActive: []
  QRCode: BlocktrainMinigame
  TESTMODE: 0
