%YAML 1.1
%TAG !u! tag:unity3d.com,2011:
--- !u!114 &11400000
MonoBehaviour:
  m_ObjectHideFlags: 0
  m_CorrespondingSourceObject: {fileID: 0}
  m_PrefabInstance: {fileID: 0}
  m_PrefabAsset: {fileID: 0}
  m_GameObject: {fileID: 0}
  m_Enabled: 1
  m_EditorHideFlags: 0
  m_Script: {fileID: 11500000, guid: 848409ee8ba454f42a5ddff137688a27, type: 3}
  m_Name: ImageLib
  m_EditorClassIdentifier: 
  m_GuidLow: 5087999668982802050
  m_GuidHigh: 16680615992713830578
  m_Images:
  - m_SerializedGuid:
      m_GuidLow: 5255731194995675954
      m_GuidHigh: 9043008803463914398
    m_SerializedTextureGuid:
      m_GuidLow: 16867186476616547498
      m_GuidHigh: 16291418706735630395
    m_Size: {x: 0.3, y: 0.3}
    m_SpecifySize: 1
    m_Name: City
    m_Texture: {fileID: 0}
  - m_SerializedGuid:
      m_GuidLow: 4663164779051052003
      m_GuidHigh: 9767646751228107402
    m_SerializedTextureGuid:
      m_GuidLow: 17177927979423402612
      m_GuidHigh: 13143397271541321611
    m_Size: {x: 0.3, y: 0.3}
    m_SpecifySize: 1
    m_Name: PlantMinigame
    m_Texture: {fileID: 0}
  - m_SerializedGuid:
      m_GuidLow: 4991022512861100416
      m_GuidHigh: 6343479552578573990
    m_SerializedTextureGuid:
      m_GuidLow: 15307151821804443564
      m_GuidHigh: 8008306503404629674
    m_Size: {x: 0.3, y: 0.3}
    m_SpecifySize: 1
    m_Name: BlocktrainMinigame
    m_Texture: {fileID: 0}
  - m_SerializedGuid:
      m_GuidLow: 5681589999840105720
      m_GuidHigh: 5010126986365329087
    m_SerializedTextureGuid:
      m_GuidLow: 5927990051845800527
      m_GuidHigh: 8708899741049210104
    m_Size: {x: 0.3, y: 0.3}
    m_SpecifySize: 1
    m_Name: DevOpsMinigame
    m_Texture: {fileID: 0}
