%YAML 1.1
%TAG !u! tag:unity3d.com,2011:
--- !u!114 &11400000
MonoBehaviour:
  m_ObjectHideFlags: 0
  m_CorrespondingSourceObject: {fileID: 0}
  m_PrefabInstance: {fileID: 0}
  m_PrefabAsset: {fileID: 0}
  m_GameObject: {fileID: 0}
  m_Enabled: 1
  m_EditorHideFlags: 0
  m_Script: {fileID: 11500000, guid: b107c067dc9db9a4480ca0253837c048, type: 3}
  m_Name: DropableFinished
  m_EditorClassIdentifier: 
  CharacterNames:
  - Steff
  - Steff
  - Steff
  - Steff
  - Steff
  CharacterSprites:
  - {fileID: -5909113406188612290, guid: 115941eab212a42b7a838f5f74c8da3e, type: 3}
  - {fileID: -5909113406188612290, guid: 115941eab212a42b7a838f5f74c8da3e, type: 3}
  - {fileID: -5909113406188612290, guid: 115941eab212a42b7a838f5f74c8da3e, type: 3}
  - {fileID: -5909113406188612290, guid: 115941eab212a42b7a838f5f74c8da3e, type: 3}
  - {fileID: -5909113406188612290, guid: 115941eab212a42b7a838f5f74c8da3e, type: 3}
  CharacterSentences:
  - Great! We have set up the entire supply chain.
  - First we will make some contracts. You can make a contract between two buildings.
  - The most important part of block chain technology is that we can exactly know
    what happens where.
  - Try to pay close attention to the chain list. Its located at the top left of
    your screen.
  - Now lets do this!
