{
  "__version__": "1.0.2",
  "general": {
    "designResolution": {
      "fitHeight": true,
      "width": 375,
      "height": 587
    }
  },
  "fbx": {
    "legacyFbxImporter": {
      "visible": true
    }
  }
}
