// Jest Snapshot v1, https://goo.gl/fbAQLP

exports[`<EventLocationComponent /> rendering Renders correctly 1`] = `
<Fragment>
  <div
    className="line-separator horizontal-line "
  />
  <div
    className="event-detail-location-container"
  >
    <div
      className="event-detail-location-txt-container"
    >
      <div
        className="flex-container event-detail-location-header-txt-container"
      >
        <div
          className="line-separator event-detail-header-txt-line"
        />
        <div
          className="event-detail-header-txt"
        >
          Where
        </div>
      </div>
      <div
        className="event-detail-location-top event-detail-location-txt"
      >
        Your Favorite Place
      </div>
      <div
        className="event-detail-location-txt"
      />
    </div>
    <div
      className="event-detail-location-img-container"
    >
      <img
        alt="location-img"
        className="event-detail-location-img"
        src="test-file-stub"
      />
    </div>
  </div>
</Fragment>
`;
