// Jest Snapshot v1, https://goo.gl/fbAQLP

exports[`<LoadingComponent /> rendering Renders correctly 1`] = `
<div
  className="parent"
>
  <div
    className="child"
  >
    <span
      className="spinner-border user-spinner"
    />
    <p
      className="profile-loading-text"
    >
      Please wait for a moment...
    </p>
  </div>
</div>
`;
