{
  "tickCount": 10080,
  "currentTick": 0,
  "income": 0.0,
  "salaryCosts": 0.0,
  "stockCosts": 0.0,
  "gameOver": false,
  "checkoutLines": [
    {
      "id": 1
    },
    {
      "id": 2
    }
  ],
  "employees": [],
  "recruitmentAgency": [
    {
      "employeeType": "junior",
      "experience": "10-30",
      "salary": 150
    },
    {
      "employeeType": "middle",
      "experience": "30-70",
      "salary": 270
    },
    {
      "employeeType": "senior",
      "experience": "70-100",
      "salary": 420
    }
  ],
  "stock": [
    {
      "id": 1,
      "name": "Картофель",
      "stockPrice": 52.0,
      "inStock": 0
    },
    {
      "id": 2,
      "name": "Морковь",
      "stockPrice": 41.0,
      "inStock": 0
    },
    {
      "id": 3,
      "name": "Лук",
      "stockPrice": 10.0,
      "inStock": 0
    },
    {
      "id": 4,
      "name": "Чеснок",
      "stockPrice": 16.0,
      "inStock": 0
    },
    {
      "id": 5,
      "name": "Петрушка",
      "stockPrice": 26.0,
      "inStock": 0
    },
    {
      "id": 6,
      "name": "Укроп",
      "stockPrice": 25.0,
      "inStock": 0
    },
    {
      "id": 7,
      "name": "Лимон",
      "stockPrice": 20.0,
      "inStock": 0
    },
    {
      "id": 8,
      "name": "Масло сливочное",
      "stockPrice": 110.0,
      "inStock": 0
    },
    {
      "id": 9,
      "name": "Кефир",
      "stockPrice": 62.0,
      "inStock": 0
    },
    {
      "id": 10,
      "name": "Молоко",
      "stockPrice": 55.0,
      "inStock": 0
    },
    {
      "id": 11,
      "name": "Сметана",
      "stockPrice": 45.0,
      "inStock": 0
    },
    {
      "id": 12,
      "name": "Творог",
      "stockPrice": 64.0,
      "inStock": 0
    },
    {
      "id": 13,
      "name": "Сыр",
      "stockPrice": 141.0,
      "inStock": 0
    },
    {
      "id": 14,
      "name": "Горчица",
      "stockPrice": 32.0,
      "inStock": 0
    },
    {
      "id": 15,
      "name": "Малиновое варенье",
      "stockPrice": 51.0,
      "inStock": 0
    },
    {
      "id": 16,
      "name": "Томатная паста",
      "stockPrice": 42.0,
      "inStock": 0
    },
    {
      "id": 17,
      "name": "Тунец консервированный",
      "stockPrice": 120.0,
      "inStock": 0
    },
    {
      "id": 18,
      "name": "Молоко сгущеное",
      "stockPrice": 100.0,
      "inStock": 0
    },
    {
      "id": 19,
      "name": "Мед",
      "stockPrice": 90.0,
      "inStock": 0
    },
    {
      "id": 20,
      "name": "Яйцо куриное (десяток)",
      "stockPrice": 60.0,
      "inStock": 0
    },
    {
      "id": 21,
      "name": "Куриное филе",
      "stockPrice": 187.0,
      "inStock": 0
    },
    {
      "id": 22,
      "name": "Свинина филе",
      "stockPrice": 193.0,
      "inStock": 0
    },
    {
      "id": 23,
      "name": "Говядина лопатка",
      "stockPrice": 231.0,
      "inStock": 0
    },
    {
      "id": 24,
      "name": "Палтус мороженый",
      "stockPrice": 195.0,
      "inStock": 0
    },
    {
      "id": 25,
      "name": "Маргарин",
      "stockPrice": 67.0,
      "inStock": 0
    },
    {
      "id": 26,
      "name": "Крабовые палочки",
      "stockPrice": 113.0,
      "inStock": 0
    },
    {
      "id": 27,
      "name": "Майонез",
      "stockPrice": 122.0,
      "inStock": 0
    },
    {
      "id": 28,
      "name": "Мука пшеничная",
      "stockPrice": 74.0,
      "inStock": 0
    },
    {
      "id": 29,
      "name": "Сахар коричневый",
      "stockPrice": 111.0,
      "inStock": 0
    },
    {
      "id": 30,
      "name": "Желатин",
      "stockPrice": 79.0,
      "inStock": 0
    },
    {
      "id": 31,
      "name": "Горький шоколад",
      "stockPrice": 243.0,
      "inStock": 0
    },
    {
      "id": 32,
      "name": "Масло оливковое",
      "stockPrice": 233.0,
      "inStock": 0
    },
    {
      "id": 33,
      "name": "Гречка 1кг",
      "stockPrice": 43.0,
      "inStock": 0
    },
    {
      "id": 34,
      "name": "Перловка 1кг",
      "stockPrice": 46.0,
      "inStock": 0
    },
    {
      "id": 35,
      "name": "Рис 1кг",
      "stockPrice": 57.0,
      "inStock": 0
    },
    {
      "id": 36,
      "name": "Панировачные сухари",
      "stockPrice": 60.0,
      "inStock": 0
    },
    {
      "id": 37,
      "name": "Черный перец",
      "stockPrice": 12.0,
      "inStock": 0
    },
    {
      "id": 38,
      "name": "Лавровый лист",
      "stockPrice": 15.0,
      "inStock": 0
    },
    {
      "id": 39,
      "name": "Чай 300г",
      "stockPrice": 176.0,
      "inStock": 0
    },
    {
      "id": 40,
      "name": "Кофе 300г",
      "stockPrice": 303.0,
      "inStock": 0
    },
    {
      "id": 41,
      "name": "Какао порошок 100г",
      "stockPrice": 290.0,
      "inStock": 0
    },
    {
      "id": 42,
      "name": "Мешки для мусора",
      "stockPrice": 110.0,
      "inStock": 0
    },
    {
      "id": 43,
      "name": "Фольга",
      "stockPrice": 96.0,
      "inStock": 0
    },
    {
      "id": 44,
      "name": "Пищевая пленка",
      "stockPrice": 92.0,
      "inStock": 0
    },
    {
      "id": 45,
      "name": "Бумага для выпечки",
      "stockPrice": 87.0,
      "inStock": 0
    },
    {
      "id": 46,
      "name": "Губки для мытья посуды",
      "stockPrice": 23.0,
      "inStock": 0
    }
  ],
  "rackCells": [
    {
      "id": 1,
      "visibility": 1,
      "capacity": 20
    },
    {
      "id": 2,
      "visibility": 1,
      "capacity": 20
    },
    {
      "id": 3,
      "visibility": 1,
      "capacity": 20
    },
    {
      "id": 4,
      "visibility": 2,
      "capacity": 20
    },
    {
      "id": 5,
      "visibility": 2,
      "capacity": 20
    },
    {
      "id": 6,
      "visibility": 2,
      "capacity": 20
    },
    {
      "id": 7,
      "visibility": 3,
      "capacity": 20
    },
    {
      "id": 8,
      "visibility": 3,
      "capacity": 20
    },
    {
      "id": 9,
      "visibility": 3,
      "capacity": 20
    },
    {
      "id": 10,
      "visibility": 4,
      "capacity": 20
    },
    {
      "id": 11,
      "visibility": 4,
      "capacity": 20
    },
    {
      "id": 12,
      "visibility": 4,
      "capacity": 20
    },
    {
      "id": 13,
      "visibility": 5,
      "capacity": 20
    },
    {
      "id": 14,
      "visibility": 5,
      "capacity": 20
    },
    {
      "id": 15,
      "visibility": 5,
      "capacity": 20
    }
  ],
  "customers": []
}
