{
    "name" : "Solo 1",
    "players" :
    {
	"beauGosseDu84" : "a"
    },
    "map" : "demo/solo1.txt",
    "turn" : 0,
    "challenge" :
    {
	"max fish" : 20,
	"min teleport" : 2,
	"min move" : 10
    }
}
