<svg xmlns="http://www.w3.org/2000/svg" xmlns:xlink="http://www.w3.org/1999/xlink" width="710" height="174" viewBox="0 0 710 174">
  <defs>
    <filter id="Rectangle_767" x="0" y="0" width="710" height="174" filterUnits="userSpaceOnUse">
      <feOffset dy="6" input="SourceAlpha"/>
      <feGaussianBlur stdDeviation="6" result="blur"/>
      <feFlood flood-opacity="0.161"/>
      <feComposite operator="in" in2="blur"/>
      <feComposite in="SourceGraphic"/>
    </filter>
    <clipPath id="clip-path">
      <rect id="Rectangle_166" data-name="Rectangle 166" width="494.478" height="105.813" transform="translate(0 107)" fill="#fff"/>
    </clipPath>
    <clipPath id="clip-path-2">
      <rect id="Rectangle_168" data-name="Rectangle 168" width="178.388" height="203.424" transform="matrix(0.695, 0.719, -0.719, 0.695, 146.331, 0)" fill="#fff"/>
    </clipPath>
    <clipPath id="clip-path-3">
      <rect id="Rectangle_167" data-name="Rectangle 167" width="494.478" height="105.813" transform="translate(0 107)" fill="none"/>
    </clipPath>
  </defs>
  <g id="OnBar_BW" transform="translate(-1055 -479)">
    <g transform="matrix(1, 0, 0, 1, 1055, 479)" filter="url(#Rectangle_767)">
      <rect id="Rectangle_767-2" data-name="Rectangle 767" width="674" height="138" transform="translate(18 12)" fill="#12130e"/>
    </g>
    <g id="Logo" transform="translate(-287.052 117.905)">
      <g id="Mask_Group_1" data-name="Mask Group 1" transform="translate(1450.946 274)" clip-path="url(#clip-path)">
        <path id="Path_363" data-name="Path 363" d="M95.975,0c43.623,0,80.448,29.1,92.294,69.562a94.918,94.918,0,0,1,3.68,26.413A95.975,95.975,0,1,1,95.975,0Z" transform="translate(148.517 117.221)" fill="#fff" opacity="0.41"/>
        <g id="Mask_Group_3" data-name="Mask Group 3" transform="translate(53.227 8.107)" opacity="0.54" clip-path="url(#clip-path-2)">
          <path id="Path_1" data-name="Path 1" d="M95.975,0c43.623,0,80.448,29.1,92.294,69.562a94.918,94.918,0,0,1,3.68,26.413A95.975,95.975,0,1,1,95.975,0Z" transform="translate(94.908 108.732)" fill="#fff"/>
        </g>
      </g>
      <g id="Mask_Group_2" data-name="Mask Group 2" transform="translate(1447.816 274)" clip-path="url(#clip-path-3)">
        <path id="Path_2" data-name="Path 2" d="M53.172,0A53.3,53.3,0,0,1,104.3,38.539a52.587,52.587,0,0,1,2.039,14.633A53.172,53.172,0,1,1,53.172,0Z" transform="translate(194.067 159.642)" fill="#fff"/>
      </g>
      <path id="Path_362" data-name="Path 362" d="M0,0H232.61" transform="translate(1578.059 485.3)" fill="#fff" stroke="#fff" stroke-width="8"/>
    </g>
  </g>
</svg>
