<?xml version="1.0" encoding="utf-8"?>
<!-- Generator: Adobe Illustrator 14.0.0, SVG Export Plug-In . SVG Version: 6.00 Build 43363)  -->
<!DOCTYPE svg PUBLIC "-//W3C//DTD SVG 1.1//EN" "http://www.w3.org/Graphics/SVG/1.1/DTD/svg11.dtd">
<svg version="1.1" id="Layer_1" xmlns="http://www.w3.org/2000/svg" xmlns:xlink="http://www.w3.org/1999/xlink" x="0px" y="0px"
	 width="160px" height="114px" viewBox="0 0 160 114" enable-background="new 0 0 160 114" xml:space="preserve">
<g>
	<g>
		<defs>
			<rect id="SVGID_1_" x="1449" y="257.4" width="158" height="68"/>
		</defs>
		<clipPath id="SVGID_2_">
			<use xlink:href="#SVGID_1_"  overflow="visible"/>
		</clipPath>
		<g id="Logo" transform="translate(-1447 -274)" clip-path="url(#SVGID_2_)">
			<g id="Mask_Group_1" transform="translate(1)">
				<defs>
					
						<rect id="SVGID_3_" x="1479.705" y="270.569" transform="matrix(-0.695 -0.719 0.719 -0.695 2338.5042 1598.1123)" width="56.999" height="65"/>
				</defs>
				<clipPath id="SVGID_4_">
					<use xlink:href="#SVGID_3_"  overflow="visible"/>
				</clipPath>
				<g id="Mask_Group_3" clip-path="url(#SVGID_4_)">
					<path id="Path_1" fill="#FFCCAC" d="M1526,294.733c13.681,0.021,25.701,9.081,29.49,22.228
						c0.787,2.743,1.183,5.585,1.176,8.439c0,16.938-13.73,30.667-30.667,30.667c-16.937,0-30.667-13.729-30.667-30.667
						C1495.332,308.463,1509.062,294.733,1526,294.733L1526,294.733z"/>
				</g>
			</g>
			<g>
				<defs>
					<rect id="SVGID_5_" x="1447" y="257.4" width="158" height="68"/>
				</defs>
				<clipPath id="SVGID_6_">
					<use xlink:href="#SVGID_5_"  overflow="visible"/>
				</clipPath>
				<g id="Mask_Group_2" clip-path="url(#SVGID_6_)">
					<path id="Path_2" fill="#FFAB75" d="M1526,308.41c7.58,0.012,14.239,5.031,16.338,12.314c0.436,1.52,0.655,3.094,0.651,4.676
						c0,9.383-7.606,16.991-16.99,16.991c-9.383,0-16.99-7.607-16.99-16.991C1509.009,316.017,1516.616,308.41,1526,308.41
						C1526,308.41,1526,308.41,1526,308.41z"/>
				</g>
			</g>
			<line id="Line_1" fill="none" stroke="#FFAB75" x1="1446.5" y1="324.9" x2="1604.5" y2="324.9"/>
		</g>
	</g>
</g>
<g enable-background="new    ">
	<path fill="#71716E" d="M3.4,88.4V60h12.16c1.253,0,2.406,0.26,3.46,0.779c1.053,0.521,1.96,1.215,2.72,2.08
		c0.76,0.867,1.353,1.84,1.78,2.92c0.426,1.08,0.64,2.18,0.64,3.301c0,0.986-0.14,1.939-0.42,2.859c-0.28,0.92-0.68,1.754-1.2,2.5
		c-0.52,0.748-1.147,1.387-1.88,1.92c-0.734,0.535-1.554,0.92-2.46,1.16L25.08,88.4H21l-6.48-10.201H7V88.4H3.4z M7,75h8.6
		c0.746,0,1.42-0.16,2.02-0.48s1.113-0.752,1.54-1.299c0.426-0.547,0.76-1.182,1-1.9c0.24-0.721,0.36-1.467,0.36-2.24
		c0-0.801-0.14-1.553-0.42-2.26c-0.28-0.707-0.654-1.334-1.12-1.881c-0.467-0.545-1.014-0.973-1.64-1.279
		c-0.627-0.307-1.287-0.461-1.98-0.461H7V75z"/>
	<path fill="#71716E" d="M41.48,60h3.04l11.6,28.4h-3.84l-3.36-8.32H37l-3.32,8.32h-3.84L41.48,60z M48.12,77.279L43,64.16
		l-5.28,13.119H48.12z"/>
	<path fill="#71716E" d="M61.04,60l8.6,14.801L78.32,60h3.92l-10.8,18.039V88.4h-3.6V77.959L57.08,60H61.04z"/>
	<path fill="#71716E" d="M109.8,63.199H100V88.4h-3.6V63.199H86.6V60h23.2V63.199z"/>
	<path fill="#71716E" d="M117.039,88.4V60h3.601v28.4H117.039z"/>
	<path fill="#71716E" d="M142.119,88.6c-2,0-3.819-0.406-5.459-1.219c-1.641-0.814-3.047-1.895-4.221-3.24
		c-1.174-1.348-2.08-2.887-2.72-4.621c-0.64-1.732-0.96-3.506-0.96-5.32c0-1.893,0.34-3.705,1.02-5.439
		c0.68-1.732,1.621-3.266,2.82-4.6c1.2-1.334,2.62-2.393,4.26-3.18c1.641-0.787,3.42-1.18,5.34-1.18c2,0,3.813,0.42,5.44,1.26
		c1.626,0.84,3.026,1.939,4.2,3.299c1.173,1.361,2.08,2.9,2.72,4.621c0.64,1.719,0.96,3.473,0.96,5.26
		c0,1.893-0.34,3.707-1.02,5.439c-0.68,1.734-1.614,3.26-2.801,4.58s-2.6,2.373-4.24,3.16C145.82,88.207,144.039,88.6,142.119,88.6z
		 M132.4,74.199c0,1.441,0.232,2.834,0.699,4.182c0.467,1.346,1.127,2.539,1.98,3.578c0.853,1.041,1.879,1.867,3.08,2.48
		c1.199,0.613,2.533,0.92,4,0.92c1.52,0,2.879-0.326,4.08-0.979c1.199-0.654,2.219-1.508,3.06-2.561
		c0.84-1.053,1.479-2.246,1.92-3.58s0.66-2.68,0.66-4.041c0-1.439-0.233-2.832-0.7-4.18c-0.467-1.346-1.134-2.533-2-3.561
		c-0.867-1.025-1.894-1.846-3.08-2.459c-1.188-0.613-2.5-0.92-3.939-0.92c-1.521,0-2.881,0.32-4.08,0.959
		c-1.2,0.641-2.221,1.48-3.061,2.521c-0.84,1.039-1.486,2.227-1.939,3.559C132.626,71.453,132.4,72.814,132.4,74.199z"/>
</g>
</svg>
