{
    "schema_name": "ss_Verification",
    "schema_type": "ss",
    "schema_version": "0.1.3",
    "schema": {
        "$schema": "http://json-schema.org/draft-07/schema#",
        "title": "Verification",
        "properties": {
            "verifications": {
                "type": "array",
                "description": "An array of verifications for this field",
                "items": {
                    "type": "object",
                    "properties": {
                        "signature": {
                            "description": "The digital signature for the data object",
                            "example": "E/XeqBXyjS4swO9xLDLc79dP4pzYAwfdf17YnDu+CtJ",
                            "type": "string"
                        },
                        "data": {
                            "properties": {
                                "verification_date": {
                                    "type": "string",
                                    "description": "The date on which the field was verified",
                                    "format": "date-time",
                                    "example": "2019-09-11T22:26:05.222562"
                                },
                                "source": {
                                    "type": "string",
                                    "description": "The source of the verified data",
                                    "example": "NZ_DRIVERS_LICENSE"
                                },
                                "v_id": {
                                    "example": "6bf57004-1afe-4edf-9b6d-ede97b6a5abc",
                                    "description": "The unique identifier of this verification",
                                    "type": "string"
                                },
                                "field": {
                                    "example": "birth_year",
                                    "type": "string",
                                    "description": "The name of the field which the verified data maps to"
                                },
                                "metadata": {
                                    "type": "object",
                                    "description": "Metadata associated with this verification"
                                },
                                "verifier": {
                                    "example": "NZ DIA",
                                    "description": "The name of the verifier",
                                    "type": "string"
                                },
                                "passed": {
                                    "description": "Whether the verification of this field was successful or not",
                                    "type": "boolean",
                                    "example": true
                                },
                                "value": {
                                    "type": "string",
                                    "encrypt": true,
                                    "description": "The value of the validated data",
                                    "example": 1999
                                }
                            },
                            "type": "object"
                        }
                    }
                }
            },
            "field": {
                "example": [
                    "birth_year",
                    "last_name"
                ],
                "type": "string",
                "title": "Validated field",
                "description": "The name of the field which the verified data maps to"
            },
            "valid_until": {
                "type": "string",
                "format": "date-time",
                "title": "Valid until",
                "description": "The date that this verification is valid until"
            }
        },
        "type": "object",
        "description": "The verification",
        "tags": [
            "type:client_only"
        ]
    }
}