{
    "schema_name": "ss_identity_document_expiry_year_integer",
    "schema_type": "ss",
    "schema_version": "0.1.4",
    "schema": {
        "definitions": {},
        "$schema": "http://json-schema.org/draft-07/schema#",
        "type": "integer",
        "minimum": 1910,
        "maximum": 2030,
        "title": "Expiry year",
        "description": "The expiry year of the identity document",
        "tags": [
            "type:globally_unique_field"
        ]
    }
}