{
    "schema_name": "ss_assertion_lifetime_activity_count_react_received_logarithmic_integer",
    "schema_type": "ss",
    "schema_version": "0.0.4",
    "schema": {
        "definitions": {},
        "$schema": "http://json-schema.org/draft-07/schema#",
        "type": "integer",
        "title": "React Received Count (Logarithmic)",
        "description": "The number of 'reactions' created by the account or credential (logarithmic scale)",
        "encrypt": false,
        "tags": [
            "type:globally_unique_field"
        ]
    }
}