{
    "schema_name": "ss_tax_identifier_string",
    "schema_type": "ss",
    "schema_version": "0.0.4",
    "schema": {
        "definitions": {},
        "$schema": "http://json-schema.org/draft-07/schema#",
        "type": "string",
        "title": "Tax identifier",
        "description": "TIN or tax identity number. For NZ: IRD number. For AU: Tax File Number `TFN`. For USA: Social Security Number 'SSN', Employer Identification Number 'EIN', Individual Taxpayer Identification Number 'ITIN', Taxpayer Identification Number for Pending U.S. Adoptions 'ATIN', Preparer Taxpayer Identification Number 'PTIN'",
        "tags": [
            "type:globally_unique_field"
        ],
        "encrypt": true
    }
}