[
    {
        "key": "LTD",
        "value": "NZ Limited Company"
    },
    {
        "key": "ULTD",
        "value": "NZ Unlimited Company"
    },
    {
        "key": "COOP",
        "value": "NZ Co-operative Company"
    },
    {
        "key": "NZCompany",
        "value": "All NZ company types"
    },
    {
        "key": "ASIC",
        "value": "Overseas ASIC Company"
    },
    {
        "key": "NON_ASIC",
        "value": "Overseas Non-ASIC Company"
    },
    {
        "key": "OverseasCompany",
        "value": "All overseas company types"
    },
    {
        "key": "Sole_Trader",
        "value": "Sole Trader"
    },
    {
        "key": "Partnership",
        "value": "Partnership"
    },
    {
        "key": "Trading_Trust",
        "value": "Trust"
    },
    {
        "key": "T",
        "value": "Charitable Trust"
    },
    {
        "key": "B",
        "value": "Building Society"
    },
    {
        "key": "D",
        "value": "Credit Union"
    },
    {
        "key": "F",
        "value": "Friendly Society"
    },
    {
        "key": "I",
        "value": "Incorporated Society"
    },
    {
        "key": "N",
        "value": "Industrial & Provident Society"
    },
    {
        "key": "Y",
        "value": "Limited Partnership (NZ)"
    },
    {
        "key": "Z",
        "value": "Limited Partnership (Overseas)"
    },
    {
        "key": "S",
        "value": "Special Bodies/Other entities"
    },
    {
        "key": "GovtCentral",
        "value": "Central government agencies"
    },
    {
        "key": "GovtLocal",
        "value": "Local government agencies"
    },
    {
        "key": "GovtEdu",
        "value": "Government educational facilities"
    },
    {
        "key": "GovtOther",
        "value": "Other public entities"
    }
]