{
    "schema_name": "ss_Family_Group",
    "schema_type": "ss",
    "schema_version": "0.1.11",
    "schema": {
        "schema_group": "person_attributes",
        "properties": {
            "family_group_name": {
                "allOf": [
                    {
                        "$ref": "#/definitions/ss_family_group_name_string"
                    },
                    {
                        "priority": 100,
                        "description": "Your family name",
                        "tags": [
                            "display:no_autofill"
                        ]
                    }
                ]
            }
        },
        "definitions": {
            "ss_family_group_name_string": {
                "$ref": "urn:schema:ss_family_group_name_string"
            }
        },
        "relationships": [
            {
                "direction": "from",
                "relationship_name": "family_members",
                "type": "HAS_MEMBERS",
                "anyOf": [
                    "ss_Person_Name"
                ],
                "multiple": true
            }
        ],
        "i18n": {
            "en": {
                "person_attributes": {
                    "title_plural": "Person attributes",
                    "description": "Attributes that relate to a person",
                    "title": "Person attributes"
                },
                "family_members": {
                    "title_plural": "Family Members",
                    "description": "The members of a particular family",
                    "title": "Family Member"
                }
            }
        },
        "$schema": "http://json-schema.org/draft-07/schema#",
        "title": "Family Group",
        "description": "The person's family group",
        "display": {
            "head_main": {
                "fields": [
                    "family_group_name"
                ]
            }
        },
        "required": [
            "family_group_name"
        ],
        "type": "object"
    }
}