[
    {
        "value": "Initial state",
        "key": ""
    },
    {
        "value": "Submitted",
        "key": "Submitted"
    },
    {
        "value": "Processing",
        "key": "Processing"
    },
    {
        "value": "Received",
        "key": "Received"
    },
    {
        "value": "Rejected",
        "key": "Rejected"
    },
    {
        "value": "Completed",
        "key": "Completed"
    },
    {
        "value": "Accepted",
        "key": "Accepted"
    },
    {
        "value": "DataChanged",
        "key": "DataChanged"
    },
    {
        "value": "DataCreated",
        "key": "DataCreated"
    }
]