{
    "schema_name": "ss_family_group_name_string",
    "schema_type": "ss",
    "schema_version": "0.1.10",
    "schema": {
        "definitions": {},
        "$schema": "http://json-schema.org/draft-07/schema#",
        "type": "string",
        "title": "Family name",
        "description": "The person's family name",
        "encrypt": true,
        "examples": [
            "The Smiths",
            "The Flinstones"
        ],
        "tags": [
            "type:globally_unique_field"
        ]
    }
}