<?xml version="1.0" encoding="UTF-8" standalone="no"?>
<svg
   xmlns="http://www.w3.org/2000/svg"
   width="1133.8583"
   height="1665.3542"
   id="svg2"
   version="1.1">
  <g transform="translate(0,612.99344)">
    <g
        id="g3068"
        transform="translate(0,-128)">
        <text
          id="text3829"
          y="401.07562"
          x="686.6864"
          style="font-size:43.53238678px;text-align:center;line-height:125%;letter-spacing:0px;word-spacing:0px;text-anchor:middle;fill:#000080;fill-opacity:1;stroke:none;font-family:monospace;-inkscape-font-specification:monospace"
          xml:space="preserve"><tspan
          id="tspan3841"
          style="font-style:normal;font-variant:normal;font-weight:bold;font-stretch:normal;text-align:center;text-anchor:middle;fill:#000080;font-family:Orthoventional;-inkscape-font-specification:Orthoventional Bold"
          y="401.07562"
          x="686.6864" /></text>
        <g
          transform="translate(8,-820)"
          id="g3047">
        <path
          style="color:#000000;fill:none;stroke:#001196;stroke-width:3;stroke-opacity:1;marker:none;visibility:visible;display:inline;overflow:visible;enable-background:accumulate"
          d="m 78.78125,1.5625 c -41.412214,0 -74.75,33.337786 -74.75,74.75 l 0,180 390.9375,0 0,32.1875 c 0,14.22254 11.46496,25.6875 25.6875,25.6875 l 267.84375,0 c 14.22254,0 25.6875,-11.46496 25.6875,-25.6875 l 0,-32.1875 421.2187,0 0,-180 c 0,-41.412214 -33.3376,-74.75 -74.75,-74.75 l -981.87495,0 z"
          id="rect2985"
          transform="translate(0,343.69945)" />
        <path
          style="color:#000000;fill:#00168e;fill-opacity:1;stroke:none;stroke-width:2.46181679;marker:none;visibility:visible;display:inline;overflow:visible;enable-background:accumulate"
          d="m -0.2948738,993.91548 c 2.1487194,32.53052 8.4580055,58.68662 47.7662028,58.69572 l 1036.955171,0.2349 c 39.3083,0.013 45.8159,-25.2655 48.9647,-58.36329 z"
          id="rect2985-7"/>
        <text
          xml:space="preserve"
          style="font-size:67.81440735px;line-height:125%;letter-spacing:0px;word-spacing:0px;fill:#000689;fill-opacity:1;stroke:none;font-family:monospace;"
          x="415.63812"
          y="647.07928"
          id="text3793"><tspan
              id="tspan3795"
              x="415.63812"
              y="647.07928"
              style="fill:#000689;fill-opacity:1;font-family:monospace;">ID CARD</tspan></text>
        <rect
          style="color:#000000;fill:none;stroke:#000000;stroke-width:3.50858879;stroke-opacity:1;marker:none;visibility:visible;display:inline;overflow:visible;enable-background:accumulate"
          id="rect3857"
          width="258.68472"
          height="311.32889"
          x="846.84576"
          y="645.55188"
          ry="31.221008" />
        <text
          xml:space="preserve"
          style="font-size:60px;line-height:211.99998856%;letter-spacing:0px;word-spacing:0px;fill:#000080;fill-opacity:1;stroke:none;font-family:monospace;-inkscape-font-specification:monospace"
          x="13.698483"
          y="725.67749"
          id="text3859"><tspan
              id="tspan3861"
              x="13.698483"
              y="725.67749"
              style="font-size:45px;line-height:211.99998856%;fill:#000080;font-family:monospace;">Name : <tspan style="fill:#000000">{first_given_name} {family_name}</tspan></tspan><tspan
              x="13.698483"
              y="821.07751"
              id="tspan3865"
              style="font-size:45px;line-height:211.99998856%;fill:#000080;font-family:monospace;">DoB  : <tspan style="fill:#000000">{birth_day}/{birth_month}/{birth_year}</tspan></tspan><tspan
              x="13.698483"
              y="916.47748"
              id="tspan3867"
              style="font-size:45px;line-height:211.99998856%;fill:#000080;font-family:monospace;">ID   : <tspan style="fill:#000000">{ID} v{version}</tspan></tspan></text>
        <text
          xml:space="preserve"
          style="font-size:56.89770126px;line-height:125%;letter-spacing:0px;word-spacing:0px;fill:#000000;fill-opacity:1;stroke:none;font-family:monospace;-inkscape-font-specification:monospace"
          x="521.50128"
          y="368.62387"
          id="text3837-7"
          transform="scale(0.90568438,1.1041374)"><tspan
              id="tspan3839-8"
              x="521.50128"
              y="368.62387"
              style="font-style:normal;font-variant:normal;font-weight:bold;font-stretch:normal;fill:#000000;fill-opacity:1;font-family:monospace;">NZ Drivers License</tspan></text>
        <text
          xml:space="preserve"
          style="font-size:44.30395508px;line-height:125%;letter-spacing:0px;word-spacing:0px;fill:#ffffff;fill-opacity:1;stroke:none;font-family:monospace;"
          x="814.1311"
          y="1031.741"
          id="text3897"><tspan
              id="tspan3899"
              x="814.1311"
              y="1031.741">NZTA</tspan></text>
        <rect
          style="opacity:0.70416667;color:#000000;fill:none;stroke:#000000;stroke-width:4.49653721;stroke-opacity:1;marker:none;visibility:visible;display:inline;overflow:visible;enable-background:accumulate"
          id="rect3056"
          width="234.70445"
          height="221.91214"
          x="32.647778"
          y="363.80093"
          ry="90.270981" />
        <text
          xml:space="preserve"

          x="64"
          y="494.36084"
          id="text3826"><tspan
              id="tspan3828"
              x="64"
              y="494.36084"
              style="font-family:monospace;">LOGO</tspan></text>
        <text
          xml:space="preserve"

          x="553.5636"
          y="503.64597"
          id="text3849"><tspan
              id="tspan3851"
              x="553.5636"
              y="503.64597"
              style="font-family:monospace;">ADDRESS</tspan></text>
        <text
          xml:space="preserve"

          x="882.86572"
          y="817.65399"
          id="text3826-2"><tspan
              id="tspan3828-0"
              x="882.86572"
              y="817.65399"
              style="font-family:monospace;">PHOTO</tspan></text>
        </g>
    </g>
  </g>
</svg>
