key,value
Registered,Registered
VoluntaryAdministration,Voluntary Administration
VoluntaryAdministration, InReceivership,In Receivership & In Voluntary Administration
InLiquidation,In Liquidation
VoluntaryAdministration, InReceivership, InLiquidation,In Receivership & In Liquidation & In Voluntary Administration
VoluntaryAdministration, InLiquidation,Voluntary Administration & In Liquidation
InReceivership,In Receivership
InReceivership, InLiquidation,In Receivership & In Liquidation
InStatutoryAdministration,In Statutory Administration
RemovedClosed,Removed
Inactive,Inactive (unincorporated entities only)