{
    "schema_name": "ss_NZ_Share_Allocation",
    "schema_version": "0.1.5",
    "schema_type": "ss",
    "schema": {
        "definitions": {},
        "description": "Share allocation",
        "display": {
            "head_main": {
                "fields": [
                    "number_of_shares"
                ]
            }
        },
        "i18n": {
            "en-nz": {
                "share_allocation_relationship": {
                    "title_plural": "Share allocations",
                    "description": "Share allocation",
                    "title": "Share allocation"
                }
            }
        },
        "relationships": [
            {
                "direction": "from",
                "relationship_name": "share_allocation_relationship",
                "type": "HOLDS_SHARES",
                "oneOf": [
                    "ss_Person_Name",
                    "ss_NZ_Company"
                ],
                "multiple": true
            }
        ],
        "properties": {
            "shares": {
                "title": "Shares",
                "type": "string",
                "description": "The number of shares for this allocation",
                "examples": [
                    "1000"
                ],
                "priority": 100,
                "encrypt": true
            },
            "number_of_shares": {
                "title": "Number of shares",
                "type": "number",
                "description": "The number of shares for this allocation",
                "examples": [
                    "1000"
                ],
                "priority": 200,
                "encrypt": true
            },
            "allocation_name": {
                "title": "Allocation name",
                "type": "string",
                "description": "The name of this share allocation",
                "priority": 300,
                "encrypt": true
            }
        },
        "title": "Share allocation",
        "$schema": "http://json-schema.org/draft-07/schema#",
        "required": [
            "shares"
        ],
        "type": "object"
    }
}