{
    "schema_name": "ss_webauthn_credential_id_string",
    "schema_type": "ss",
    "schema_version": "0.0.4",
    "schema": {
        "definitions": {},
        "$schema": "http://json-schema.org/draft-07/schema#",
        "type": "string",
        "title": "WebAuthn credential ID",
        "description": "The unique ID of the web authentication credential",
        "readOnly": true,
        "examples": [
            "BTAQrVBFQQ9_PeCwj0pH6-DqTk0C762GF-CATxTIdZSwHwTikj4g0zS7i7ElNvU39fTi_sTVXKUXJvamO8L7_htis"
        ],
        "tags": [
            "type:globally_unique_field"
        ]
    }
}