{
  "Alfa Romeo": "Alfa Romeo",
  "Aston Martin": "Aston Martin",
  "Audi": "Audi",
  "Bentley": "Bentley",
  "BMW": "BMW",
  "Bugatti": "Bugatti",
  "Buick": "Buick",
  "Cadillac": "Cadillac",
  "Chevrolet": "Chevrolet",
  "Chrysler": "Chrysler",
  "Citroen": "Citroen",
  "Dodge": "Dodge",
  "Ferrari": "Ferrari",
  "Fiat": "Fiat",
  "Ford": "Ford",
  "Honda": "Honda",
  "Hyundai": "Hyundai",
  "Inifiniti": "Inifiniti",
  "Jaguar": "Jaguar",
  "Jeep": "Jeep",
  "Kia": "Kia",
  "Lamborghini": "Lamborghini",
  "Lancia": "Lancia",
  "Land Rover": "Land Rover",
  "Lexus": "Lexus",
  "Maserati": "Maserati",
  "Mazda": "Mazda",
  "Mercedes": "Mercedes",
  "Mini": "Mini",
  "Mitsubishi": "Mitsubishi",
  "Nissan": "Nissan",
  "Opel": "Opel",
  "Peugeot": "Peugeot",
  "Porsche": "Porsche",
  "Renault": "Renault",
  "Skoda": "Skoda",
  "Subaru": "Subaru",
  "Suzuki": "Suzuki",
  "Toyota": "Toyota",
  "Volkswagen": "Volkswagen",
  "Volvo": "Volvo"
}