{
    "schema_name": "ss_Provider_Billing",
    "schema_version": "0.1.7",
    "schema_type": "ss",
    "schema": {
        "definitions": {},
        "description": "The billing provider details",
        "display": {
            "head_main": {
                "fields": [
                    "provider_billing_provider"
                ]
            }
        },
        "i18n": {
            "en-nz": {
                "billing_keys": {
                    "description": "Billing key",
                    "title_plural": "Billing keys",
                    "title": "Billing key"
                }
            }
        },
        "relationships": [
            {
                "direction": "from",
                "relationship_name": "billing_keys",
                "type": "BILLED_USING",
                "oneOf": [
                    "ss_Provider_Billing_Keys"
                ],
                "multiple": false
            }
        ],
        "properties": {
            "provider_billing_provider": {
                "type": "string",
                "title": "The billing provider",
                "description": "The name of the billing provider",
                "enum": [
                    "Stripe"
                ],
                "priority": 100,
                "tags": [
                    "group:provider_billing"
                ]
            },
            "permissions": {
                "type": "string",
                "title": "Permissions",
                "description": "Default permissions for this record",
                "examples": [
                    "Public"
                ],
                "enum": [
                    "Public",
                    "Private",
                    "Authenticated Only"
                ],
                "default": "Public",
                "readOnly": true,
                "priority": 500,
                "tags": [
                    "group:provider_billing"
                ]
            },
            "provider_billing_key": {
                "type": "string",
                "title": "Provider billing key",
                "description": "The API key for this billing provider",
                "priority": 200,
                "tags": [
                    "group:provider_billing"
                ]
            }
        },
        "required": [
            "provider_billing_provider",
            "provider_billing_key"
        ],
        "tags": [
            "type:service_provider"
        ],
        "title": "Provider billing",
        "$schema": "http://json-schema.org/draft-07/schema#",
        "type": "object"
    }
}