{
    "schema_name": "ss_fnd_program",
    "schema_version": "0.0.5",
    "schema_type": "ss",
    "schema": {
        "tags": [
            "type:client_only"
        ],
        "i18n": {
            "en": {
                "contact_information": {
                    "title_plural": "Contact information",
                    "description": "Contact information",
                    "title": "Contact information"
                },
                "summary": {
                    "title_plural": "Summaries",
                    "description": "Summary information",
                    "title": "Summary"
                },
                "advanced": {
                    "title_plural": "Advanced",
                    "description": "Advanced information",
                    "title": "Advanced"
                },
                "address": {
                    "title_plural": "Addresses",
                    "description": "Address information",
                    "title": "Address"
                }
            }
        },
        "database": {
            "table": "fnd_programs",
            "primary_key": "program_code"
        },
        "description": "Program information",
        "display": {
            "tabular": {
                "fields": [
                    "program_code",
                    "program_name",
                    "start_date",
                    "end_date",
                    "active"
                ]
            }
        },
        "properties": {
            "start_date": {
                "title": "Start date",
                "description": "The date from which this program can be used",
                "type": "string",
                "format": "date-time",
                "priority": 1200,
                "tags": [
                    "group:summary"
                ]
            },
            "end_date": {
                "title": "End date",
                "description": "The date after which this program can no longer be used",
                "type": "string",
                "format": "date-time",
                "priority": 1300,
                "tags": [
                    "group:summary"
                ]
            },
            "active": {
                "title": "Active",
                "description": "Whether this program can be used or not",
                "type": "boolean",
                "priority": 1400,
                "tags": [
                    "group:summary"
                ]
            },
            "program_code": {
                "type": "string",
                "title": "Program code",
                "description": "The code for this program",
                "tags": [
                    "group:summary"
                ],
                "priority": 2000
            },
            "program_name": {
                "type": "string",
                "title": "Program name",
                "description": "Your name for this program",
                "tags": [
                    "group:summary"
                ],
                "priority": 2100
            },
            "program_priority": {
                "type": "integer",
                "title": "Program priority",
                "description": "The priority of this program",
                "tags": [
                    "group:summary"
                ],
                "priority": 2300
            },
            "program_parameters": {
                "type": "object",
                "title": "Program parameters",
                "description": "The parameters used by this program",
                "tags": [
                    "group:summary"
                ],
                "properties": {},
                "priority": 2400
            },
            "program_timeout_sec": {
                "type": "integer",
                "title": "Program timeout (s)",
                "description": "The number of seconds after which the program will time out",
                "tags": [
                    "group:summary"
                ],
                "priority": 2500
            },
            "worker_manager_id": {
                "type": "string",
                "title": "Worker manager",
                "description": "The worker that manages the execution of this program",
                "priority": 5000,
                "tags": [
                    "group:advanced"
                ],
                "foreign_key_of": "ss_fnd_worker_manager",
                "readOnly": true
            },
            "job_notification_group_id": {
                "type": "string",
                "title": "Job notification group",
                "description": "The notification group that this program belongs to",
                "priority": 5100,
                "tags": [
                    "group:advanced"
                ],
                "foreign_key_of": "ss_fnd_notification_group"
            },
            "id": {
                "type": "string",
                "title": "Unique ID",
                "description": "The unique identifier for this program",
                "priority": 5300,
                "tags": [
                    "group:advanced"
                ],
                "readOnly": true
            }
        },
        "title": "Program",
        "title_plural": "Programs",
        "$schema": "http://json-schema.org/draft-07/schema#",
        "required": [
            "program_code",
            "program_priority",
            "program_timeout_sec",
            "worker_manager_id"
        ],
        "type": "object"
    }
}