{
    "schema_name": "ss_OAuth_Tokens_GitHub",
    "schema_type": "ss",
    "schema_version": "0.0.4",
    "schema": {
        "type": "object",
        "schema_group": "authentication",
        "tags": [
            "oauth2_component:name:GitHub",
            "oauth2_component:redirect_url: https://github.com/login/oauth/authorize?response_type=code&client_id=Ov23licxb9AOiKB3dtgV&scope={scopes}&redirect_uri={raytioApiUrl}/oauth2-token/v1/oauth2/exchange-token/5d8706e1-dde5-44db-987b-d638afcf33e9&state={state}"
        ],
        "i18n": {
            "en": {
                "authentication": {
                    "title_plural": "Authentication details",
                    "description": "Authentication details for third party applications",
                    "title": "Authentication details"
                }
            }
        },
        "properties": {
            "scopes": {
                "type": "array",
                "title": "Scopes",
                "description": "The GitHub scopes to give Raytio access to",
                "default": [
                    "read:user"
                ],
                "tags": [
                    "group:oauth2",
                    "special:hide_select_behind_button"
                ],
                "priority": 1000,
                "items": {
                    "type": "string"
                },
                "lookup": "{API_DOCS_URL}/lookups/github_scopes.json"
            },
            "name": {
                "type": "string",
                "title": "Name",
                "description": "Your name for these authentication credentials",
                "priority": 1100,
                "tags": [
                    "group:oauth2"
                ]
            },
            "encryption": {
                "readOnly": true,
                "description": "Details of the method used to encrypt the GitHub data",
                "tags": [
                    "group:oauth2"
                ],
                "title": "Encryption details",
                "priority": 1400,
                "encrypt": true,
                "type": "object"
            },
            "access_token": {
                "readOnly": true,
                "description": "The access token",
                "tags": [
                    "group:oauth2"
                ],
                "priority": 2000,
                "title": "Access token",
                "type": "string"
            },
            "hashed_access_token": {
                "readOnly": true,
                "tags": [
                    "group:oauth2"
                ],
                "description": "The encrypted access token",
                "title": "Hashed access token",
                "priority": 2100,
                "type": "string"
            },
            "id_token": {
                "readOnly": true,
                "description": "The id token",
                "tags": [
                    "group:oauth2"
                ],
                "encrypt": true,
                "title": "ID token",
                "priority": 3000,
                "type": "string"
            },
            "hashed_id_token": {
                "readOnly": true,
                "tags": [
                    "group:oauth2"
                ],
                "description": "The encrypted id token",
                "title": "Hashed id token",
                "priority": 3100,
                "type": "string"
            }
        },
        "display": {
            "head_main": {
                "fields": [
                    "name"
                ]
            },
            "expand": [
                {
                    "fields": [
                        "encryption",
                        "id_token",
                        "hashed_access_token",
                        "hashed_id_token"
                    ],
                    "label": "Advanced"
                }
            ]
        },
        "description": "Connect your GitHub account to your profile",
        "$schema": "http://json-schema.org/draft-07/schema#",
        "title": "GitHub OAuth tokens",
        "required": [
            "scopes"
        ]
    }
}