{
    "schema_name": "ss_identity_document_issuer_region_string",
    "schema_type": "ss",
    "schema_version": "0.1.4",
    "schema": {
        "definitions": {},
        "$schema": "http://json-schema.org/draft-07/schema#",
        "type": "string",
        "title": "Identity document issuing region",
        "description": "The region that issued the identity document",
        "encrypt": true,
        "examples": [
            "Victoria"
        ],
        "tags": [
            "type:globally_unique_field"
        ]
    }
}