{
    "schema_name": "ss_Connected_Account_Ebay",
    "schema_type": "ss",
    "schema_version": "0.1.4",
    "schema": {
        "type": "object",
        "schema_group": "social_platform",
        "tags": [],
        "i18n": {
            "en": {
                "social_platform": {
                    "title_plural": "Social profiles",
                    "description": "Profile information from a social platform",
                    "title": "Social profile"
                }
            }
        },
        "definitions": {
            "ss_webauthn_credential_id_string": {
                "$ref": "urn:schema:ss_webauthn_credential_id_string"
            },
            "ss_assertion_lifetime_rating_logarithmic_integer": {
                "$ref": "urn:schema:ss_assertion_lifetime_rating_logarithmic_integer"
            },
            "ss_lifetime_activity_count_react_received_negative_logarithmic_integer": {
                "$ref": "urn:schema:ss_lifetime_activity_count_react_received_negative_logarithmic_integer"
            },
            "ss_lifetime_activity_count_react_received_positive_logarithmic_integer": {
                "$ref": "urn:schema:ss_lifetime_activity_count_react_received_positive_logarithmic_integer"
            }
        },
        "properties": {
            "oauth_access_token_source": {
                "type": "string",
                "description": "The authentication credentials for a connected Ebay account",
                "priority": 1000,
                "title": "Ebay credentials",
                "display": {
                    "main_media": "name"
                },
                "tags": [
                    "group:findProfileObject:ss_OAuth_Tokens_Ebay",
                    "type:extract_required:access_token"
                ]
            },
            "ebay_id": {
                "type": "string",
                "title": "ID",
                "description": "The Ebay unique identifier for the user",
                "readOnly": true,
                "encrypt": true,
                "priority": 1100,
                "tags": []
            },
            "ebay_username": {
                "type": "string",
                "title": "ID",
                "description": "The Ebay username",
                "readOnly": true,
                "encrypt": true,
                "priority": 1200,
                "tags": [
                    "type:extract_required"
                ]
            },
            "ebay_name": {
                "type": "string",
                "title": "Username",
                "description": "The Ebay username",
                "readOnly": true,
                "encrypt": true,
                "priority": 1300,
                "tags": []
            },
            "hash_pepper": {
                "type": "string",
                "title": "Hash pepper",
                "description": "A secret value used to generate the platform_unique_id",
                "readOnly": true,
                "encrypt": true,
                "priority": 1800,
                "tags": [
                    "action:generate_pepper:16"
                ]
            },
            "platform_unique_id": {
                "type": "string",
                "title": "Platform unique ID",
                "description": "The hashed unique ID for this entity type",
                "hash_inputs": "$hash_pepper|internet_service|Ebay.com|||$ebay_username|",
                "readOnly": true,
                "priority": 1900,
                "tags": [
                    "action:hash:argon2:t=3,p=4,m=65536"
                ]
            },
            "lifetime_activity_count_react_received_positive_logarithmic": {
                "allOf": [
                    {
                        "$ref": "#/definitions/ss_lifetime_activity_count_react_received_positive_logarithmic_integer"
                    },
                    {
                        "priority": 2000,
                        "readOnly": true,
                        "tags": []
                    }
                ]
            },
            "lifetime_activity_count_react_received_negative_logarithmic": {
                "allOf": [
                    {
                        "$ref": "#/definitions/ss_lifetime_activity_count_react_received_negative_logarithmic_integer"
                    },
                    {
                        "priority": 2100,
                        "readOnly": true,
                        "tags": []
                    }
                ]
            },
            "assertion_lifetime_rating_logarithmic": {
                "allOf": [
                    {
                        "$ref": "#/definitions/ss_assertion_lifetime_rating_logarithmic_integer"
                    },
                    {
                        "priority": 2200,
                        "readOnly": true,
                        "tags": []
                    }
                ]
            }
        },
        "display": {
            "head_main": {
                "fields": [
                    "oauth_access_token_source",
                    "ebay_username"
                ]
            },
            "expand": [
                {
                    "fields": [
                        "hash_pepper",
                        "platform_unique_id"
                    ],
                    "label": "Advanced"
                }
            ]
        },
        "description": "Ebay account and associated statistics",
        "$schema": "http://json-schema.org/draft-07/schema#",
        "title": "Ebay account",
        "required": [
            "oauth_access_token_source"
        ]
    }
}