key,value
ATE,ATE
Behr Hella,Behr Hella
Bendix,Bendix
Beru,Beru
Boge,Boge
BorgWarner,BorgWarner
Brembo,Brembo
Contitech,Contitech
Dayco,Dayco
Delphi,Delphi
Elring,Elring
FAG,FAG
Febi-Bilstein,Febi-Bilstein
Federal Moful,Federal Moful
Ferodo,Ferodo
Gates,Gates
GKN Driveline,GKN Driveline
Glyco,Glyco
Goetze,Goetze
Graf,Graf
Hengst,Hengst
HEPU,HEPU
INA,INA
Jurid,Jurid
Knorr-Bremse,Knorr-Bremse
Kolbenschmidt,Kolbenschmidt
Lemforder,Lemforder
Lesjofors,Lesjofors
LUK,LUK
Magneti Marelli,Magneti Marelli
Mahle Knecht,Mahle Knecht
Mann Filter,Mann Filter
Meyle,Meyle
Mintex,Mintex
MS,MS
Nissen,Nissen
Pagid,Pagid
Pierburg,Pierburg
Sachs,Sachs
SKF,SKF
SWAG,SWAG
SWF ZF,SWF ZF
Textar,Textar
TRW,TRW
Valeo,Valeo
VDO,VDO
Victor Reinz,Victor Reinz
Zimmermann,Zimmermann
Bosch,Bosch
ULO,ULO
ZF,ZF