{
    "schema_name": "ss_birth_day_integer",
    "schema_type": "ss",
    "schema_version": "0.1.4",
    "schema": {
        "definitions": {},
        "$schema": "http://json-schema.org/draft-07/schema#",
        "type": "integer",
        "minimum": 1,
        "maximum": 31,
        "title": "Day of birth",
        "description": "The day of birth of the individual",
        "encrypt": true,
        "tags": [
            "type:globally_unique_field"
        ]
    }
}