{
  "application/pdf": ".pdf",
  "application/vnd.ms-powerpoint": ".ppt",
  "application/vnd.openxmlformats-officedocument.presentationml.presentation": ".pptx",
  "application/rtf": ".rtf",
  "image/svg+xml": ".svg",
  "image/tiff": ".tiff",
  "audio/wav": ".wav",
  "audio/webm": ".weba",
  "video/webm": ".weba",
  "application/vnd.ms-excel": ".xls",
  "application/vnd.openxmlformats-officedocument.spreadsheetml.sheet": ".xlsx",
  "application/zip": ".zip",
  "video/3gpp": ".3gp",
  "video/3gpp2": ".3g2",
  "application/x-7z-compressed": ".7z",
  "audio/aac": ".aac",
  "video/x-msvideo": ".avi",
  "image/bmp": ".bmp",
  "application/x-bzip": ".bz",
  "application/x-bzip2": ".bz2",
  "text/csv": ".csv",
  "application/msword": ".doc",
  "application/vnd.openxmlformats-officedocument.wordprocessingml.document": ".docx",
  "image/gif": ".gif",
  "image/jpeg": ".jpg, .jpeg",
  "audio/mpeg": ".mp3",
  "video/mpeg": "mpeg",
  "application/vnd.oasis.opendocument.presentation": ".odp",
  "application/vnd.oasis.opendocument.spreadsheet": "ods",
  "application/vnd.oasis.opendocument.text": "odt",
  "audio/ogg": ".oga",
  "video/ogg": "ogv",
  "application/ogg": "ogx",
  "audio/opus": ".opus",
  "image/png": ".png"
}
