{
    "schema_name": "ss_Billing_Organization",
    "schema_version": "0.1.9",
    "schema_type": "ss",
    "schema": {
        "title_plural": "Organisations",
        "display": {
            "head_main": {
                "fields": [
                    "name",
                    "email"
                ]
            }
        },
        "properties": {
            "locality": {
                "allOf": [
                    {
                        "$ref": "#/definitions/ss_nz_location_locality_string"
                    },
                    {
                        "priority": 70,
                        "tags": [
                            "group:address",
                            "display:no_autofill"
                        ]
                    }
                ]
            },
            "org_name": {
                "examples": [
                    "Global Financial Corp"
                ],
                "title": "Organization Name",
                "priority": 10,
                "type": "string",
                "description": "The name of the organization"
            },
            "name": {
                "examples": [
                    "Global Financial Corp"
                ],
                "title": "Organization Name",
                "priority": 15,
                "type": "string",
                "description": "The name of the organization"
            },
            "route": {
                "allOf": [
                    {
                        "$ref": "#/definitions/ss_nz_location_route_string"
                    },
                    {
                        "priority": 50,
                        "tags": [
                            "group:address",
                            "display:no_autofill"
                        ]
                    }
                ]
            },
            "street_number": {
                "allOf": [
                    {
                        "$ref": "#/definitions/ss_nz_location_street_number_string"
                    },
                    {
                        "priority": 40,
                        "tags": [
                            "group:address",
                            "display:no_autofill"
                        ]
                    }
                ]
            },
            "org_email": {
                "priority": 20,
                "title": "Organization billing email",
                "type": "string",
                "description": "The email address of the organization",
                "examples": [
                    "billing@globalfinancialcorp.com"
                ]
            },
            "email": {
                "priority": 25,
                "title": "Organization billing email",
                "type": "string",
                "description": "The email address of the organization",
                "examples": [
                    "billing@globalfinancialcorp.com"
                ]
            },
            "postal_code": {
                "allOf": [
                    {
                        "$ref": "#/definitions/ss_nz_location_postal_code_string"
                    },
                    {
                        "priority": 80,
                        "tags": [
                            "group:address",
                            "display:no_autofill"
                        ]
                    }
                ]
            },
            "country": {
                "type": "string",
                "title": "Location country",
                "description": "The country of this location",
                "tags": [
                    "group:address"
                ],
                "lookup": "{API_BASE_URL}/db/v1/fnd_countries?select=key:iso_country_code_2,value:country_name",
                "priority": 90
            },
            "sublocality": {
                "allOf": [
                    {
                        "$ref": "#/definitions/ss_nz_location_sublocality_string"
                    },
                    {
                        "priority": 60,
                        "tags": [
                            "group:address",
                            "display:no_autofill"
                        ]
                    }
                ]
            }
        },
        "definitions": {
            "ss_nz_location_sublocality_string": {
                "$ref": "urn:schema:ss_nz_location_sublocality_string"
            },
            "ss_nz_location_locality_string": {
                "$ref": "urn:schema:ss_nz_location_locality_string"
            },
            "ss_nz_location_route_string": {
                "$ref": "urn:schema:ss_nz_location_route_string"
            },
            "ss_nz_location_street_number_string": {
                "$ref": "urn:schema:ss_nz_location_street_number_string"
            },
            "ss_nz_location_postal_code_string": {
                "$ref": "urn:schema:ss_nz_location_postal_code_string"
            }
        },
        "type": "object",
        "description": "The organization details",
        "required": [
            "org_name",
            "org_email",
            "location_type",
            "street_number",
            "route",
            "locality",
            "country"
        ],
        "$schema": "http://json-schema.org/draft-07/schema#",
        "tags": [
            "type:client_only"
        ],
        "title": "Organization"
    }
}