{
    "schema_name": "ss_Loan_Preferences",
    "schema_type": "ss",
    "schema_version": "0.0.5",
    "schema": {
        "definitions": {},
        "description": "Details of your preferences for a specific loan",
        "tags": [],
        "type": "object",
        "title": "Loan Preferences",
        "required": [
            "preferred_loan_amount",
            "preferred_loan_term",
            "loan_purpose"
        ],
        "properties": {
            "preferred_loan_amount": {
                "type": "number",
                "description": "How much would you like to borrow?",
                "title": "Target Loan Amount",
                "priority": 100
            },
            "preferred_loan_term": {
                "title": "Loan Term (months)",
                "type": "number",
                "description": "How long would you like to borrow the money for? Enter a number of months",
                "priority": 200
            },
            "preferred_interest_rate": {
                "title": "Target Rate",
                "type": "number",
                "description": "What is your target interest rate? Please enter a percentage",
                "priority": 300
            },
            "loan_purpose": {
                "title": "Loan purpose",
                "description": "What will the loan money be used for?",
                "type": "string",
                "priority": 400
            },
            "preferred_drawdown_date": {
                "description": "The date on which you would like the funds to be available",
                "title": "Drawdown Date",
                "format": "date",
                "type": "string",
                "priority": 700
            },
            "secured_loan": {
                "content": "Will this loan be secured by property or equipment?",
                "examples": [
                    true
                ],
                "default": true,
                "description": "Whether this is a secured or unsecured loan",
                "type": "boolean",
                "priority": 800,
                "title": "Secured loan?"
            }
        },
        "allOf": [
            {
                "if": {
                    "properties": {
                        "secured_loan": {
                            "enum": [
                                true
                            ]
                        }
                    }
                },
                "then": {
                    "required": [
                        "security_value"
                    ],
                    "properties": {
                        "security_value": {
                            "description": "The value of the asset being offerred as security",
                            "title": "Security Value",
                            "type": "number",
                            "priority": 1000
                        }
                    }
                }
            }
        ],
        "$schema": "http://json-schema.org/draft-07/schema#"
    }
}