{
    "schema_name": "ss_prm_contact_point",
    "schema_version": "0.0.6",
    "schema_type": "ss",
    "schema": {
        "schema_group": "contact_information",
        "tags": [
            "type:client_only"
        ],
        "i18n": {
            "en": {
                "contact_information": {
                    "title_plural": "Contact information",
                    "description": "Contact information",
                    "title": "Contact information"
                }
            }
        },
        "database": {
            "table": "prm_contact_points",
            "primary_key": "id"
        },
        "description": "Contact details",
        "display": {
            "head_main": {
                "fields": [
                    "contact_point_purpose",
                    "contact_point_type",
                    "city"
                ]
            },
            "head_sub": {
                "fields": [
                    "e164",
                    "url",
                    "email_address"
                ]
            },
            "tabular": {
                "fields": [
                    "contact_point_purpose",
                    "contact_point_type",
                    "e164",
                    "url",
                    "email_address"
                ]
            }
        },
        "properties": {
            "start_date": {
                "title": "Start date",
                "description": "The date from which this contact point can be used",
                "type": "string",
                "format": "date-time",
                "priority": 1200,
                "tags": [
                    "group:summary"
                ]
            },
            "end_date": {
                "title": "End date",
                "description": "The date after which this contact point can no longer be used",
                "type": "string",
                "format": "date-time",
                "priority": 1300,
                "tags": [
                    "group:summary"
                ]
            },
            "active": {
                "title": "Active",
                "description": "Whether this contact point can be used or not",
                "type": "boolean",
                "priority": 1400,
                "tags": [
                    "group:summary"
                ]
            },
            "contact_point_purpose": {
                "type": "string",
                "title": "Contact point purpose",
                "description": "The purpose of this contact point",
                "tags": [
                    "group:summary"
                ],
                "priority": 2000
            },
            "contact_point_type": {
                "type": "string",
                "title": "Contact point type",
                "description": "The type of contact point",
                "tags": [
                    "group:summary"
                ],
                "priority": 2100
            },
            "e164": {
                "type": "string",
                "title": "Phone number",
                "description": "The phone number of the contact point",
                "tags": [
                    "group:phone"
                ],
                "priority": 2200
            },
            "e164_suffix": {
                "type": "string",
                "title": "Phone number suffix",
                "description": "The phone number extension",
                "tags": [
                    "group:phone"
                ],
                "priority": 2300
            },
            "e164_type": {
                "type": "string",
                "title": "Phone number type",
                "description": "The type of contact point",
                "tags": [
                    "group:phone"
                ],
                "priority": 2400
            },
            "url": {
                "type": "string",
                "title": "URL",
                "description": "Web address",
                "format": "uri",
                "tags": [
                    "group:url"
                ],
                "priority": 3000
            },
            "url_type": {
                "type": "string",
                "title": "URL type",
                "description": "Type of web address",
                "tags": [
                    "group:url"
                ],
                "priority": 3100
            },
            "email_address": {
                "type": "string",
                "title": "Email address",
                "description": "Email address",
                "tags": [
                    "group:email"
                ],
                "priority": 4000
            },
            "email_address_preferred_format": {
                "type": "string",
                "title": "Email address format",
                "description": "Email address format preferred by the user",
                "tags": [
                    "group:email"
                ],
                "priority": 4100
            },
            "contact_point_number": {
                "type": "integer",
                "title": "Location number",
                "description": "The unique number for this location",
                "priority": 5200,
                "tags": [
                    "group:summary"
                ],
                "readOnly": true
            },
            "id": {
                "type": "string",
                "title": "Unique ID",
                "description": "The unique identifier for this location",
                "priority": 5300,
                "tags": [
                    "group:advanced"
                ],
                "readOnly": true
            },
            "to_table": {
                "type": "string",
                "title": "Related Table",
                "description": "Which party this contact relates to",
                "priority": 5400,
                "tags": [
                    "group:advanced"
                ],
                "readOnly": true
            },
            "to_id": {
                "type": "string",
                "title": "Related ID",
                "description": "The party ID this contact relates to",
                "priority": 5500,
                "tags": [
                    "group:advanced"
                ],
                "readOnly": true
            }
        },
        "title": "Contact",
        "title_plural": "Contacts",
        "$schema": "http://json-schema.org/draft-07/schema#",
        "required": [
            "contact_point_type"
        ],
        "type": "object"
    }
}