[
    {
        "value": "New South Wales",
        "key": "NSW"
    },
    {
        "value": "Northern Territory",
        "key": "NT"
    },
    {
        "value": "Queensland",
        "key": "QLD"
    },
    {
        "value": "South Australia",
        "key": "SA"
    },
    {
        "value": "Tasmania",
        "key": "TAS"
    },
    {
        "value": "Victoria",
        "key": "VIC"
    },
    {
        "value": "Western Australia",
        "key": "WA"
    },
    {
        "value": "Australian Capital Territory",
        "key": "ACT"

    }
]