{
    "schema_name": "ss_assertion_start_quarter_integer",
    "schema_type": "ss",
    "schema_version": "0.0.4",
    "schema": {
        "definitions": {},
        "$schema": "http://json-schema.org/draft-07/schema#",
        "type": "integer",
        "title": "Start quarter",
        "description": "The calendar quarter the account or credential was created or is valid from",
        "encrypt": false,
        "tags": [
            "type:globally_unique_field"
        ]
    }
}