{
    "schema_name": "ss_phone_number_integer",
    "schema_type": "ss",
    "schema_version": "0.1.5",
    "schema": {
        "definitions": {},
        "$schema": "http://json-schema.org/draft-07/schema#",
        "type": "integer",
        "title": "Phone number",
        "description": "Phone number in E.164 format e.g. 15551234567",
        "encrypt": true,
        "examples": [
            642101234567,
            15551234567,
            861234567890
        ],
        "tags": [
            "type:globally_unique_field"
        ]
    }
}