{
    "schema_name": "ss_location_subpremise_string",
    "schema_type": "ss",
    "schema_version": "0.1.4",
    "schema": {
        "definitions": {},
        "$schema": "http://json-schema.org/draft-07/schema#",
        "type": "string",
        "title": "Sub-premise",
        "description": "The address sub-premise",
        "examples": [
            "123"
        ],
        "tags": [
            "type:globally_unique_field"
        ],
        "encrypt": true
    }
}