{
    "schema_name": "ss_identity_document_sex_string",
    "schema_type": "ss",
    "schema_version": "0.1.4",
    "schema": {
        "definitions": {},
        "$schema": "http://json-schema.org/draft-07/schema#",
        "type": "string",
        "title": "Sex",
        "description": "The sex as shown on the identity document",
        "encrypt": true,
        "enum": [
            "M",
            "F"
        ],
        "examples": [
            "M"
        ],
        "tags": [
            "type:globally_unique_field"
        ]
    }
}