{
    "schema_name": "ss_nationality_string",
    "schema_type": "ss",
    "schema_version": "0.1.4",
    "schema": {
        "definitions": {},
        "$schema": "http://json-schema.org/draft-07/schema#",
        "type": "string",
        "title": "Nationality",
        "description": "The nationality of a person",
        "lookup": "{API_DOCS_URL}/lookups/nationalities.json",
        "tags": [
            "type:globally_unique_field"
        ]
    }
}