{
    "schema_name": "ss_fnd_job_update",
    "schema_version": "0.0.4",
    "schema_type": "ss",
    "schema": {
        "tags": [
            "type:client_only"
        ],
        "i18n": {
            "en": {}
        },
        "database": {
            "table": "fnd_jobs",
            "primary_key": "job_number"
        },
        "display": {},
        "properties": {
            "job_number": {
                "title": "Job Number",
                "description": "The Job Number",
                "type": "integer",
                "priority": 1000,
                "tags": []
            },
            "id": {
                "title": "Id",
                "description": "The Id",
                "type": "string",
                "priority": 1100,
                "tags": [],
                "readOnly": true
            },
            "job_phase": {
                "title": "Job Phase",
                "description": "The Job Phase",
                "type": "string",
                "priority": 1200,
                "tags": []
            },
            "job_status": {
                "title": "Job Status",
                "description": "The Job Status",
                "type": "string",
                "priority": 1300,
                "tags": []
            },
            "scheduled_start_date": {
                "title": "Scheduled Start Date",
                "description": "The Scheduled Start Date",
                "type": "string",
                "format": "date-time",
                "priority": 1500,
                "tags": []
            },
            "scheduled_end_date": {
                "title": "Scheduled End Date",
                "description": "The Scheduled End Date",
                "type": "string",
                "format": "date-time",
                "priority": 3400,
                "tags": []
            }
        },
        "title": "Batch job",
        "title_plural": "Batch jobs",
        "title_description": "",
        "$schema": "http://json-schema.org/draft-07/schema#",
        "required": [
            "job_number",
            "id",
            "scheduled_start_date"
        ],
        "type": "object"
    }
}