{
    "schema_name": "ss_household_group_name_string",
    "schema_type": "ss",
    "schema_version": "0.1.7",
    "schema": {
        "definitions": {},
        "$schema": "http://json-schema.org/draft-07/schema#",
        "type": "string",
        "title": "Household name",
        "description": "The person's household group name",
        "encrypt": true,
        "examples": [
            "Big Red",
            "The Sandersons and Bob"
        ],
        "tags": [
            "type:globally_unique_field"
        ]
    }
}