{
    "schema_name": "ss_Statement_Financial_Position",
    "schema_type": "ss",
    "schema_version": "0.0.3",
    "schema": {
        "schema_group": "financial_information",
        "i18n": {
            "en": {
                "financial_information": {
                    "title_plural": "Financial information",
                    "description": "Financial information",
                    "title": "Financial information"
                }
            }
        },
        "definitions": {},
        "description": "Your Statement of Financial Position",
        "tags": [],
        "type": "object",
        "title": "Statement of Financial Position",
        "required": [
            "income_period",
            "expense_period"
        ],
        "properties": {},
        "$schema": "http://json-schema.org/draft-07/schema#"
    }
}