[
    {
        "value": "Send email",
        "key": "email"
    },
    {
        "value": "Generate webhook",
        "key": "webhook"
    },
    {
        "value": "Application request",
        "key": "application_request_create"
    },
    {
        "value": "Cancel application request",
        "key": "application_request_cancel"
    }
]