{
    "schema_name": "ss_nz_nzbn_string",
    "schema_type": "ss",
    "schema_version": "0.1.4",
    "schema": {
        "$schema": "http://json-schema.org/draft-07/schema#",
        "encrypt": true,
        "type": "string",
        "tags": [
            "type:globally_unique_field"
        ],
        "description": "New Zealand Business Number",
        "examples": [
            "9429035530732"
        ],
        "title": "NZBN"
    }
}