{
    "schema_name": "ss_Stripe_Payment",
    "schema_version": "0.0.17",
    "schema_type": "ss",
    "schema": {
        "description": "Stripe payment intent",
        "$schema": "http://json-schema.org/draft-07/schema#",
        "definitions": {
            "ss_email_address_string": {
                "$ref": "urn:schema:ss_email_address_string"
            }
        },
        "type": "object",
        "title": "Verified Credit Card",
        "required": [
            "credit_card_last4"
        ],
        "display": {
            "head_main": {
                "fields": [
                    "credit_card_last4"
                ]
            }
        },
        "tags": [
            "action:verify",
            "action:map"
        ],
        "i18n": {
            "en": {
                "$loading_save": {
                    "title": "Sending credit card to Stripe"
                },
                "$loading_verify": {
                    "title": "Authorizing credit card"
                }
            }
        },
        "verified_fields": [
            "stripe_payment_method_id",
            "stripe_customer_id",
            "credit_card_last4",
            "credit_card_exp_month",
            "credit_card_exp_year",
            "credit_card_country",
            "credit_card_brand"
        ],
        "properties": {
            "email_address": {
                "allOf": [
                    {
                        "$ref": "#/definitions/ss_email_address_string"
                    },
                    {
                        "priority": 25,
                        "readOnly": true,
                        "description": "Enter your billing email address",
                        "tags": [
                            "group:email"
                        ]
                    }
                ]
            },
            "bpk_id": {
                "type": "string",
                "title": "BPK ID",
                "$schema": "http://json-schema.org/draft-07/schema#",
                "description": "Billing provider API key ID",
                "priority": 50,
                "tags": [
                    "group:stripe_elements"
                ],
                "readOnly": true
            },
            "stripe_payment_method_id": {
                "type": "string",
                "title": "Credit card token",
                "$schema": "http://json-schema.org/draft-07/schema#",
                "description": "Credit card token",
                "priority": 100,
                "tags": [
                    "group:stripe_elements"
                ],
                "readOnly": true
            },
            "stripe_customer_id": {
                "type": "string",
                "title": "Stripe customer ID",
                "$schema": "http://json-schema.org/draft-07/schema#",
                "description": "Stripe customer ID",
                "priority": 150,
                "tags": [
                    "group:stripe_elements"
                ],
                "readOnly": true
            },
            "reference": {
                "type": "string",
                "title": "Reference",
                "$schema": "http://json-schema.org/draft-07/schema#",
                "description": "Reference",
                "priority": 170,
                "tags": [
                    "group:stripe_elements"
                ],
                "readOnly": true
            },
            "skus": {
                "type": "string",
                "title": "SKUs",
                "$schema": "http://json-schema.org/draft-07/schema#",
                "description": "SKUs",
                "priority": 200,
                "tags": [
                    "group:stripe_elements"
                ],
                "readOnly": true
            },
            "credit_card_last4": {
                "type": "string",
                "title": "Last 4 digits",
                "$schema": "http://json-schema.org/draft-07/schema#",
                "description": "Credit card last 4 digits",
                "priority": 300,
                "tags": [
                    "group:stripe_elements"
                ],
                "readOnly": true
            },
            "credit_card_exp_month": {
                "type": "string",
                "title": "Expiry month",
                "$schema": "http://json-schema.org/draft-07/schema#",
                "description": "Credit card expiry month",
                "priority": 400,
                "tags": [
                    "group:stripe_elements"
                ],
                "readOnly": true
            },
            "credit_card_exp_year": {
                "type": "string",
                "title": "Expiry year",
                "$schema": "http://json-schema.org/draft-07/schema#",
                "description": "Credit card expiry year",
                "priority": 500,
                "tags": [
                    "group:stripe_elements"
                ],
                "readOnly": true
            },
            "credit_card_country": {
                "type": "string",
                "title": "Issuer country",
                "$schema": "http://json-schema.org/draft-07/schema#",
                "description": "Credit card expiry year",
                "priority": 600,
                "tags": [
                    "group:stripe_elements"
                ],
                "lookup": "{API_BASE_URL}/db/v1/fnd_countries?select=key:iso_country_code_2,value:country_name",
                "readOnly": true
            },
            "credit_card_brand": {
                "type": "string",
                "title": "Brand",
                "$schema": "http://json-schema.org/draft-07/schema#",
                "description": "Credit card brand",
                "priority": 700,
                "tags": [
                    "group:stripe_elements"
                ],
                "readOnly": true
            }
        }
    }
}