{
    "schema_name": "ss_OAuth_Tokens_StackOverflow",
    "schema_type": "ss",
    "schema_version": "0.0.5",
    "schema": {
        "type": "object",
        "schema_group": "authentication",
        "tags": [
            "oauth2_component:name:StackOverflow",
            "oauth2_component:redirect_url:https://stackoverflow.com/oauth?client_id=29321&scope={scopes}&redirect_uri={raytioApiUrl}/oauth2-token/v1/oauth2/exchange-token/0ddb9e2f-8766-4679-99ea-c34bce20766e&state={state}"
        ],
        "i18n": {
            "en": {
                "authentication": {
                    "title_plural": "Authentication details",
                    "description": "Authentication details for third party applications",
                    "title": "Authentication details"
                }
            }
        },
        "properties": {
            "scopes": {
                "type": "array",
                "title": "Scopes",
                "description": "The StackOverflow scopes to give Raytio access to",
                "default": [
                    "no_expiry",
                    "read_inbox",
                    "private_info"
                ],
                "tags": [
                    "group:oauth2",
                    "special:hide_select_behind_button"
                ],
                "priority": 1000,
                "items": {
                    "type": "string"
                },
                "lookup": "{API_DOCS_URL}/lookups/stackoverflow_scopes.json"
            },
            "name": {
                "type": "string",
                "title": "Name",
                "description": "Your name for these authentication credentials",
                "priority": 1100,
                "tags": [
                    "group:oauth2"
                ]
            },
            "encryption": {
                "readOnly": true,
                "description": "Details of the method used to encrypt the StackOverflow data",
                "tags": [
                    "group:oauth2"
                ],
                "title": "Encryption details",
                "priority": 1400,
                "encrypt": true,
                "type": "object"
            },
            "access_token": {
                "readOnly": true,
                "description": "The access token",
                "tags": [
                    "group:oauth2"
                ],
                "encrypt": true,
                "priority": 2000,
                "title": "Access token",
                "type": "string"
            },
            "hashed_access_token": {
                "readOnly": true,
                "tags": [
                    "group:oauth2"
                ],
                "description": "The encrypted access token",
                "title": "Hashed access token",
                "priority": 2100,
                "type": "string"
            },
            "access_token_expiry_date": {
                "readOnly": true,
                "tags": [
                    "group:oauth2"
                ],
                "description": "The date and time when the access token expires",
                "title": "Access token expiry",
                "priority": 2200,
                "type": "string",
                "format": "date-time"
            },
            "id_token": {
                "readOnly": true,
                "description": "The id token",
                "tags": [
                    "group:oauth2"
                ],
                "encrypt": true,
                "title": "ID token",
                "priority": 3000,
                "type": "string"
            },
            "hashed_id_token": {
                "readOnly": true,
                "tags": [
                    "group:oauth2"
                ],
                "description": "The encrypted id token",
                "title": "Hashed id token",
                "priority": 3100,
                "type": "string"
            },
            "refresh_token": {
                "readOnly": true,
                "description": "The refresh token",
                "tags": [
                    "group:oauth2"
                ],
                "encrypt": true,
                "title": "Refresh token",
                "priority": 4000,
                "type": "string"
            },
            "hashed_refresh_token": {
                "readOnly": true,
                "tags": [
                    "group:oauth2"
                ],
                "description": "The encrypted refresh token",
                "title": "Hashed refresh token",
                "priority": 4100,
                "type": "string"
            }
        },
        "display": {
            "head_main": {
                "fields": [
                    "name"
                ]
            },
            "expand": [
                {
                    "fields": [
                        "encryption",
                        "id_token",
                        "hashed_refresh_token",
                        "hashed_access_token",
                        "hashed_id_token"
                    ],
                    "label": "Advanced"
                }
            ]
        },
        "description": "Connect your StackOverflow account to your profile",
        "$schema": "http://json-schema.org/draft-07/schema#",
        "title": "StackOverflow OAuth tokens",
        "required": [
            "scopes"
        ]
    }
}