{
    "schema_name": "ss_Identity_Binding",
    "schema_type": "ss",
    "schema_version": "0.0.22",
    "schema": {
        "required": [
            "source_document_urn",
            "target_document_urn"
        ],
        "description": "Match a video of the person to an image from a photo ID document",
        "type": "object",
        "schema_group": "identity_information",
        "i18n": {
            "en": {
                "identity_information": {
                    "title_plural": "Identity information",
                    "description": "Identity information",
                    "title": "Identity information"
                }
            }
        },
        "properties": {
            "target_document_urn": {
                "type": "string",
                "description": "An identity document with the person's image on it",
                "priority": 200,
                "title": "Identity document",
                "display": {
                    "main_media": "identity_document_picture_extracted_photo_page"
                },
                "tags": [
                    "group:selectProfileObject:ss_Global_Identity_Document",
                    "display:main_media:identity_document_picture_extracted_photo_page"
                ]
            },
            "source_document_urn": {
                "type": "string",
                "description": "Select the video",
                "title": "Live person video",
                "priority": 100,
                "display": {
                    "main_media": "video"
                },
                "tags": [
                    "group:selectProfileObject:ss_Live_Person",
                    "display:main_media:video"
                ]
            }
        },
        "$schema": "http://json-schema.org/draft-07/schema#",
        "tags": [
            "action:verify",
            "action:require_webauthn",
            "action:experimental_pass_object_store_id",
            "time:verify_pending_delay:15"
        ],
        "verified_fields": [
            "source_document_urn"
        ],
        "title": "Identity binding"
    }
}