[
    {
        "key": "Registered",
        "value": "Registered"
    },
    {
        "key": "VoluntaryAdministration",
        "value": "Voluntary Administration"
    },
    {
        "key": "InLiquidation",
        "value": "In Liquidation"
    },
    {
        "key": "InReceivership",
        "value": "In Receivership"
    },
    {
        "key": "InStatutoryAdministration",
        "value": "In Statutory Administration"
    },
    {
        "key": "RemovedClosed",
        "value": "Removed"
    },
    {
        "key": "Inactive",
        "value": "Inactive (unincorporated entities only)"
    }
]