{
    "schema_name": "ss_Connected_Account_Xero_Publish",
    "schema_type": "ss",
    "schema_version": "0.0.7",
    "schema": {
        "type": "object",
        "properties": {
            "publish_data": {
                "tags": [
                    "display:customModal"
                ],
                "title": "Publish data",
                "add_row_btn_label": "Choose data to publish",
                "type": "array",
                "required": [
                    "data_type",
                    "accuracy"
                ],
                "items": {
                    "type": "object",
                    "properties": {
                        "data_type": {
                            "type": "string",
                            "title": "Data to publish",
                            "priority": 100,
                            "lookup": "{API_DOCS_URL}/lookups/xero_data_types.json"
                        },
                        "accuracy": {
                            "type": "integer",
                            "title": "Round to",
                            "description": "Round to the nearest number. For example if 1000 is chosen then all numbers are rounded to the nearest 1000 (excluding percentages)",
                            "priority": 200,
                            "enum": [
                                10,
                                100,
                                1000,
                                10000,
                                100000,
                                1000000
                            ]
                        },
                        "published_through": {
                            "type": "integer",
                            "title": "Published through",
                            "description": "The date that data of this type is published through until",
                            "readOnly": true,
                            "priority": 300,
                            "tags": [
                                "display:showOnWizard"
                            ]
                        }
                    }
                }
            }
        },
        "tags": [
            "type:client_only"
        ],
        "description": "Publish your Xero data publicly and anonymously",
        "$schema": "http://json-schema.org/draft-07/schema#",
        "title": "Publish Xero data"
    }
}