{
    "schema_name": "ss_identity_document_issue_month_integer",
    "schema_type": "ss",
    "schema_version": "0.1.4",
    "schema": {
        "definitions": {},
        "$schema": "http://json-schema.org/draft-07/schema#",
        "type": "integer",
        "minimum": 1,
        "maximum": 12,
        "title": "Issue month",
        "description": "The issue month of the identity document",
        "encrypt": true,
        "tags": [
            "type:globally_unique_field"
        ]
    }
}