{
    "schema_name": "ss_Email_Address",
    "schema_version": "0.3.7",
    "schema_type": "ss",
    "schema": {
        "schema_group": "contact_information",
        "i18n": {
            "en": {
                "contact_information": {
                    "title_plural": "Contact information",
                    "description": "Contact information",
                    "title": "Contact information"
                },
                "$loading_save": {
                    "title": "Storing email address"
                },
                "$loading_create_sub_obj": {
                    "title": "Storing email address"
                },
                "$loading_verify": {
                    "title": "Sending/checking verification code"
                },
                "$loading_delete_pending_ver": {
                    "title": "Sending/checking verification code"
                },
                "$loading_update": {
                    "title": "Storing verification code"
                },
                "$loading_pending_ver_resubmit": {
                    "title": "Please enter the verification code"
                }
            }
        },
        "definitions": {
            "ss_email_address_string": {
                "$ref": "urn:schema:ss_email_address_string"
            },
            "ss_webauthn_credential_id_string": {
                "$ref": "urn:schema:ss_webauthn_credential_id_string"
            }
        },
        "description": "A verified email address",
        "display": {
            "head_main": {
                "fields": [
                    "email_address"
                ]
            },
            "expand": [
                {
                    "fields": [
                        "verification_code"
                    ]
                }
            ]
        },
        "properties": {
            "email_address": {
                "allOf": [
                    {
                        "$ref": "#/definitions/ss_email_address_string"
                    },
                    {
                        "priority": 10,
                        "tags": [
                            "group:email",
                            "action:require_webauthn",
                            "display:no_autofill"
                        ]
                    }
                ]
            },
            "verification_code": {
                "type": "string",
                "title": "Verification code",
                "description": "Enter the verification code that was sent to your email address. Note that the verification will come from Raytio identity. PLEASE CHECK YOUR SPAM, PROMOTIONS AND ALL OTHER EMAIL FOLDERS",
                "examples": [
                    "123456"
                ],
                "priority": 20,
                "tags": [
                    "group:email",
                    "verify:show_if_pending",
                    "type:verification_code"
                ]
            },
            "webauthn_credential_ids": {
                "items": {
                    "allOf": [
                        {
                            "$ref": "#/definitions/ss_webauthn_credential_id_string"
                        }
                    ]
                },
                "description": "A list of WebAuthn credential IDs that can be used to present this object",
                "priority": 30,
                "title": "WebAuthn credential IDs",
                "readOnly": true,
                "type": "array"
            },
            "hash_pepper": {
                "type": "string",
                "title": "Hash pepper",
                "description": "A secret value used to generate the platform_unique_id",
                "readOnly": true,
                "encrypt": true,
                "priority": 90,
                "tags": [
                    "action:generate_pepper:16"
                ]
            },
            "platform_unique_id": {
                "type": "string",
                "title": "Platform unique ID",
                "description": "The hashed unique ID for this entity type",
                "hash_inputs": "$hash_pepper|email_address|IETF RFC 5322|||$email_address|",
                "readOnly": true,
                "priority": 100,
                "tags": [
                    "action:hash"
                ]
            }
        },
        "required": [
            "email_address"
        ],
        "tags": [
            "action:verify",
            "time:verify:15"
        ],
        "verified_fields": [
            "email_address"
        ],
        "title": "Email address",
        "$schema": "http://json-schema.org/draft-07/schema#",
        "type": "object"
    }
}