[
    {
        "id": "XPL-NAME",
        "manufacturer_id" : "VO",
        "metadata": {
            "key2": "abc"
        }
    },
    {
        "id": "XPL-NAME",
        "manufacturer_id" : "MB",
        "metadata": {
            "key2": "abc"
        }
    },
    {
        "id": "XPL-DESC",
        "metadata": {
            "rb": "CTX-CCR"
        }
    },
    {
        "id": "CTX-CCR",
        "metadata": {
            "key2": "xyz"
        }
    }
]