{
    "schema_name": "ss_identity_document_alternative_identifier_string",
    "schema_type": "ss",
    "schema_version": "0.1.4",
    "schema": {
        "definitions": {},
        "$schema": "http://json-schema.org/draft-07/schema#",
        "type": "string",
        "title": "Identity document identifier",
        "description": "The identity document number",
        "encrypt": true,
        "examples": [
            "LZ123456"
        ],
        "tags": [
            "type:globally_unique_field"
        ]
    }
}