{
  "LTD": "NZ Limited Company",
  "ULTD": "NZ Unlimited Company",
  "COOP": "NZ Co-operative Company",
  "NZCompany": "All NZ company types",
  "ASIC": "Overseas ASIC Company",
  "NON_ASIC": "Overseas Non-ASIC Company",
  "OverseasCompany": "All overseas company types",
  "Sole_Trader": "Sole Trader",
  "Partnership": "Partnership",
  "Trading_Trust": "Trust",
  "T": "Charitable Trust",
  "B": "Building Society",
  "D": "Credit Union",
  "F": "Friendly Society",
  "I": "Incorporated Society",
  "N": "Industrial & Provident Society",
  "Y": "Limited Partnership (NZ)",
  "Z": "Limited Partnership (Overseas)",
  "S": "Special Bodies/Other entities",
  "GovtCentral": "Central government agencies",
  "GovtLocal": "Local government agencies",
  "GovtEdu": "Government educational facilities, including schools",
  "GovtOther": "Other public entities"
}