info face="face" size=60
common lineHeight=60 scaleW=445 scaleH=432 pages=1
page id=0 file="common_num_2.png"
chars count=44
char id=37 x=92 y=0 width=62 height=60 xoffset=0 yoffset=0 xadvance=62 page=0 chnl=15
char id=43 x=320 y=310 width=33 height=60 xoffset=0 yoffset=0 xadvance=33 page=0 chnl=15
char id=44 x=355 y=310 width=33 height=60 xoffset=0 yoffset=0 xadvance=33 page=0 chnl=15
char id=45 x=412 y=0 width=33 height=60 xoffset=0 yoffset=0 xadvance=33 page=0 chnl=15
char id=32 x=412 y=62 width=33 height=60 xoffset=0 yoffset=0 xadvance=33 page=0 chnl=15
char id=48 x=0 y=62 width=62 height=60 xoffset=0 yoffset=0 xadvance=62 page=0 chnl=15
char id=49 x=64 y=62 width=62 height=60 xoffset=0 yoffset=0 xadvance=62 page=0 chnl=15
char id=50 x=156 y=0 width=62 height=60 xoffset=0 yoffset=0 xadvance=62 page=0 chnl=15
char id=51 x=156 y=62 width=62 height=60 xoffset=0 yoffset=0 xadvance=62 page=0 chnl=15
char id=52 x=0 y=124 width=62 height=60 xoffset=0 yoffset=0 xadvance=62 page=0 chnl=15
char id=53 x=64 y=124 width=62 height=60 xoffset=0 yoffset=0 xadvance=62 page=0 chnl=15
char id=54 x=128 y=124 width=62 height=60 xoffset=0 yoffset=0 xadvance=62 page=0 chnl=15
char id=55 x=220 y=0 width=62 height=60 xoffset=0 yoffset=0 xadvance=62 page=0 chnl=15
char id=56 x=220 y=62 width=62 height=60 xoffset=0 yoffset=0 xadvance=62 page=0 chnl=15
char id=57 x=220 y=124 width=62 height=60 xoffset=0 yoffset=0 xadvance=62 page=0 chnl=15
char id=47 x=412 y=124 width=33 height=60 xoffset=0 yoffset=0 xadvance=33 page=0 chnl=15
char id=65 x=0 y=186 width=62 height=60 xoffset=0 yoffset=0 xadvance=62 page=0 chnl=15
char id=66 x=64 y=186 width=62 height=60 xoffset=0 yoffset=0 xadvance=62 page=0 chnl=15
char id=67 x=128 y=186 width=62 height=60 xoffset=0 yoffset=0 xadvance=62 page=0 chnl=15
char id=68 x=192 y=186 width=62 height=60 xoffset=0 yoffset=0 xadvance=62 page=0 chnl=15
char id=69 x=284 y=0 width=62 height=60 xoffset=0 yoffset=0 xadvance=62 page=0 chnl=15
char id=70 x=284 y=62 width=62 height=60 xoffset=0 yoffset=0 xadvance=62 page=0 chnl=15
char id=71 x=284 y=124 width=62 height=60 xoffset=0 yoffset=0 xadvance=62 page=0 chnl=15
char id=72 x=284 y=186 width=62 height=60 xoffset=0 yoffset=0 xadvance=62 page=0 chnl=15
char id=73 x=412 y=186 width=33 height=60 xoffset=0 yoffset=0 xadvance=33 page=0 chnl=15
char id=74 x=412 y=248 width=33 height=60 xoffset=0 yoffset=0 xadvance=33 page=0 chnl=15
char id=75 x=0 y=248 width=62 height=60 xoffset=0 yoffset=0 xadvance=62 page=0 chnl=15
char id=76 x=64 y=248 width=62 height=60 xoffset=0 yoffset=0 xadvance=62 page=0 chnl=15
char id=77 x=128 y=248 width=62 height=60 xoffset=0 yoffset=0 xadvance=62 page=0 chnl=15
char id=78 x=192 y=248 width=62 height=60 xoffset=0 yoffset=0 xadvance=62 page=0 chnl=15
char id=79 x=256 y=248 width=62 height=60 xoffset=0 yoffset=0 xadvance=62 page=0 chnl=15
char id=58 x=412 y=310 width=33 height=60 xoffset=0 yoffset=0 xadvance=33 page=0 chnl=15
char id=80 x=348 y=0 width=62 height=60 xoffset=0 yoffset=0 xadvance=62 page=0 chnl=15
char id=46 x=0 y=372 width=33 height=60 xoffset=0 yoffset=0 xadvance=33 page=0 chnl=15
char id=81 x=348 y=62 width=62 height=60 xoffset=0 yoffset=0 xadvance=62 page=0 chnl=15
char id=82 x=348 y=124 width=62 height=60 xoffset=0 yoffset=0 xadvance=62 page=0 chnl=15
char id=83 x=348 y=186 width=62 height=60 xoffset=0 yoffset=0 xadvance=62 page=0 chnl=15
char id=84 x=348 y=248 width=62 height=60 xoffset=0 yoffset=0 xadvance=62 page=0 chnl=15
char id=85 x=0 y=310 width=62 height=60 xoffset=0 yoffset=0 xadvance=62 page=0 chnl=15
char id=86 x=64 y=310 width=62 height=60 xoffset=0 yoffset=0 xadvance=62 page=0 chnl=15
char id=87 x=0 y=0 width=90 height=60 xoffset=0 yoffset=0 xadvance=90 page=0 chnl=15
char id=88 x=128 y=310 width=62 height=60 xoffset=0 yoffset=0 xadvance=62 page=0 chnl=15
char id=89 x=192 y=310 width=62 height=60 xoffset=0 yoffset=0 xadvance=62 page=0 chnl=15
char id=90 x=256 y=310 width=62 height=60 xoffset=0 yoffset=0 xadvance=62 page=0 chnl=15
