info face="face" size=72
common lineHeight=72 scaleW=474 scaleH=442 pages=1
page id=0 file="common_num_1.png"
chars count=44
char id=37 x=92 y=0 width=62 height=72 xoffset=0 yoffset=0 xadvance=62 page=0 chnl=15
char id=43 x=0 y=370 width=33 height=72 xoffset=0 yoffset=0 xadvance=33 page=0 chnl=15
char id=44 x=35 y=370 width=33 height=72 xoffset=0 yoffset=0 xadvance=33 page=0 chnl=15
char id=45 x=70 y=370 width=33 height=72 xoffset=0 yoffset=0 xadvance=33 page=0 chnl=15
char id=32 x=105 y=370 width=33 height=72 xoffset=0 yoffset=0 xadvance=33 page=0 chnl=15
char id=48 x=0 y=74 width=62 height=72 xoffset=0 yoffset=0 xadvance=62 page=0 chnl=15
char id=49 x=64 y=74 width=62 height=72 xoffset=0 yoffset=0 xadvance=62 page=0 chnl=15
char id=50 x=156 y=0 width=62 height=72 xoffset=0 yoffset=0 xadvance=62 page=0 chnl=15
char id=51 x=156 y=74 width=62 height=72 xoffset=0 yoffset=0 xadvance=62 page=0 chnl=15
char id=52 x=220 y=0 width=62 height=72 xoffset=0 yoffset=0 xadvance=62 page=0 chnl=15
char id=53 x=220 y=74 width=62 height=72 xoffset=0 yoffset=0 xadvance=62 page=0 chnl=15
char id=54 x=0 y=148 width=62 height=72 xoffset=0 yoffset=0 xadvance=62 page=0 chnl=15
char id=55 x=64 y=148 width=62 height=72 xoffset=0 yoffset=0 xadvance=62 page=0 chnl=15
char id=56 x=128 y=148 width=62 height=72 xoffset=0 yoffset=0 xadvance=62 page=0 chnl=15
char id=57 x=192 y=148 width=62 height=72 xoffset=0 yoffset=0 xadvance=62 page=0 chnl=15
char id=47 x=140 y=370 width=33 height=72 xoffset=0 yoffset=0 xadvance=33 page=0 chnl=15
char id=65 x=284 y=0 width=62 height=72 xoffset=0 yoffset=0 xadvance=62 page=0 chnl=15
char id=66 x=284 y=74 width=62 height=72 xoffset=0 yoffset=0 xadvance=62 page=0 chnl=15
char id=67 x=284 y=148 width=62 height=72 xoffset=0 yoffset=0 xadvance=62 page=0 chnl=15
char id=68 x=0 y=222 width=62 height=72 xoffset=0 yoffset=0 xadvance=62 page=0 chnl=15
char id=69 x=64 y=222 width=62 height=72 xoffset=0 yoffset=0 xadvance=62 page=0 chnl=15
char id=70 x=128 y=222 width=62 height=72 xoffset=0 yoffset=0 xadvance=62 page=0 chnl=15
char id=71 x=192 y=222 width=62 height=72 xoffset=0 yoffset=0 xadvance=62 page=0 chnl=15
char id=72 x=256 y=222 width=62 height=72 xoffset=0 yoffset=0 xadvance=62 page=0 chnl=15
char id=73 x=175 y=370 width=33 height=72 xoffset=0 yoffset=0 xadvance=33 page=0 chnl=15
char id=74 x=210 y=370 width=33 height=72 xoffset=0 yoffset=0 xadvance=33 page=0 chnl=15
char id=75 x=348 y=0 width=62 height=72 xoffset=0 yoffset=0 xadvance=62 page=0 chnl=15
char id=76 x=348 y=74 width=62 height=72 xoffset=0 yoffset=0 xadvance=62 page=0 chnl=15
char id=77 x=348 y=148 width=62 height=72 xoffset=0 yoffset=0 xadvance=62 page=0 chnl=15
char id=78 x=348 y=222 width=62 height=72 xoffset=0 yoffset=0 xadvance=62 page=0 chnl=15
char id=79 x=0 y=296 width=62 height=72 xoffset=0 yoffset=0 xadvance=62 page=0 chnl=15
char id=58 x=245 y=370 width=33 height=72 xoffset=0 yoffset=0 xadvance=33 page=0 chnl=15
char id=80 x=64 y=296 width=62 height=72 xoffset=0 yoffset=0 xadvance=62 page=0 chnl=15
char id=46 x=280 y=370 width=33 height=72 xoffset=0 yoffset=0 xadvance=33 page=0 chnl=15
char id=81 x=128 y=296 width=62 height=72 xoffset=0 yoffset=0 xadvance=62 page=0 chnl=15
char id=82 x=192 y=296 width=62 height=72 xoffset=0 yoffset=0 xadvance=62 page=0 chnl=15
char id=83 x=256 y=296 width=62 height=72 xoffset=0 yoffset=0 xadvance=62 page=0 chnl=15
char id=84 x=320 y=296 width=62 height=72 xoffset=0 yoffset=0 xadvance=62 page=0 chnl=15
char id=85 x=412 y=0 width=62 height=72 xoffset=0 yoffset=0 xadvance=62 page=0 chnl=15
char id=86 x=412 y=74 width=62 height=72 xoffset=0 yoffset=0 xadvance=62 page=0 chnl=15
char id=87 x=0 y=0 width=90 height=72 xoffset=0 yoffset=0 xadvance=90 page=0 chnl=15
char id=88 x=412 y=148 width=62 height=72 xoffset=0 yoffset=0 xadvance=62 page=0 chnl=15
char id=89 x=412 y=222 width=62 height=72 xoffset=0 yoffset=0 xadvance=62 page=0 chnl=15
char id=90 x=412 y=296 width=62 height=72 xoffset=0 yoffset=0 xadvance=62 page=0 chnl=15
