info face="face" size=84
common lineHeight=84 scaleW=306 scaleH=256 pages=1
page id=0 file="countdown_num.png"
chars count=10
char id=48 x=0 y=0 width=75 height=84 xoffset=0 yoffset=0 xadvance=75 page=0 chnl=15
char id=49 x=77 y=0 width=75 height=84 xoffset=0 yoffset=0 xadvance=75 page=0 chnl=15
char id=50 x=154 y=0 width=75 height=84 xoffset=0 yoffset=0 xadvance=75 page=0 chnl=15
char id=51 x=0 y=86 width=75 height=84 xoffset=0 yoffset=0 xadvance=75 page=0 chnl=15
char id=52 x=77 y=86 width=75 height=84 xoffset=0 yoffset=0 xadvance=75 page=0 chnl=15
char id=53 x=154 y=86 width=75 height=84 xoffset=0 yoffset=0 xadvance=75 page=0 chnl=15
char id=54 x=231 y=0 width=75 height=84 xoffset=0 yoffset=0 xadvance=75 page=0 chnl=15
char id=55 x=231 y=86 width=75 height=84 xoffset=0 yoffset=0 xadvance=75 page=0 chnl=15
char id=56 x=0 y=172 width=75 height=84 xoffset=0 yoffset=0 xadvance=75 page=0 chnl=15
char id=57 x=77 y=172 width=75 height=84 xoffset=0 yoffset=0 xadvance=75 page=0 chnl=15
