info face="face" size=22
common lineHeight=22 scaleW=83 scaleH=46 pages=1
page id=0 file="roadmap_num.png"
chars count=10
char id=48 x=0 y=0 width=15 height=22 xoffset=0 yoffset=0 xadvance=15 page=0 chnl=15
char id=49 x=17 y=0 width=15 height=22 xoffset=0 yoffset=0 xadvance=15 page=0 chnl=15
char id=50 x=34 y=0 width=15 height=22 xoffset=0 yoffset=0 xadvance=15 page=0 chnl=15
char id=51 x=0 y=24 width=15 height=22 xoffset=0 yoffset=0 xadvance=15 page=0 chnl=15
char id=52 x=17 y=24 width=15 height=22 xoffset=0 yoffset=0 xadvance=15 page=0 chnl=15
char id=53 x=34 y=24 width=15 height=22 xoffset=0 yoffset=0 xadvance=15 page=0 chnl=15
char id=54 x=51 y=0 width=15 height=22 xoffset=0 yoffset=0 xadvance=15 page=0 chnl=15
char id=55 x=51 y=24 width=15 height=22 xoffset=0 yoffset=0 xadvance=15 page=0 chnl=15
char id=56 x=68 y=0 width=15 height=22 xoffset=0 yoffset=0 xadvance=15 page=0 chnl=15
char id=57 x=68 y=24 width=15 height=22 xoffset=0 yoffset=0 xadvance=15 page=0 chnl=15
