{
  "extendSessionAPI": "https://www-idn.card168.cc/mem/extendSession.php",
  "gameServerUrl": "https://www-aresapi.card168.cc",
  "apiBase": "https://aresbet-stg.amddos.net/",
  "kickAndLoginAPI": "https://aresbet-stg.amddos.net/mem/kickAndLogin.php",
  "normalLoginAPI": "https://aresbet-stg.amddos.net/mem/login.php",
  "setLangAPI": "https://www-idn.card168.cc/mem/setLang.php",
  "vendorLoginAPI": "/apis/PKMB/Login.php",
  "env": "SIT"
}
