{
  "__type__": "cc.AnimationClip",
  "_name": "winloseAmount",
  "_objFlags": 0,
  "_native": "",
  "_duration": 1.5,
  "sample": 60,
  "speed": 1,
  "wrapMode": 1,
  "curveData": {
    "props": {
      "y": [
        {
          "frame": 0,
          "value": 0
        },
        {
          "frame": 1.5,
          "value": 100
        }
      ],
      "opacity": [
        {
          "frame": 0,
          "value": 0
        },
        {
          "frame": 0.3333333333333333,
          "value": 255
        },
        {
          "frame": 1.1666666666666667,
          "value": 255
        },
        {
          "frame": 1.5,
          "value": 0
        }
      ],
      "scale": [
        {
          "frame": 0,
          "value": {
            "__type__": "cc.Vec2",
            "x": 0.95,
            "y": 0.95
          }
        },
        {
          "frame": 0.3333333333333333,
          "value": {
            "__type__": "cc.Vec2",
            "x": 1,
            "y": 1
          }
        }
      ]
    }
  },
  "events": []
}