{
	"info": {
		"_postman_id": "2cc7efb7-7c02-4ba9-9bd0-8d100c6a18c7",
		"name": "Capstone-2",
		"schema": "https://schema.getpostman.com/json/collection/v2.1.0/collection.json"
	},
	"item": [
		{
			"name": "User Registration",
			"request": {
				"method": "POST",
				"header": [],
				"body": {
					"mode": "raw",
					"raw": "{\r\n    \"firstName\": \"Angels\",\r\n    \"lastName\": \"Burger\",\r\n    \"email\": \"wew123@mail.com\",\r\n    \"mobileNo\": \"80000000\",\r\n    \"password\": \"wew123\"    \r\n}",
					"options": {
						"raw": {
							"language": "json"
						}
					}
				},
				"url": {
					"raw": "localhost:4000/users/register",
					"host": [
						"localhost"
					],
					"port": "4000",
					"path": [
						"users",
						"register"
					]
				}
			},
			"response": []
		},
		{
			"name": "User Authentication",
			"request": {
				"method": "POST",
				"header": [],
				"body": {
					"mode": "raw",
					"raw": "{\r\n    \"email\": \"crystal123@mail.com\",\r\n    \"password\": \"crystal123\"\r\n}",
					"options": {
						"raw": {
							"language": "json"
						}
					}
				},
				"url": {
					"raw": "localhost:4000/users/login",
					"host": [
						"localhost"
					],
					"port": "4000",
					"path": [
						"users",
						"login"
					]
				}
			},
			"response": []
		},
		{
			"name": "Retrieve All Active Products",
			"request": {
				"auth": {
					"type": "bearer",
					"bearer": [
						{
							"key": "token",
							"value": "eyJhbGciOiJIUzI1NiIsInR5cCI6IkpXVCJ9.eyJpZCI6IjYzY2E0ZTZjZjhhMDQxZGVkZGRlODJiYSIsImVtYWlsIjoicG90YXRvMTIzQG1haWwuY29tIiwiaXNBZG1pbiI6dHJ1ZSwiaWF0IjoxNjc0NDQ0NjU5fQ.EBUAhF4IDUTzAangu742F8g9O0Nua4bnWcij98NXm30",
							"type": "string"
						}
					]
				},
				"method": "GET",
				"header": [],
				"url": {
					"raw": "localhost:4000/products",
					"host": [
						"localhost"
					],
					"port": "4000",
					"path": [
						"products"
					]
				}
			},
			"response": []
		},
		{
			"name": "Create Product (Admin)",
			"request": {
				"auth": {
					"type": "bearer",
					"bearer": [
						{
							"key": "token",
							"value": "eyJhbGciOiJIUzI1NiIsInR5cCI6IkpXVCJ9.eyJpZCI6IjYzY2ZhNzNmMjgwMDMwODk5ZDUyY2UwYiIsImVtYWlsIjoiY3J5c3RhbDEyM0BtYWlsLmNvbSIsImlzQWRtaW4iOnRydWUsImlhdCI6MTY3NDYyMzMxOX0._H5OW9ihLSRB47gBXeAy5uMaEa96D0R1nCsEp_Jvdcs",
							"type": "string"
						}
					]
				},
				"method": "POST",
				"header": [],
				"body": {
					"mode": "raw",
					"raw": "{\r\n    \"name\": \"Razer Viper V2 Pro Mouse\",\r\n    \"brand\": \"RAZER\",\r\n    \"description\": \"Esports has a new apex predator. As successor to the award-winning Razer Viper Ultimate, our latest evolution is more than 20% lighter and armed with all-round upgrades for enhanced performance. With one of the lightest wireless gaming mice ever, there’s now nothing holding you back.\",\r\n    \"price\": \"7600\"\r\n}",
					"options": {
						"raw": {
							"language": "json"
						}
					}
				},
				"url": {
					"raw": "localhost:4000/products",
					"host": [
						"localhost"
					],
					"port": "4000",
					"path": [
						"products"
					]
				}
			},
			"response": []
		},
		{
			"name": "Retrieve Single Product",
			"request": {
				"auth": {
					"type": "bearer",
					"bearer": [
						{
							"key": "token",
							"value": "eyJhbGciOiJIUzI1NiIsInR5cCI6IkpXVCJ9.eyJpZCI6IjYzY2ZhNzNmMjgwMDMwODk5ZDUyY2UwYiIsImVtYWlsIjoiY3J5c3RhbDEyM0BtYWlsLmNvbSIsImlzQWRtaW4iOnRydWUsImlhdCI6MTY3NDYyMzY2Mn0.FcwhIqygvq88A0Vu_04oVxBrEGT3RIst7oJ1phSWg6c",
							"type": "string"
						}
					]
				},
				"method": "GET",
				"header": [],
				"url": {
					"raw": "localhost:4000/products/63cfacb6293b50e40476f67e",
					"host": [
						"localhost"
					],
					"port": "4000",
					"path": [
						"products",
						"63cfacb6293b50e40476f67e"
					]
				}
			},
			"response": []
		},
		{
			"name": "Update Product Information(Admin)",
			"request": {
				"auth": {
					"type": "bearer",
					"bearer": [
						{
							"key": "token",
							"value": "eyJhbGciOiJIUzI1NiIsInR5cCI6IkpXVCJ9.eyJpZCI6IjYzY2ZhNzNmMjgwMDMwODk5ZDUyY2UwYiIsImVtYWlsIjoiY3J5c3RhbDEyM0BtYWlsLmNvbSIsImlzQWRtaW4iOnRydWUsImlhdCI6MTY3NDYyMzc2MX0.Ou0exa0b8DTxR-_v9Ll7DQBj2e426iAWF9wd2H6PLQA",
							"type": "string"
						}
					]
				},
				"method": "PUT",
				"header": [],
				"body": {
					"mode": "raw",
					"raw": "{\r\n    \"name\": \"Alienware Curved QD-OLED Gaming Monitor\",\r\n    \"brand\": \"ALIENWARE\",\r\n    \"description\": \"34-inch curved monitor with QD-OLED technology and AMD FreeSync™ Premium Pro. Featuring infinite contrast ratio and VESA DisplayHDR TrueBlack 400 for an incredible front-of-screen performance.\",\r\n    \"price\": \"70685\"\r\n}",
					"options": {
						"raw": {
							"language": "json"
						}
					}
				},
				"url": {
					"raw": "localhost:4000/products/63cfacb6293b50e40476f67e/update",
					"host": [
						"localhost"
					],
					"port": "4000",
					"path": [
						"products",
						"63cfacb6293b50e40476f67e",
						"update"
					]
				}
			},
			"response": []
		},
		{
			"name": "Archive Product(Admin)",
			"request": {
				"auth": {
					"type": "bearer",
					"bearer": [
						{
							"key": "token",
							"value": "eyJhbGciOiJIUzI1NiIsInR5cCI6IkpXVCJ9.eyJpZCI6IjYzY2ZhNzNmMjgwMDMwODk5ZDUyY2UwYiIsImVtYWlsIjoiY3J5c3RhbDEyM0BtYWlsLmNvbSIsImlzQWRtaW4iOnRydWUsImlhdCI6MTY3NDYyMzc2MX0.Ou0exa0b8DTxR-_v9Ll7DQBj2e426iAWF9wd2H6PLQA",
							"type": "string"
						}
					]
				},
				"method": "PUT",
				"header": [],
				"body": {
					"mode": "raw",
					"raw": "{\r\n    \"isActive\": false\r\n}",
					"options": {
						"raw": {
							"language": "json"
						}
					}
				},
				"url": {
					"raw": "localhost:4000/products/63cfacb6293b50e40476f67e/archive",
					"host": [
						"localhost"
					],
					"port": "4000",
					"path": [
						"products",
						"63cfacb6293b50e40476f67e",
						"archive"
					]
				}
			},
			"response": []
		},
		{
			"name": "Create Order(Non-Admin)",
			"request": {
				"auth": {
					"type": "bearer",
					"bearer": [
						{
							"key": "token",
							"value": "eyJhbGciOiJIUzI1NiIsInR5cCI6IkpXVCJ9.eyJpZCI6IjYzY2ZhNzNmMjgwMDMwODk5ZDUyY2UwYiIsImVtYWlsIjoiY3J5c3RhbDEyM0BtYWlsLmNvbSIsImlzQWRtaW4iOnRydWUsImlhdCI6MTY3NDYyMzk3Mn0.1MrQuCtMFNnLFeJTJfLEWF9KSz_BkDwk9MF55RydfrQ",
							"type": "string"
						}
					]
				},
				"method": "POST",
				"header": [],
				"body": {
					"mode": "raw",
					"raw": "{\r\n        \"userId\": \"63cfa73f280030899d52ce0b\",\r\n        \"productId\":\"63cfacb6293b50e40476f67e\",\r\n        \"quantity\": 2\r\n}",
					"options": {
						"raw": {
							"language": "json"
						}
					}
				},
				"url": {
					"raw": "localhost:4000/users/myOrder",
					"host": [
						"localhost"
					],
					"port": "4000",
					"path": [
						"users",
						"myOrder"
					]
				}
			},
			"response": []
		},
		{
			"name": "Retrieve User Details",
			"protocolProfileBehavior": {
				"disableBodyPruning": true
			},
			"request": {
				"auth": {
					"type": "bearer",
					"bearer": [
						{
							"key": "token",
							"value": "eyJhbGciOiJIUzI1NiIsInR5cCI6IkpXVCJ9.eyJpZCI6IjYzZDAzOTZmZTU1NjEyOWY0ZDMxNDQ5YyIsImVtYWlsIjoiYW5nZWwxMjNAbWFpbC5jb20iLCJpc0FkbWluIjpmYWxzZSwiaWF0IjoxNjc0NTkxNzkxfQ.RK5O8CENneDZr8gtuR3FhnEX4cK4EC-02O9VxVJ2uvk",
							"type": "string"
						}
					]
				},
				"method": "GET",
				"header": [],
				"body": {
					"mode": "raw",
					"raw": "",
					"options": {
						"raw": {
							"language": "json"
						}
					}
				},
				"url": {
					"raw": "localhost:4000/users/63d0396fe556129f4d31449c",
					"host": [
						"localhost"
					],
					"port": "4000",
					"path": [
						"users",
						"63d0396fe556129f4d31449c"
					]
				}
			},
			"response": []
		},
		{
			"name": "Set User As Admin(Admin)",
			"request": {
				"auth": {
					"type": "bearer",
					"bearer": [
						{
							"key": "token",
							"value": "eyJhbGciOiJIUzI1NiIsInR5cCI6IkpXVCJ9.eyJpZCI6IjYzY2ZhNzNmMjgwMDMwODk5ZDUyY2UwYiIsImVtYWlsIjoiY3J5c3RhbDEyM0BtYWlsLmNvbSIsImlzQWRtaW4iOnRydWUsImlhdCI6MTY3NDYxNzk4NH0.hRI4kgcrGvS0lQ6H6piMs4-GDX5oV35Sk4c0Wzy520M",
							"type": "string"
						}
					]
				},
				"method": "PUT",
				"header": [],
				"body": {
					"mode": "raw",
					"raw": "{\r\n    \"isAdmin\": true\r\n}",
					"options": {
						"raw": {
							"language": "json"
						}
					}
				},
				"url": {
					"raw": "localhost:4000/users/63d08cb39c5bf41cc2b6df52/updateUser",
					"host": [
						"localhost"
					],
					"port": "4000",
					"path": [
						"users",
						"63d08cb39c5bf41cc2b6df52",
						"updateUser"
					]
				}
			},
			"response": []
		},
		{
			"name": "Retrieve Orders",
			"request": {
				"method": "GET",
				"header": []
			},
			"response": []
		}
	]
}