<?xml version="1.0" encoding="UTF-8" standalone="no"?>
<!-- Created with Inkscape (http://www.inkscape.org/) -->

<svg
   xmlns:dc="http://purl.org/dc/elements/1.1/"
   xmlns:cc="http://creativecommons.org/ns#"
   xmlns:rdf="http://www.w3.org/1999/02/22-rdf-syntax-ns#"
   xmlns:svg="http://www.w3.org/2000/svg"
   xmlns="http://www.w3.org/2000/svg"
   xmlns:sodipodi="http://sodipodi.sourceforge.net/DTD/sodipodi-0.dtd"
   xmlns:inkscape="http://www.inkscape.org/namespaces/inkscape"
   width="300mm"
   height="200mm"
   viewBox="0 0 299.99999 200"
   version="1.1"
   id="svg4793"
   inkscape:version="0.92.4 (5da689c313, 2019-01-14)"
   sodipodi:docname="shade.svg">
  <defs
     id="defs4787" />
  <sodipodi:namedview
     id="base"
     pagecolor="#ffffff"
     bordercolor="#666666"
     borderopacity="1.0"
     inkscape:pageopacity="0.0"
     inkscape:pageshadow="2"
     inkscape:zoom="0.5"
     inkscape:cx="860.82801"
     inkscape:cy="595.9078"
     inkscape:document-units="mm"
     inkscape:current-layer="g4833"
     showgrid="false"
     units="mm"
     inkscape:window-width="1920"
     inkscape:window-height="1000"
     inkscape:window-x="-11"
     inkscape:window-y="-11"
     inkscape:window-maximized="1" />
  <metadata
     id="metadata4790">
    <rdf:RDF>
      <cc:Work
         rdf:about="">
        <dc:format>image/svg+xml</dc:format>
        <dc:type
           rdf:resource="http://purl.org/dc/dcmitype/StillImage" />
        <dc:title></dc:title>
      </cc:Work>
    </rdf:RDF>
  </metadata>
  <g
     inkscape:label="Layer 1"
     inkscape:groupmode="layer"
     id="layer1"
     transform="translate(0,-96.999989)">
    <g
       id="g4833"
       transform="translate(-13.454807,4.9661113)">
      <g
         id="g821"
         transform="translate(-45.975264,51.441129)">
        <path
           inkscape:connector-curvature="0"
           style="display:inline;opacity:0.1;fill:#f4db04;fill-opacity:1;stroke-width:0.26458332"
           d="m 62.568004,186.10944 c 4.593167,19.63208 14.316604,36.60246 29.683608,44.82835 31.935198,17.09473 103.957438,8.27882 157.710188,-1.85208 a 123.08681,123.08681 0 0 0 69.99287,-40.01294 z"
           id="path4" />
        <path
           inkscape:connector-curvature="0"
           style="display:inline;opacity:0.1;fill:#f4db04;fill-opacity:1;stroke-width:0.26458332"
           d="m 344.44186,93.706355 h -29.49311 a 2.549262,2.549262 0 1 1 0,-5.098524 h 5.09853 a 2.5492605,2.5492605 0 0 1 0,-5.098521 h -3.64067 a 2.5492605,2.5492605 0 0 1 0,-5.098521 h 15.39345 c -3.41577,-1.5875 -7.40833,-2.717271 -12.00678,-3.309938 -41.9735,-5.392208 -56.9595,-1.825625 -62.24588,1.852084 -6.52198,4.524375 -13.79802,7.852833 -21.57412,9.456208 -25.89742,5.341939 -74.3294,11.771312 -118.22642,-2.058458 C 95.929321,77.471518 79.713004,89.09202 69.994858,108.50186 H 349.56154 c -0.36512,-5.64092 -1.45785,-10.847925 -3.46339,-15.40934 a 2.5347083,2.5347083 0 0 1 -1.65629,0.613835 z"
           id="path6" />
        <path
           inkscape:connector-curvature="0"
           style="display:inline;opacity:0.1;fill:#f4db04;fill-opacity:1;stroke-width:0.26458332"
           d="m 60.065046,145.13871 a 129.92629,129.92629 0 0 0 1.143,34.25031 l 258.942414,9.46944 a 121.70833,121.70833 0 0 0 17.99167,-27.43729 z m 102.414914,24.43427 h -5.09852 a 2.5492604,2.5492604 0 1 1 0,5.09852 h -29.4931 a 2.5492604,2.5492604 0 1 1 0,-5.09852 h 5.09852 a 2.5492605,2.5492605 0 0 1 0,-5.09852 h -3.64067 a 2.5492604,2.5492604 0 0 1 0,-5.09852 h 29.49311 a 2.5492604,2.5492604 0 1 1 0,5.09852 h 3.64066 a 2.5492605,2.5492605 0 0 1 0,5.09852 z"
           id="path8" />
        <path
           inkscape:connector-curvature="0"
           style="display:inline;opacity:0.1;fill:#f4db04;fill-opacity:1;stroke-width:0.26458332"
           d="m 349.57477,108.67648 -282.704641,6.87917 c -3.436937,8.83708 -5.704416,18.83039 -6.76275,29.19148 H 344.62177 a 120.77171,120.77171 0 0 0 4.10898,-18.60815 c 0.84667,-6.09071 1.18534,-11.97769 0.84402,-17.4625 z M 117.5008,131.2084 h -5.09852 a 2.5492605,2.5492605 0 1 1 0,5.09852 H 82.909171 a 2.5492605,2.5492605 0 1 1 0,-5.09852 h 5.098525 a 2.5492605,2.5492605 0 0 1 0,-5.09852 h -3.640671 a 2.5492605,2.5492605 0 0 1 0,-5.09852 h 29.493105 a 2.5492605,2.5492605 0 1 1 0,5.09852 h 3.64067 a 2.5492605,2.5492605 0 0 1 0,5.09852 z"
           id="path10" />
      </g>
    </g>
  </g>
</svg>
