{
  "type": "service_account",
  "project_id": "quasagram-b8191",
  "private_key_id": "dfe4f7f6ec209e224b60c18e838da4a6222f5e52",
  "private_key": "-----BEGIN PRIVATE KEY-----\nMIIEvQIBADANBgkqhkiG9w0BAQEFAASCBKcwggSjAgEAAoIBAQDYBkdgHF+cKwPs\ns+aQza4K2jDnjcuDrwgDjhRmqu/yrMmPAeWKbT9JzCLRvOr7+Gw8b1hkUMc3/bCc\n/HHdDP0HmRJQJLjwFUlPlqgxI6rzNXLwNLtJqOJz6AFB2DJjLJehh5bJwF30S1mm\njSTgQI2vwV0lTEutWmWJuwHy1gYD18E8DDF+YJqQtvLrgQApv0Lf5JBlyjc0Xhe5\n1NC+cBc81L4hFVB57etCl9ALlsbBAK8nRUuOiWgcOqjecnUqJP6ipk+9dv2u9DPK\nvi9mfJ9PPHW7ztTbDrVKaAX2q3Ot/u/RI/5Il4Yxdk+lX95GhgsOfFvc1+OGFKrQ\n4Rrns5HdAgMBAAECggEAANXfYYPgNKwQ/Uqb5NbbrwSZBXfu3q1rtvxSyF/wGmH2\ntF4vnJlyiuyfYC8JDK+LVLnygu0tO8Oiw3PFtC5OPj6MOKqf/KiY3EpHaiXBI0OF\nt+lgS6QtiSIy/7ZPo8wfOyYgi48uWRkUzI6pFx4BYwM45nNek6qGNgW24A6z7gxx\nD6EzsFSuHcJDlDlFlOY6bYqY5F6O+wKdqi5XZBfFgh1iMekU2gMLnM2m+snUmj9S\njYe4afLBIWid9V6oMhSg0wvnC9oW9RP5+3+LzX8BFPdwuVY0bUX95XM0dPAW0m3y\nkiFcGRsvsUTuDjlx/eDkz5njY9r18R5T6jxbUP9i2QKBgQD75Hituv4LSKpLdV2F\n+MQUYpitANTqNirW6SNMXEuo1bD/e0HkoB9ZVrF0XPcgmGb5UWwcy09z2J4lh7q/\nlAFJ0exreOn2DH22qzD4mKkKrvLKi0sLpIDjWFX51VKdDZ5XFb5z9ElxGzweC54K\ndpt4mnGssVT5rhQxJth+s/GXiQKBgQDbjBOBnditKHwg+CoW7lnl+IGNquz/d8t0\nAk0TYXa7aYV/+JXoknNAEGydPtTJYoUhnp5Pe/g/6LNKA2TKmq9WnGxmAes45sEr\nz96TAL+NqP2x2Vumpn+x8dsmbMrQZdJZHS3s6wUMSzcgHW+4dQGVcRmvU3vvjYdK\nwSFs2V5+tQKBgBAoe8VJNXqr0qC8ip9JceqM2JZgc0gC6YSXt/fyA7h03MHGuldc\nHiaw9Pkt7Xxdyl0759+A+zvHLX3i0wvvBpYhrTTHsNpjury5Bo8r28wfpNtxTAMX\nLl1nETzRflcsxHd5oZn2la93u8eBn0W0jgySe7BEP9s0W387qq+WA21hAoGAeTIA\naqMKQ7x/mWulQHdfZRYj3mKm5ffpdib3CWXaN2bu7U/64SJHQOxQKRXQPUOHnqGD\nXvled1kr8AWjlDyD4loDdORGR2kK5fagNaJKHBdXxN/qOjrbbw3GHpYb96Ld1ZfI\nDGtIpBq5WZ8mVzswHqEKvsBlQD5umxO2MfJkuakCgYEAiizoBDPTUc9BzWJzphi+\nEtkIbGwKn1/HKaPihlZCz2tH89/q4PXEHODwz2JVkJEdMcu2D7YRXTfLtARZwUjQ\nJmCQ2M3LbWv3tFJAQ+7vB1etNZGNWbEMR30bJpeZ9W9yBx8OBoJ5f9e6foktkwSA\niCaNbgKWe4l7eWK9kDTLSmA=\n-----END PRIVATE KEY-----\n",
  "client_email": "firebase-adminsdk-e41cw@quasagram-b8191.iam.gserviceaccount.com",
  "client_id": "103454288130176729085",
  "auth_uri": "https://accounts.google.com/o/oauth2/auth",
  "token_uri": "https://oauth2.googleapis.com/token",
  "auth_provider_x509_cert_url": "https://www.googleapis.com/oauth2/v1/certs",
  "client_x509_cert_url": "https://www.googleapis.com/robot/v1/metadata/x509/firebase-adminsdk-e41cw%40quasagram-b8191.iam.gserviceaccount.com"
}
