{
    "name": "mongo-sink",
    "config": {
        "connector.class": "com.mongodb.kafka.connect.MongoSinkConnector",
        "connection.uri": "mongodb://mongdb:27017",
        "key.converter": "io.confluent.connect.avro.AvroConverter",
        "key.converter.schema.registry.url": "http://schema-registry:8081",
        "value.converter": "io.confluent.connect.avro.AvroConverter",
        "value.converter.schema.registry.url": "http://schema-registry:8081", 
        "database": "kafka", 
        "topics.regex": "mongo_sink_(.*)",  
        "transforms": "ReplaceValueField,ReplaceKeyField",
        "transforms.ReplaceValueField.type": "org.apache.kafka.connect.transforms.ReplaceField$Value",
        "transforms.ReplaceValueField.renames": "id:_id",
        "transforms.ReplaceKeyField.type": "org.apache.kafka.connect.transforms.ReplaceField$Key",
        "transforms.ReplaceKeyField.renames": "id:_id",
        "delete.on.null.values": "true",
        "document.id.strategy.overwrite.existing": "true",
        "document.id.strategy":"com.mongodb.kafka.connect.sink.processor.id.strategy.ProvidedInKeyStrategy"

    }
}
