<svg width="20" height="21" viewBox="0 0 20 21" fill="none" xmlns="http://www.w3.org/2000/svg">
<path opacity="0.4" d="M19.9998 10.2353C19.9998 15.7593 15.5228 20.2353 9.9998 20.2353C4.4768 20.2353 -0.000200272 15.7593 -0.000200272 10.2353C-0.000200272 4.71328 4.4768 0.235275 9.9998 0.235275C15.5228 0.235275 19.9998 4.71328 19.9998 10.2353" fill="#BEC0C2"/>
<path d="M13.5735 14.0498C13.4425 14.0498 13.3105 14.0158 13.1895 13.9448L9.2635 11.6028C9.0375 11.4668 8.8985 11.2218 8.8985 10.9578V5.91078C8.8985 5.49678 9.2345 5.16078 9.6485 5.16078C10.0625 5.16078 10.3985 5.49678 10.3985 5.91078V10.5318L13.9585 12.6548C14.3135 12.8678 14.4305 13.3278 14.2185 13.6838C14.0775 13.9188 13.8285 14.0498 13.5735 14.0498" fill="#BEC0C2"/>
</svg>
