1/1,00:00:03,3501,info,period_callbacks.cpp,period_1Hz(),47,ls_val=3941

1/1,00:00:04,4481,info,period_callbacks.cpp,period_1Hz(),47,ls_val=3941

1/1,00:00:05,5460,info,period_callbacks.cpp,period_1Hz(),47,ls_val=3941

1/1,00:00:06,6440,info,period_callbacks.cpp,period_1Hz(),47,ls_val=3942

1/1,00:00:07,7419,info,period_callbacks.cpp,period_1Hz(),47,ls_val=3942

1/1,00:00:08,8399,info,period_callbacks.cpp,period_1Hz(),47,ls_val=3942

1/1,00:00:09,9379,info,period_callbacks.cpp,period_1Hz(),47,ls_val=3942

1/1,00:00:10,10358,info,period_callbacks.cpp,period_1Hz(),47,ls_val=3942

1/1,00:00:11,11338,info,period_callbacks.cpp,period_1Hz(),47,ls_val=3942

1/1,00:00:12,12317,info,period_callbacks.cpp,period_1Hz(),47,ls_val=3944

1/1,00:00:13,13297,info,period_callbacks.cpp,period_1Hz(),47,ls_val=3944

1/1,00:00:14,14277,info,period_callbacks.cpp,period_1Hz(),47,ls_val=3944

1/1,00:00:15,15256,info,period_callbacks.cpp,period_1Hz(),47,ls_val=3944

1/1,00:00:16,16236,info,period_callbacks.cpp,period_1Hz(),47,ls_val=3944

1/1,00:00:17,17215,info,period_callbacks.cpp,period_1Hz(),47,ls_val=3944

1/1,00:00:18,18195,info,period_callbacks.cpp,period_1Hz(),47,ls_val=3944

1/1,00:00:19,19174,info,period_callbacks.cpp,period_1Hz(),47,ls_val=3944

1/1,00:00:20,20154,info,period_callbacks.cpp,period_1Hz(),47,ls_val=3944

1/1,00:00:21,21134,info,period_callbacks.cpp,period_1Hz(),47,ls_val=3944

1/1,00:00:22,22113,info,period_callbacks.cpp,period_1Hz(),47,ls_val=3944

1/1,00:00:23,23093,info,period_callbacks.cpp,period_1Hz(),47,ls_val=3944

1/1,00:00:24,24072,info,period_callbacks.cpp,period_1Hz(),47,ls_val=3944

1/1,00:00:25,25052,info,period_callbacks.cpp,period_1Hz(),47,ls_val=3944

1/1,00:00:26,26032,info,period_callbacks.cpp,period_1Hz(),47,ls_val=3944

1/1,00:00:27,27011,info,period_callbacks.cpp,period_1Hz(),47,ls_val=3944

1/1,00:00:28,27991,info,period_callbacks.cpp,period_1Hz(),47,ls_val=3944

1/1,00:00:29,28970,info,period_callbacks.cpp,period_1Hz(),47,ls_val=3944

1/1,00:00:30,29950,info,period_callbacks.cpp,period_1Hz()