Company,Date,Open,High,Low,Close,Adj Close,Volume
Reliance Industries Limited,2020-10-14,2278.9,2304.0,2268.5,2281.8,2281.8,8808117.0
Reliance Industries Limited,2020-10-13,2230.6,2285.75,2225.85,2280.7,2280.7,1066619.0
Reliance Industries Limited,2020-10-12,2235.0,2255.75,2226.25,2237.05,2237.05,6565515.0
Reliance Industries Limited,2020-10-09,2235.0,2253.0,2217.1,2233.45,2233.45,8558745.0
Reliance Industries Limited,2020-10-08,2259.0,2268.0,2222.1,2239.25,2239.25,9727405.0
Reliance Industries Limited,2020-10-07,2235.0,2309.0,2220.0,2257.5,2257.5,2453834.0
Reliance Industries Limited,2020-10-06,2225.25,2233.9,2201.65,2210.35,2210.35,8497216.0
Reliance Industries Limited,2020-10-05,2244.0,2249.15,2206.0,2212.2,2212.2,8732869.0
Reliance Industries Limited,2020-10-01,2263.8,2263.8,2214.0,2225.25,2225.25,9591456.0
Reliance Industries Limited,2020-09-30,2260.0,2267.0,2225.0,2234.35,2234.35,1129066.0
Reliance Industries Limited,2020-09-29,2225.0,2264.0,2216.25,2245.05,2245.05,1192632.0
Reliance Industries Limited,2020-09-28,2227.0,2238.0,2207.05,2216.25,2216.25,9076248.0
Reliance Industries Limited,2020-09-25,2189.0,2212.8,2167.3,2201.7,2201.7,1309502.0
Reliance Industries Limited,2020-09-24,2207.9,2226.0,2176.05,2181.2,2181.2,1376484.0
Reliance Industries Limited,2020-09-23,2260.0,2276.75,2205.3,2230.8,2230.8,1983928.0
Reliance Industries Limited,2020-09-22,2277.0,2277.0,2201.55,2211.15,2211.15,1605662.0
Reliance Industries Limited,2020-09-21,2300.0,2336.0,2247.35,2255.85,2255.85,1551903.0
Reliance Industries Limited,2020-09-18,2314.25,2319.45,2276.55,2305.7,2305.7,1526406.0
Reliance Industries Limited,2020-09-17,2320.0,2333.7,2291.85,2298.75,2298.75,1191992.0
Reliance Industries Limited,2020-09-16,2320.0,2369.35,2310.55,2324.55,2324.55,1566897.0
Reliance Industries Limited,2020-09-15,2311.95,2325.75,2288.15,2318.85,2318.85,1254282.0
Reliance Industries Limited,2020-09-14,2325.0,2360.0,2282.0,2302.55,2302.55,2033527.0
Reliance Industries Limited,2020-09-11,2312.0,2337.85,2287.1,2319.75,2319.75,2744576.0
Reliance Industries Limited,2020-09-10,2183.1,2344.95,2175.35,2314.0,2314.0,6475046.0
Reliance Industries Limited,2020-09-09,2085.0,2167.8,2081.45,2161.35,2161.35,2552596.0
Reliance Industries Limited,2020-09-08,2092.0,2121.0,2080.5,2107.1,2107.1,1264374.0
Reliance Industries Limited,2020-09-07,2084.0,2105.75,2044.25,2082.65,2082.65,1011906.0
Reliance Industries Limited,2020-09-04,2083.55,2096.95,2072.2,2077.25,2077.25,1314164.0
Reliance Industries Limited,2020-09-03,2128.0,2138.75,2103.0,2112.1,2112.1,8577634.0
Reliance Industries Limited,2020-09-02,2092.0,2138.0,2085.0,2128.2,2128.2,1243716.0
Reliance Industries Limited,2020-09-01,2100.0,2122.4,2062.4,2087.25,2087.25,1782139.0
Reliance Industries Limited,2020-08-31,2174.0,2174.0,2060.35,2080.7,2080.7,2864812.0
Reliance Industries Limited,2020-08-28,2120.0,2132.9,2106.25,2116.15,2116.15,1253752.0
Reliance Industries Limited,2020-08-27,2148.0,2150.0,2103.25,2110.6,2110.6,1296125.0
Reliance Industries Limited,2020-08-26,2085.0,2147.95,2047.0,2137.3,2137.3,2763019.0
Reliance Industries Limited,2020-08-25,2106.0,2111.3,2078.0,2082.1,2082.1,8947563.0
Reliance Industries Limited,2020-08-24,2091.4,2104.5,2070.5,2095.75,2095.75,1509899.0
Reliance Industries Limited,2020-08-21,2118.0,2122.0,2077.0,2081.85,2081.85,1166712.0
Reliance Industries Limited,2020-08-20,2120.0,2123.9,2088.0,2097.05,2097.05,1040121.0
Reliance Industries Limited,2020-08-19,2141.0,2154.0,2121.35,2131.55,2131.55,1573139.0
Reliance Industries Limited,2020-08-18,2085.0,2134.3,2082.35,2118.55,2118.55,1409774.0
Reliance Industries Limited,2020-08-17,2105.0,2105.0,2070.1,2091.35,2091.35,1429683.0
Reliance Industries Limited,2020-08-14,2122.55,2157.0,2089.25,2113.8,2113.8,1533316.0
Reliance Industries Limited,2020-08-13,2128.0,2138.9,2110.0,2122.05,2122.05,1145919.0
Reliance Industries Limited,2020-08-12,2121.0,2145.0,2106.8,2127.6,2127.6,1396711.0
Reliance Industries Limited,2020-08-11,2134.8,2160.0,2100.35,2133.8,2133.8,2161125.0
Reliance Industries Limited,2020-08-10,2159.1,2165.0,2108.1,2119.85,2119.85,1244157.0
Reliance Industries Limited,2020-08-07,2129.8,2157.8,2120.2,2146.45,2146.45,1522230.0
Reliance Industries Limited,2020-08-06,2157.0,2167.7,2107.8,2134.1,2134.1,2276254.0
Reliance Industries Limited,2020-08-05,2169.0,2196.0,2118.3,2126.45,2126.45,3440481.0
Reliance Industries Limited,2020-08-04,2020.6,2167.0,2000.25,2150.6,2150.6,4247693.0
Reliance Industries Limited,2020-08-03,2051.3,2057.0,2003.1,2009.0,2009.0,2155914.0
Reliance Industries Limited,2020-07-31,2114.5,2129.0,2052.8,2067.1,2067.1,3459313.0
Reliance Industries Limited,2020-07-30,2099.0,2139.7,2072.0,2108.85,2108.85,3362369.0
Reliance Industries Limited,2020-07-29,2177.9,2182.8,2070.45,2096.65,2096.65,3353414.0
Reliance Industries Limited,2020-07-28,2156.2,2194.0,2150.65,2177.7,2177.7,2543529.0
Reliance Industries Limited,2020-07-27,2178.8,2198.8,2127.9,2156.2,2156.2,3706066.0
Reliance Industries Limited,2020-07-24,2058.0,2163.0,2057.8,2146.15,2146.15,5565566.0
Reliance Industries Limited,2020-07-23,2003.95,2079.7,1991.35,2057.8,2057.8,2692101.0
Reliance Industries Limited,2020-07-22,1983.0,2010.0,1960.7,2004.0,2004.0,2758451.0
Reliance Industries Limited,2020-07-21,1939.0,1977.0,1936.5,1971.55,1971.55,1946300.0
Reliance Industries Limited,2020-07-20,1917.8,1932.0,1899.65,1919.9,1919.9,1688763.0
Reliance Industries Limited,2020-07-17,1845.0,1920.0,1838.0,1911.7,1911.7,2294889.0
Reliance Industries Limited,2020-07-16,1847.0,1869.0,1812.45,1843.4,1843.4,2813382.0
Reliance Industries Limited,2020-07-15,1937.95,1978.8,1798.0,1844.0,1844.0,6445757.0
Reliance Industries Limited,2020-07-14,1934.0,1941.7,1887.3,1917.0,1917.0,3107330.0
Reliance Industries Limited,2020-07-13,1903.35,1947.7,1900.0,1935.0,1935.0,3212426.0
Reliance Industries Limited,2020-07-10,1828.5,1884.6,1824.25,1878.05,1878.05,2019521.0
Reliance Industries Limited,2020-07-09,1809.0,1835.0,1786.25,1824.25,1824.25,1680733.0
Reliance Industries Limited,2020-07-08,1824.05,1834.95,1790.0,1798.0,1798.0,1209318.0
Reliance Industries Limited,2020-07-07,1860.0,1864.35,1806.3,1823.45,1823.45,1623999.0
Reliance Industries Limited,2020-07-06,1805.0,1858.0,1792.1,1851.8,1851.8,2169796.0
Reliance Industries Limited,2020-07-03,1779.8,1793.0,1768.0,1787.9,1787.9,1358390.0
Reliance Industries Limited,2020-07-02,1743.0,1767.6,1735.05,1760.35,1760.35,1328636.0
Reliance Industries Limited,2020-07-01,1720.0,1749.0,1708.05,1737.6,1731.1,1313617.0
Reliance Industries Limited,2020-06-30,1737.0,1741.0,1695.55,1704.1,1697.73,1397256.0
Reliance Industries Limited,2020-06-29,1728.05,1739.75,1715.55,1723.15,1716.7,1182452.0
Reliance Industries Limited,2020-06-26,1728.8,1752.0,1717.0,1741.65,1735.13,1427045.0
Reliance Industries Limited,2020-06-25,1727.0,1749.0,1713.05,1717.9,1711.47,1831202.0
Reliance Industries Limited,2020-06-24,1735.9,1772.7,1711.7,1727.85,1721.39,2380703.0
Reliance Industries Limited,2020-06-23,1750.0,1763.75,1716.1,1720.9,1714.46,1751949.0
Reliance Industries Limited,2020-06-22,1773.4,1804.2,1735.0,1746.15,1739.62,2778169.0
Reliance Industries Limited,2020-06-19,1670.0,1788.8,1662.0,1759.4,1752.82,4882860.0
Reliance Industries Limited,2020-06-18,1607.0,1665.0,1605.6,1655.9,1649.71,1867761.0
Reliance Industries Limited,2020-06-17,1608.25,1635.45,1602.1,1615.35,1609.31,1928241.0
Reliance Industries Limited,2020-06-16,1643.0,1648.55,1585.3,1617.7,1611.65,2362279.0
Reliance Industries Limited,2020-06-15,1565.0,1626.95,1561.1,1614.55,1608.51,2450905.0
Reliance Industries Limited,2020-06-12,1500.0,1593.0,1497.0,1588.8,1582.86,1779031.0
Reliance Industries Limited,2020-06-11,1566.0,1567.95,1531.0,1537.7,1531.95,9408046.0
Reliance Industries Limited,2020-06-10,1543.1,1579.55,1540.05,1572.15,1566.27,1021421.0
Reliance Industries Limited,2020-06-09,1560.3,1583.0,1533.0,1537.15,1531.4,1193307.0
Reliance Industries Limited,2020-06-08,1618.4,1618.4,1565.0,1569.5,1563.63,1449799.0
Reliance Industries Limited,2020-06-05,1595.0,1618.0,1573.7,1581.7,1575.78,1526488.0
Reliance Industries Limited,2020-06-04,1544.0,1589.5,1541.0,1579.8,1573.89,1578437.0
Reliance Industries Limited,2020-06-03,1545.0,1560.0,1533.35,1541.65,1535.88,1171346.0
Reliance Industries Limited,2020-06-02,1526.0,1540.0,1520.8,1535.7,1529.96,1022404.0
Reliance Industries Limited,2020-06-01,1480.0,1538.35,1475.95,1520.35,1514.66,1843401.0
Reliance Industries Limited,2020-05-29,1468.0,1472.0,1452.65,1464.4,1458.92,1847039.0
Reliance Industries Limited,2020-05-28,1455.0,1479.75,1449.0,1472.25,1466.74,1851827.0
