EESchema Schematic File Version 4
EELAYER 30 0
EELAYER END
$Descr A4 11693 8268
encoding utf-8
Sheet 1 1
Title ""
Date ""
Rev ""
Comp ""
Comment1 ""
Comment2 ""
Comment3 ""
Comment4 ""
$EndDescr
$Comp
L Connector_Generic:Conn_01x03 J2
U 1 1 603925D9
P 6350 2650
F 0 "J2" H 6430 2692 50  0000 L CNN
F 1 "Conn_01x03" H 6430 2601 50  0000 L CNN
F 2 "Connector_PinHeader_2.54mm:PinHeader_1x03_P2.54mm_Vertical" H 6350 2650 50  0001 C CNN
F 3 "~" H 6350 2650 50  0001 C CNN
	1    6350 2650
	1    0    0    -1  
$EndComp
Wire Wire Line
	4600 3400 4800 3400
Text GLabel 4300 3400 0    50   Input ~ 0
VCC
Text GLabel 6250 3450 0    50   Input ~ 0
GND
Text GLabel 6250 3350 0    50   Input ~ 0
VCC
$Comp
L Connector_Generic:Conn_01x02 J1
U 1 1 60391F4A
P 6450 3350
F 0 "J1" H 6530 3342 50  0000 L CNN
F 1 "Conn_01x02" H 6530 3251 50  0000 L CNN
F 2 "Connector_PinHeader_2.54mm:PinHeader_1x02_P2.54mm_Vertical" H 6450 3350 50  0001 C CNN
F 3 "~" H 6450 3350 50  0001 C CNN
	1    6450 3350
	1    0    0    -1  
$EndComp
Text GLabel 4650 2000 0    50   Input ~ 0
VCC
$Comp
L Transistor_BJT:TIP41 Q1
U 1 1 6038E052
P 5000 3400
F 0 "Q1" H 5191 3446 50  0000 L CNN
F 1 "TIP41" H 5191 3355 50  0000 L CNN
F 2 "Package_TO_SOT_SMD:SOT-23" H 5250 3325 50  0001 L CIN
F 3 "https://www.centralsemi.com/get_document.php?cmp=1&mergetype=pd&mergepath=pd&pdf_id=tip41.PDF" H 5000 3400 50  0001 L CNN
	1    5000 3400
	1    0    0    -1  
$EndComp
$Comp
L Device:R R1
U 1 1 6039440A
P 4450 3400
F 0 "R1" V 4243 3400 50  0000 C CNN
F 1 "R" V 4334 3400 50  0000 C CNN
F 2 "Resistor_SMD:R_0805_2012Metric" V 4380 3400 50  0001 C CNN
F 3 "~" H 4450 3400 50  0001 C CNN
	1    4450 3400
	0    1    1    0   
$EndComp
Text GLabel 5100 3600 3    50   Input ~ 0
GND
$Comp
L pspice:DIODE D1
U 1 1 60399030
P 4250 2650
F 0 "D1" V 4296 2522 50  0000 R CNN
F 1 "DIODE" V 4205 2522 50  0000 R CNN
F 2 "Diode_SMD:D_0805_2012Metric" H 4250 2650 50  0001 C CNN
F 3 "~" H 4250 2650 50  0001 C CNN
	1    4250 2650
	0    -1   -1   0   
$EndComp
Wire Wire Line
	4650 2000 5100 2000
Wire Wire Line
	5100 2000 5100 2250
Wire Wire Line
	4250 2450 4250 2250
Wire Wire Line
	4250 2250 5100 2250
Connection ~ 5100 2250
Wire Wire Line
	5100 2250 5100 2350
Wire Wire Line
	5100 2950 5100 3050
Wire Wire Line
	5100 3050 4250 3050
Wire Wire Line
	4250 3050 4250 2850
Connection ~ 5100 3050
Wire Wire Line
	5100 3050 5100 3200
Text GLabel 5500 2950 3    50   Input ~ 0
COM
Text GLabel 6150 2550 0    50   Input ~ 0
COM
Text GLabel 5400 2350 1    50   Input ~ 0
NC
Text GLabel 6150 2750 0    50   Input ~ 0
NC
Text GLabel 5600 2350 1    50   Input ~ 0
NO
Text GLabel 6150 2650 0    50   Input ~ 0
NO
$Comp
L Rele:DIPxx-1Cxx-51x K1
U 1 1 60397B77
P 5300 2650
F 0 "K1" H 5730 2696 50  0000 L CNN
F 1 "DIPxx-1Cxx-51x" H 5730 2605 50  0000 L CNN
F 2 "Relay_THT:Relay_SPDT_Omron-G5LE-1" H 5750 2600 50  0001 L CNN
F 3 "https://standexelectronics.com/wp-content/uploads/datasheet_reed_relay_DIP.pdf" H 5300 2650 50  0001 C CNN
	1    5300 2650
	1    0    0    -1  
$EndComp
$EndSCHEMATC
