{
  "project_info": {
    "project_number": "788100874181",
    "firebase_url": "https://ejemplofirebase-bd0da.firebaseio.com",
    "project_id": "ejemplofirebase-bd0da",
    "storage_bucket": "ejemplofirebase-bd0da.appspot.com"
  },
  "client": [
    {
      "client_info": {
        "mobilesdk_app_id": "1:788100874181:android:3b3d585843e960fb0bd5ac",
        "android_client_info": {
          "package_name": "com.example.retrofit"
        }
      },
      "oauth_client": [
        {
          "client_id": "788100874181-t32lf8lpcu0bcgakph369l0sjbb8u76c.apps.googleusercontent.com",
          "client_type": 3
        }
      ],
      "api_key": [
        {
          "current_key": "AIzaSyAgQUMy5xsAz59TWpEZdEgzyFmcyaPZ2wM"
        }
      ],
      "services": {
        "appinvite_service": {
          "other_platform_oauth_client": [
            {
              "client_id": "788100874181-t32lf8lpcu0bcgakph369l0sjbb8u76c.apps.googleusercontent.com",
              "client_type": 3
            }
          ]
        }
      }
    }
  ],
  "configuration_version": "1"
}