D:\Work\Faculta\JavaProjects\PT2020_30421_Romitan_Raul_Assignment_3\src\main\java\model\Product.java
D:\Work\Faculta\JavaProjects\PT2020_30421_Romitan_Raul_Assignment_3\src\main\java\model\Command.java
D:\Work\Faculta\JavaProjects\PT2020_30421_Romitan_Raul_Assignment_3\src\main\java\dao\ProductDAO.java
D:\Work\Faculta\JavaProjects\PT2020_30421_Romitan_Raul_Assignment_3\src\main\java\bll\validators\ProductNameValidator.java
D:\Work\Faculta\JavaProjects\PT2020_30421_Romitan_Raul_Assignment_3\src\main\java\dao\ClientDAO.java
D:\Work\Faculta\JavaProjects\PT2020_30421_Romitan_Raul_Assignment_3\src\main\java\bll\ProductBLL.java
D:\Work\Faculta\JavaProjects\PT2020_30421_Romitan_Raul_Assignment_3\src\main\java\model\Client.java
D:\Work\Faculta\JavaProjects\PT2020_30421_Romitan_Raul_Assignment_3\src\main\java\bll\OrderBLL.java
D:\Work\Faculta\JavaProjects\PT2020_30421_Romitan_Raul_Assignment_3\src\main\java\presentation\Controller.java
D:\Work\Faculta\JavaProjects\PT2020_30421_Romitan_Raul_Assignment_3\src\main\java\bll\validators\Validator.java
D:\Work\Faculta\JavaProjects\PT2020_30421_Romitan_Raul_Assignment_3\src\main\java\dao\OrderDAO.java
D:\Work\Faculta\JavaProjects\PT2020_30421_Romitan_Raul_Assignment_3\src\main\java\presentation\View.java
D:\Work\Faculta\JavaProjects\PT2020_30421_Romitan_Raul_Assignment_3\src\main\java\start\ReflectionExample.java
D:\Work\Faculta\JavaProjects\PT2020_30421_Romitan_Raul_Assignment_3\src\main\java\bll\ClientBLL.java
D:\Work\Faculta\JavaProjects\PT2020_30421_Romitan_Raul_Assignment_3\src\main\java\bll\validators\ProductQuantityValidator.java
D:\Work\Faculta\JavaProjects\PT2020_30421_Romitan_Raul_Assignment_3\src\main\java\bll\validators\ClientNameValidator.java
D:\Work\Faculta\JavaProjects\PT2020_30421_Romitan_Raul_Assignment_3\src\main\java\connection\ConnectionFactory.java
D:\Work\Faculta\JavaProjects\PT2020_30421_Romitan_Raul_Assignment_3\src\main\java\model\Order.java
D:\Work\Faculta\JavaProjects\PT2020_30421_Romitan_Raul_Assignment_3\src\main\java\bll\validators\ProductPriceValidator.java
D:\Work\Faculta\JavaProjects\PT2020_30421_Romitan_Raul_Assignment_3\src\main\java\presentation\PdfGenerator.java
D:\Work\Faculta\JavaProjects\PT2020_30421_Romitan_Raul_Assignment_3\src\main\java\start\Start.java
D:\Work\Faculta\JavaProjects\PT2020_30421_Romitan_Raul_Assignment_3\src\main\java\presentation\FileParser.java
