Level	Rule Name	Subject	Property	Value
ERROR	missing_label	BFO:0000050	rdfs:label	
ERROR	missing_label	BFO:0000051	rdfs:label	
WARN	annotation_whitespace	RO:0002215	IAO:0000115	A relation between a material entity (such as a cell) and a process, in which the material entity has the ability to carry out the process. 
WARN	missing_definition	BFO:0000050	IAO:0000115	
WARN	missing_definition	BFO:0000051	IAO:0000115	
WARN	missing_definition	RO:0002017	IAO:0000115	
WARN	missing_definition	RO:0002022	IAO:0000115	
WARN	missing_definition	RO:0002297	IAO:0000115	
WARN	missing_definition	RO:0002304	IAO:0000115	
WARN	missing_definition	RO:0002305	IAO:0000115	
WARN	missing_definition	RO:0002327	IAO:0000115	
WARN	missing_definition	RO:0002354	IAO:0000115	
WARN	missing_definition	RO:0002405	IAO:0000115	
WARN	missing_definition	RO:0002444	IAO:0000115	
WARN	missing_definition	RO:0002445	IAO:0000115	
WARN	missing_definition	RO:0002447	IAO:0000115	
WARN	missing_definition	RO:0002453	IAO:0000115	
WARN	missing_definition	RO:0002559	IAO:0000115	
WARN	missing_definition	RO:0002574	IAO:0000115	
WARN	missing_definition	RO:0004032	IAO:0000115	
WARN	missing_definition	RO:0004033	IAO:0000115	
WARN	missing_definition	RO:0004046	IAO:0000115	
WARN	missing_definition	RO:0004047	IAO:0000115	
INFO	lowercase_definition	RO:0002018	IAO:0000115	w 'has process component' p if p and w are processes,  w 'has part' p and w is such that it can be directly disassembled into into n parts p, p2, p3, ..., pn, where these parts are of similar type.
INFO	lowercase_definition	RO:0002131	IAO:0000115	x overlaps y if and only if there exists some z such that x has part z and z part of y
INFO	lowercase_definition	RO:0002180	IAO:0000115	w 'has component' p if w 'has part' p and w is such that it can be directly disassembled into into n parts p, p2, p3, ..., pn, where these parts are of similar type.
INFO	lowercase_definition	RO:0002211	IAO:0000115	<process(P1) regulates process(P2) iff: P1 results in the initiation or termination of P2 OR affects the frequency of its initiation or termination OR affects the magnitude or rate of output of P2.>
INFO	lowercase_definition	RO:0002216	IAO:0000115	c stands in this relationship to p if and only if there exists some p' such that c is capable_of p', and p' is part_of p.
INFO	lowercase_definition	RO:0002233	IAO:0000115	<p has input c iff: p is a process, c is a material entity, c is a participant in p, c is present at the start of p, and the state of c is modified during p.>
INFO	lowercase_definition	RO:0002234	IAO:0000115	p has output c iff c is a participant in p, c is present at the end of p, and c is not present at the beginning of p.
INFO	lowercase_definition	RO:0002263	IAO:0000115	c acts upstream of p if and only if c enables some f that is involved in p' and p' occurs chronologically before p, is not part of p, and affects the execution of p. c is a material entity and f, p, p' are processes.
INFO	lowercase_definition	RO:0002264	IAO:0000115	c acts upstream of or within p if c is enables f, and f is causally upstream of or within p. c is a material entity and p is an process.
INFO	lowercase_definition	RO:0002295	IAO:0000115	p results in the developmental progression of s iff p is a developmental process and s is an anatomical structure and p causes s to undergo a change in state at some point along its natural developmental cycle (this cycle starts with its formation, through the mature structure, and ends with its loss).
INFO	lowercase_definition	RO:0002331	IAO:0000115	c involved_in p if and only if c enables some process p', and p' is part of p
INFO	lowercase_definition	RO:0002333	IAO:0000115	inverse of enables
INFO	lowercase_definition	RO:0002334	IAO:0000115	inverse of regulates
INFO	lowercase_definition	RO:0002335	IAO:0000115	inverse of negatively regulates
INFO	lowercase_definition	RO:0002336	IAO:0000115	inverse of positively regulates
INFO	lowercase_definition	RO:0002352	IAO:0000115	inverse of has input
INFO	lowercase_definition	RO:0002353	IAO:0000115	inverse of has output
INFO	lowercase_definition	RO:0002404	IAO:0000115	inverse of upstream of
INFO	lowercase_definition	RO:0002411	IAO:0000115	p is causally upstream of q if and only if p precedes q and p and q are linked in a causal chain
INFO	lowercase_definition	RO:0002412	IAO:0000115	p is immediately causally upstream of q iff both (a) p immediately precedes q and (b) p is causally upstream of q. In addition, the output of p  must be an input of q.
INFO	lowercase_definition	RO:0002418	IAO:0000115	p 'causally upstream or within' q iff (1) the end of p is before the end of q and (2) the execution of p exerts some causal influence over the outputs of q; i.e. if p was abolished or the outputs of p were to be modified, this would necessarily affect q.
INFO	lowercase_definition	RO:0002427	IAO:0000115	inverse of causally upstream of or within
INFO	lowercase_definition	RO:0002428	IAO:0000115	c involved in regulation of p if c is involved in some p' and p' regulates some p
INFO	lowercase_definition	RO:0002429	IAO:0000115	c involved in regulation of p if c is involved in some p' and p' positively regulates some p
INFO	lowercase_definition	RO:0002430	IAO:0000115	c involved in regulation of p if c is involved in some p' and p' negatively regulates some p
INFO	lowercase_definition	RO:0002431	IAO:0000115	c involved in or regulates p if and only if either (i) c is involved in p or (ii) c is involved in regulation of p
INFO	lowercase_definition	RO:0002507	IAO:0000115	s determined by f if and only if s is a type of system, and f is a material entity that is part of s, such that f exerts a strong causal influence on the functioning of s, and the removal of f would cause the collapse of s.
INFO	lowercase_definition	RO:0002508	IAO:0000115	inverse of determined by
INFO	lowercase_definition	RO:0002509	IAO:0000115	s 'determined by part of' w if and only if there exists some f such that (1) s 'determined by' f and (2) f part_of w, or f=w.
INFO	lowercase_definition	RO:0002553	IAO:0000115	x is a hyperparasite of y iff x is a parasite of a parasite of the target organism y
INFO	lowercase_definition	RO:0002554	IAO:0000115	inverse of hyperparasite of
INFO	lowercase_definition	RO:0002584	IAO:0000115	s 'has part structure that is capable of' p if and only if there exists some part x such that s 'has part' x and x 'capable of' p
INFO	lowercase_definition	RO:0004034	IAO:0000115	c 'acts upstream of, positive effect' p if c is enables f, and f is causally upstream of p, and the direction of f is positive
INFO	lowercase_definition	RO:0004035	IAO:0000115	c 'acts upstream of, negative effect' p if c is enables f, and f is causally upstream of p, and the direction of f is negative
