1255648009615966208
1255647246575636482
1255646577290608640
1255644352413605889
1255644067666550785
1255643632507420672
1255641998024945673
1255641912343740421
1255639414895771649
1255638892902068224
1255637493560430592
1255637492608274432
1255637228732235777
1255636184337993731
1255635806745698306
1255635735073271810
1255635589954711553
1255635292045926402
1255634275334082567
1255634256195399680
1255634178713899008
1255633900702969856
1255633758767718402
1255633756960022531
1255633344001380353
1255633128590278658
1255632871425015808
1255632418456903685
1255632080945459201
1255631716393390082
1255631687423320065
1255631331213684736
1255631012593307650
1255630679330693122
1255630254233845760
1255630234822619136
1255628942888714241
1255628939763912704
1255628054786969600
1255627963363733506
1255627394813132800
1255627056089427968
1255627055040851970
1255626277622550530
1255625708249985031
1255625081188954112
1255625014369497091
1255624419139092483
1255623295690473473
1255622221193711623
1255622209869164546
1255622089136013312
1255622056139542536
1255621948152983553
1255621770016485376
1255621481503117313
1255621410032058368
1255620641602048000
1255620120325558274
1255620048141631490
1255619651981238277
1255619648189579269
1255619306374733824
1255618865884803073
1255618757159989248
1255618294842785795
1255618159450763264
1255617159390285824
1255616730405240832
1255616680258146312
1255616327416496132
1255615567278587904
1255615471669346304
1255615012942610432
1255614601980502016
1255614318382587906
1255614292877021184
1255613848247242755
1255613607729037315
1255613444830769156
1255613218678018049
1255613060045307906
1255612922627330051
1255612766343364619
1255612641223102465
1255612432539582464
1255612127173378048
1255612025474080768
1255611631326937089
1255611378695577608
1255611117444960258
1255611061857910784
1255610913371152385
1255610899320262660
1255610472755322881
1255610067522650113
1255609978364313600
1255609945279660033
1255609782792323075
1255609726903169025
1255609679419510786
1255609158319124480
1255609144255668225
1255609142410084352
1255608904135905283
1255608731779416064
1255608134003044352
1255608024917557256
1255607743538397185
1255607585132216322
1255607397864931329
1255607303862091776
1255607222735974404
1255607201823166469
1255606979856412674
1255606950441746434
1255606675576414208
1255606174331912198
1255606046586015745
1255605489662078976
1255605290227113984
1255604977155915778
1255604889536868352
1255604888182153217
1255604865474146304
1255604795928449024
1255604781608910848
1255604735001931778
1255604696221462528
1255604624482017280
1255604558799220736
1255604351726505990
1255604129235456008
1255603801836437505
1255603589747277825
1255603448176934914
1255603403792756736
1255603268581052418
1255603145889116162
1255603135609004034
1255603078943985664
1255602959901171717
1255602451790659586
1255602241710575616
1255601898087948289
1255601897605672962
1255601448093659136
1255601303834820610
1255601230010822659
1255601228102369280
1255601200491364355
1255600573971337217
1255600417490288644
1255600414973722624
1255600399928754178
1255600338209591296
1255599841788428289
1255599673173315589
1255599672116346882
1255599243055828992
1255598877828427789
1255598846400499712
1255598811868729352
1255598244299771905
1255598240021561347
1255598033653374978
1255598029261979650
1255597888148832256
1255597814878437376
1255597609378553858
1255597373402857474
1255596940491923457
1255596578510983169
1255596529651515395
1255596079346835457
1255595860748107777
1255595658465198088
1255595458673737728
1255595278079533056
1255595187386056709
1255595103835451393
1255594159186075653
1255593989048340481
1255593950506868737
1255593218705625088
1255593070701281280
1255592839033032707
1255592385133907969
1255592360836292608
1255592018102935553
1255591968329039872
1255591946606780417
1255591885328039936
1255591818907062272
1255591756193824769
1255590710604181509
1255590692518277122
1255590691658444800
1255590611975114755
1255590274765664259
1255590119861628930
1255589995970256898
1255589687273623553
1255589510588620803
1255589467299160074
1255589192287031296
1255589072506105857
1255589063203094536
1255588966641917958
1255588922584977408
1255588551300874241
1255588342512726020
1255588234337361930
1255587927465308164
1255587917256437762
1255587786792583168
1255587772523569152
1255587713945927685
1255587686343159809
1255587650918068224
1255587610464006145
1255587425348444160
1255587415009439751
1255587373313916941
1255587294704214022
1255587273418125318
1255587226118995969
1255587096494039040
1255587074549452800
1255586914738069511
1255586806340505600
1255586787818385410
1255586474092908548
1255586349584986114
1255586286611685381
1255586152532279301
1255586087470235651
1255585996218957832
1255585894838517766
1255585797450772480
1255585733773058054
1255585598292865026
1255585426347261954
1255585307182993408
1255585227587665920
1255585152677314561
1255584844140236801
1255584684223979520
1255584626053189640
1255584529395433486
1255584383727284229
1255584022077542402
1255583986694397953
1255583864560459778
1255583407557480456
1255583340905795584
1255583054464253952
1255582929914335239
1255582623377784832
1255582490137440256
1255582486131859457
1255582443974922240
1255582422596550656
1255582415478640640
1255582375041531906
1255581955208425473
1255581914922209280
1255581885805273088
1255581724513361920
1255581636135211010
1255581505713209344
1255581122504736770
1255580671243927552
1255580610145521664
1255580492197486593
1255580376828870659
1255580315235561483
1255579951643996163
1255579708546265089
1255579648030883845
1255579490190872581
1255578789922430979
1255578739943104514
1255578662113550342
1255578397998288897
1255578295367798788
1255578253575798785
1255578208235327488
1255578206305910784
1255578203802030080
1255578185523171328
1255578106246676487
1255578028979224578
1255577938839441410
1255577824544653313
1255577782085713920
1255577433874599945
1255577323140780033
1255577255184646145
1255576708520042500
1255576522687164418
1255576414658744321
1255575842077446144
1255575798951612417
1255575465701580801
1255575375817707522
1255575320016629760
1255575319886606336
1255575318817112065
1255575023869399042
1255574771728814085
1255574522247417857
1255574433831497728
1255574333919039489
1255574204017074177
1255574181779058689
1255574027357356033
1255573904254525442
1255573794162442246
1255573685546758146
1255573491962843139
1255573245643849730
1255573201989632012
1255573028815220736
1255572801135706117
1255572287203545089
1255572003999924225
1255571525132005376
1255571485940482048
1255571358907535366
1255571352943308800
1255571145715302400
1255571124697681920
1255570875983765504
1255570871214899202
1255570862054477828
1255570850218205184
1255570743494160384
1255570494201507844
1255570423430987778
1255570328652255235
1255570186771542028
1255569819090464768
1255569418299588609
1255569409667674114
1255569172035039232
1255568923581460480
1255568614750552069
1255568513491783681
1255568285975920641
1255568133185851399
1255567608092545027
1255567558939422721
1255567406929494019
1255567352340635648
1255566028458819585
1255565827484631043
1255565650979778560
1255565504581971969
1255564825201119233
1255564725141856261
1255564482912362496
1255564425639211011
1255564260991741952
1255563697487056896
1255563613697380353
1255563453294694403
1255563364371177473
1255562870294790146
1255562624302907393
1255562157154017282
1255561813338529800
1255561809353900034
1255561773584920577
1255561724373225472
1255561696300670976
1255561171089965056
1255561169684791296
1255561085387759619
1255561083756183554
1255561082313363456
1255560994048401409
1255560432099700736
1255560207389908994
1255559975377817600
1255559835959074817
1255559462225686528
1255559317857722368
1255558689978712065
1255558536177868800
1255558048694833154
1255557944898457605
1255557895934095373
1255557814312939520
1255557592543375362
1255557326968414209
1255557108537462786
1255556662611542019
1255556590104608770
1255556550749544448
1255556407400763392
1255556295874301958
1255556243198017536
1255556243080519681
1255556234276753409
1255556233244925960
1255556093025177600
1255555599942778882
1255555391943032833
1255554915172323330
1255554755289649153
1255554298412503048
1255554117637943299
1255553943020736517
1255553636337422343
1255552946160443398
1255552663351185409
1255551755615698946
1255551741468303360
1255551677354119168
1255551517698011141
1255551350479388674
1255551303016734722
1255551188143157253
1255550826292162562
1255550782465880064
1255550746810109963
1255550570389176320
1255550561627385858
1255550532351135747
1255550424544837637
1255550327748726792
1255549799371280384
1255549400262344709
1255548558855602176
1255548312826109953
1255548082785333248
1255548058382872579
1255547652869173254
1255547644983861251
1255547558086283265
1255547379685699584
1255547320000708608
1255546399653015554
1255546338135232515
1255546183466070025
1255546086900600832
1255546043078520835
1255546024657117185
1255545941106536448
1255545822554587136
1255545107161497600
1255544871290646531
1255544830635257856
1255544131968851968
1255544043737677828
1255543936866803713
1255543432317153283
1255542621339971585
1255542549768478723
1255542526867537925
1255542037027397634
1255541992513318914
1255541442237399049
1255541387128438785
1255541321256894469
1255541266433146880
1255541003936768000
1255540764106461184
1255540668811874307
1255540459289620480
1255540055361323008
1255539707078946816
1255539577223352320
1255539036720111617
1255538680070115330
1255538352054550533
1255538261776359424
1255538154687401993
1255537853720920065
1255537830073372672
1255537351494860806
1255536205321691137
1255536092939530240
1255535984055324673
1255535200102051840
1255535170381324288
1255535147799261185
1255535025577242630
1255535005754953728
1255534436910850051
1255534297387274240
1255534173860900869
1255534001642704896
1255533833782468612
1255533735753191425
1255533615057903621
1255533550583062531
1255533514537271298
1255533351810871297
1255532663890423809
1255532557191598082
1255532432679473152
1255532262768160769
1255532147529658369
1255531934115127297
1255531674395426823
1255531358245527553
1255531299894366211
1255531181891817473
1255530757487026183
1255530583754670081
1255530552565936128
1255530369484537859
1255529929585954819
1255529914482253827
1255529570805198848
1255529475019857922
1255529326977650688
1255529303997120512
1255529146475831298
1255528967739789312
1255528711463538690
1255528627703361536
1255528612075376640
1255528513672708097
1255528511860690944
1255528421465165824
1255528263973208065
1255528173179150338
1255528064433508353
1255528050856529920
1255528037115969536
1255527940047212545
1255527910112444417
1255527908443066370
1255527908057264129
1255527906563981319
1255527904726974465
1255527902768173056
1255527812464881664
1255527438047723521
1255527255759040517
1255527233017577473
1255527178197966848
1255527158925189120
1255527136645058562
1255526969577484288
1255526795333513218
1255526420215934977
1255526300284002306
1255525827736895490
1255525687814950912
1255525543640006657
1255525524010647552
1255525075542999040
1255524703642492929
1255524633920618500
1255524482145554432
1255524401342222336
1255524319733649415
1255524264352120835
1255524229237354496
1255524008344387585
1255523989100924928
1255523828236771329
1255523821500674050
1255523773903749121
1255523515379351552
1255523510287556610
1255523505917083653
1255523333564706820
1255523220691849217
1255523199263088641
1255522827060551687
1255522801328492555
1255522674677293056
1255522668054446081
1255522598634618882
1255522483362562057
1255522178075852801
1255522049231069189
1255522048249606148
1255521910265384960
1255521880058068994
1255521515178733568
1255521456366157824
1255521430307045377
1255521281883209729
1255521229395693572
1255521128996577283
1255520903129116679
1255520886310023170
1255520667036012547
1255520394037116929
1255520389201043456
1255520294426591237
1255520080034660359
1255519962631999488
1255519713888735233
1255519222924541954
1255519126476521477
1255518769574744068
1255518701102739456
1255518628277092354
1255518462606262279
1255518114655211521
1255518002361106433
1255517992642846720
1255517803181899778
1255517415796064256
1255517099113545732
1255516885933871108
1255516597877342214
1255516548787298305
1255516376355274752
1255516252728066048
1255516064370262016
1255515698736087047
1255515364575887360
1255515351451947014
1255515261391851521
1255515036832972803
1255514904670408705
1255514566982864897
1255514322459074561
1255513898704396288
1255513602871738370
1255513569292095488
1255513567341748226
1255513565429223424
1255513560320552962
1255512554035707905
1255512094218293249
1255512053680353281
1255511610413715461
1255511589828124673
1255511565991907334
1255511546496782336
1255511359657332739
1255511271123935237
1255510985156296704
1255510963924721672
1255510959583571969
1255510736043991049
1255510680406503430
1255510585409765382
1255510518615486464
1255510442186805251
1255510354983075841
1255510276331515910
1255510165140525056
1255509837938659328
1255509328783704064
1255508955494842368
1255508707343032321
1255508389230247936
1255508165086543872
1255507754317500417
1255507232172716032
1255507031211024385
1255506166093950976
1255505884094124033
1255505575137480712
1255505534070988800
1255505311705808901
1255505078515007489
1255505031048167426
1255504977444900864
1255504931408281603
1255504824323452931
1255504713509933057
1255504572384149507
1255504541639946241
1255504350547410945
1255504288081743875
1255504287045689353
1255504276752826371
1255504187733037064
1255504131663581189
1255503491394613248
1255503249777602565
1255502196336197633
1255501925790908420
1255501578565488642
1255501392782991360
1255501338085142533
1255501106983075848
1255501079766355970
1255501014968434699
1255499936847839242
1255499689975259143
1255499599315419138
1255499528612065282
1255499514712031232
1255499195844354056
1255499171081203714
1255498940293791746
1255498792876597251
1255498600387416066
1255498468438802435
1255497852001845248
1255497482068525056
1255497348282712064
1255496921122291712
1255496751273914368
1255496738409984003
1255496624434024448
1255496335471652865
1255496249396133891
1255495203860951042
1255494495111610373
1255494207059484672
1255494188101230594
1255493916570386432
1255493707266129921
1255493651318345728
1255493335923466240
1255493214527774722
1255492990828777475
1255492939075260416
1255492774750818311
1255492675769376768
1255492516604006405
1255491595396407297
1255491377590394887
1255491297130971137
1255491128473931778
1255490926216196096
1255490793617399814
1255490607071604737
1255490203692740609
1255490038567231497
1255489515634003971
1255489034148864002
1255489022123704323
1255488972500893697
1255488492223844352
1255488378734292992
1255488347130257409
1255487763325095937
1255487381525970945
1255487009264721923
1255487001299648513
1255486833888296961
1255486666028068864
1255486615696400384
1255486610222784512
1255486374989508610
1255486239064678402
1255486080691961858
1255485935438958594
1255485892615159808
1255485815817482240
1255485419652894720
1255485396072435712
1255485390376632320
1255485328779096065
1255485289193263104
1255485159341785088
1255485101292601350
1255484841954508802
1255484753739948032
1255484648748199944
1255484608789045249
1255484416106823680
1255484373329235969
1255483979135942662
1255483780682448900
1255483569344000003
1255483307929874433
1255483267106603009
1255483123925573632
1255482886586863616
1255481539242135552
1255481284677308417
1255481176132915202
1255480253700608001
1255480234729709572
1255479964129988612
1255479939538866179
1255479933008257036
1255479408309284864
1255479382690476037
1255479019790831617
1255478769197944833
1255478561340874754
1255478533230596099
1255478070330511362
1255477866306945024
1255477428987838464
1255477303242641411
1255476827998556161
1255476080032481282
1255475968493355019
1255475804080934912
1255475728914751495
1255475707418943489
1255475684216094731
1255475591672971273
1255475142496526337
1255474995863707652
1255474963223584772
1255474907456180226
1255474888162242560
1255474595253178369
1255474458380337155
1255474114766274561
1255474099780046851
1255473645117411333
1255473565329227776
1255473487071850497
1255473344402591745
1255472787944341509
1255472626987872259
1255472513104187393
1255472512202407937
1255472467574915075
1255472205011587081
1255471986207309825
1255471739351576582
1255471532144578561
1255471526264135680
1255471027649482758
1255471016270278657
1255470331231338501
1255470194421575688
1255469234639056897
1255469181954383874
1255468996847116295
1255468907953037312
1255468615442235395
1255468610534940672
1255468551290400770
1255468286231425025
1255468276903280647
1255467921863839748
1255467657987588102
1255467580002832390
1255467434070458369
1255467417016377345
1255467154981433357
1255466821328744449
1255466568043106306
1255466501542498309
1255466371066081283
1255466358478962689
1255465955041447943
1255465248435376135
1255465191728349189
1255465131305324546
1255464814501126145
1255464723983761410
1255464329060679681
1255464313298567172
1255464012038443014
1255464003364667392
1255463878475108352
1255463868605911042
1255463804667940867
1255463316408975366
1255463221697404928
1255463109017436167
1255462989315977216
1255462807979655169
1255462643848134657
1255462191513382915
1255462089264697344
1255461802588155907
1255461286336438274
1255461124247601154
1255461073270067203
1255460985709760516
1255460981423124484
1255460912787587075
1255460563582431235
1255460247348658177
1255460241216548871
1255459900878196736
1255459854724009985
1255459802811072517
1255459797564116993
1255459784259784704
1255459607423713281
1255459527736143872
1255458909650903042
1255457854930202624
1255457621617885185
1255457444744093698
1255457296500563969
1255457029495361539
1255456458025635842
1255456101686038529
1255456073940639744
1255454355773444097
1255454093247643648
1255453973840105475
1255453550701936640
1255453442232942598
1255453441989771266
1255453435421511682
1255453141929283585
1255452897980174336
1255452637085995014
1255452526557761538
1255452222827253763
1255452130271428608
1255452082053808128
1255452021622288391
1255451991930798090
1255451885898784768
1255451800636882946
1255451634328576000
1255451503072083970
1255450983892693000
1255450452629557249
1255450095518089221
1255449870619508737
1255449789791166465
1255449703975698434
1255449348655243266
1255449276307693569
1255448506250166276
1255448453582372869
1255448231925997568
1255448091806896129
1255447626180411393
1255447459951673345
1255447347007565824
1255446863173607426
1255446622353448965
1255446225324826629
1255446197055225863
1255445692291649537
1255445645831307264
1255445528273444867
1255445118888402944
1255444403302346759
1255444068970176512
1255443732972871680
1255443732519964675
1255443585090150401
1255443371428139013
1255443290893189124
1255442681024720897
1255442629279592448
1255442479958175744
1255442405614067715
1255442148801085444
1255441744491098114
1255441412985892865
1255441154000195586
1255440996290170882
1255440765586718721
1255440730232930305
1255440666651492354
1255440568076898306
1255440398832545795
1255440233614671872
1255440127947608066
1255440008632324096
1255439736711372800
1255439691597348864
1255439662786764808
1255439647536275459
1255439585380904967
1255439168970338306
1255439016415158279
1255438959720759296
1255438427539091462
1255438273461342214
1255438191953313793
1255437923492810754
1255436948300333056
1255436806172131331
1255436474503266305
1255436221276467201
1255436009455652864
1255435989817884672
1255434804117594112
1255434727529631745
1255434433068519425
1255434410247294981
1255434346397421571
1255433935401738240
1255432679987785729
1255432677513101312
1255432208392871936
1255432000955170817
1255431881451077633
1255431835674427393
1255431326385221635
1255431253467283456
1255430790789369857
1255430640608174081
1255430501659299846
1255430466490044418
1255430124813594625
1255430086628708354
1255429914385436673
1255429861293916160
1255429793341939713
1255429775281262592
1255429518774468608
1255429492190982145
1255429449169936388
1255429423098200064
1255429392320417793
1255429360699486208
1255429327379890176
1255429294395981825
1255429163885965318
1255429154671079426
1255429100925341698
1255428969131905025
1255428828807258113
1255428618504802304
1255428574439489536
1255428359863054336
1255427989682216962
1255427593798647809
1255427082961719299
1255426946617544704
1255426025565106184
1255425685880999937
1255425627341164545
1255425594483003392
1255425316820004865
1255425279729827842
1255424898475974659
1255424695337435138
1255424608670490624
1255424461060407297
1255424355196166150
1255423950319910913
1255423773706248200
1255423730886545408
1255423629233459222
1255423616080109570
1255423343672668162
1255422987873943552
1255422546951974912
1255422402810576898
1255422307474067458
1255422010768928769
1255421984600719361
1255421922118119424
1255421693096611844
1255421174437359616
1255420937425559552
1255420794320060418
1255420253703737345
1255420185059692546
1255419930557677572
1255419888480518144
1255419619248156674
1255419541993279490
1255419256226840577
1255419248480063491
1255419174492475392
1255419138299830279
1255418981302796290
1255418796610916353
1255418670039343113
1255418572463104001
1255418258972446720
1255418171688968198
1255417617432674304
1255417232081014784
1255416655984943106
1255416053888421889
1255415619299704832
1255414994201726976
1255414892691062787
1255413798518882305
1255413689806618624
1255412247331065857
1255412179530104835
1255411308624842752
1255411204069232646
1255410736710463488
1255410546050043905
1255408983935987713
1255408644600008705
1255408559954804736
1255408526014451712
1255408446092070913
1255408143863087105
1255407451207282694
1255406911396237321
1255406792554749958
1255405937780764680
1255405553968451584
1255405367300947968
1255405074047733760
1255405058818277378
1255404652687958017
1255403944550989824
1255403288608018432
1255403282555641857
1255402518298988544
1255402246478626819
1255401256228659206
1255401225815764993
1255401123311169537
1255400481591091202
1255400415606329344
1255400388200747009
1255400223637110789
1255400112601411586
1255400091969560576
1255399622949908481
1255399340094488578
1255399326777556992
1255399220292526081
1255399064327389184
1255398908370526214
1255398573002371073
1255398485010059265
1255397749048082433
1255397703758077953
1255397655955603456
1255397638637342720
1255397602318827520
1255397590679642112
1255397424794918917
1255397009890193409
1255396344501501955
1255396321441316865
1255395997611626496
1255395973695787012
1255395938719404033
1255395813108461569
1255395658170871809
1255395008645148673
1255394942958141441
1255394933852254208
1255394600799395841
1255394594537312256
1255394426253463555
1255394093238280192
1255393928167260162
1255393924069371910
1255393623094550528
1255393593197461506
1255393495365365766
1255393358371074052
1255393187759357952
1255392802839592968
1255392715770081281
1255392331848613890
1255392249514516480
1255391404622258180
1255391366579920896
1255390074130305025
1255390031478427656
1255389725692702720
1255389638992199682
1255388212777844741
1255387197878001664
1255387157503586304
1255386866477662211
1255385910738407424
1255385536853880832
1255385492159451137
1255385370105131010
1255384530564911105
1255384090586550272
1255383801020198914
1255383775464361984
1255383504948539393
1255383437160206336
1255383289193521153
1255383083383173121
1255383053284843522
1255382857276669953
1255382849756319745
1255382828491169794
1255382392954634240
1255381026777563136
1255380575868813313
1255380360369786880
1255378886214529025
1255377160803692544
1255377159025315842
1255377157360168962
1255376905479618562
1255375678989643782
1255373967617122304
1255372728976265217
1255371994624929792
1255371845647437824
1255370764645269506
1255370316852977665
1255370228017573889
1255369218134093825
1255368951325962240
1255367065990500352
1255366637756321793
1255366200571428864
1255365280089456641
1255365178721476610
1255365078846767104
1255365076300845057
1255364493393231874
1255363986780033026
1255363842470817795
1255363809595863041
1255363511942819841
1255363446134226947
1255363442703314945
1255363432062357505
1255362296416735235
1255359333443002373
1255357810772185088
1255357514113302528
1255357324186783744
1255357127289384964
1255357023153278976
1255356523066339331
1255356011290001411
1255355409210191873
1255355329304461314
1255354918338269184
1255354436165214211
1255354247396327424
1255353251433676801
1255350696779624448
1255349772757671938
1255349357571948545
1255348879295483906
1255347560266465285
1255347389889679362
1255346229183164419
1255346194198519810
1255345428180144128
1255342390430306305
1255342345865908225
1255342303306276864
1255340616092913665
1255339405839130627
1255338995111940097
1255337772933681152
1255334191992123394
1255333737107263489
1255333490415013888
1255332284053495809
1255332168135557120
1255331338300936198
1255328243600809985
1255327733741162496
1255327132034781184
1255326705545289728
1255326037149392896
1255325492892311552
1255324618090598402
1255324198152671233
1255324086768713728
1255323892899549185
1255323047030140932
1255322235121930242
1255322177638928385
1255321955143737344
1255321015816728576
1255320000358907904
1255319435721793537
1255318525746569216
1255318504938573824
1255317611526721536
1255317356718546944
1255316886750924800
1255316884834209793
1255315907179687936
1255315641659203584
1255314776214945793
1255313780768231426
1255311693833519104
1255310882885767168
1255310629134630915
1255310582087135236
1255309846523641858
1255309568118325248
1255308878750892035
1255308781367496704
1255307738885865472
1255307643150831617
1255306306782666752
1255305809745129473
1255304735755841539
1255304656147931136
1255304486240817154
1255303269037019138
1255299943310467073
1255297310734589952
1255296513540001793
1255295937007812608
1255294731766181890
1255294455608983553
1255290653665304580
1255289719392526339
1255289650404634624
1255288981043978240
1255287887651901443
1255287510604886019
1255287062946820097
1255286742896304128