1258184718186614784
1258184494269464576
1258184422525984770
1258184019952402432
1258183871331516423
1258183805795434496
1258183384481792002
1258182958609031174
1258181187153076225
1258180797783302150
1258180679516540928
1258180150950277126
1258179720677646336
1258179565819695110
1258179537021464576
1258179386928517127
1258179373468917760
1258179330498273280
1258179321174413314
1258179080270249985
1258178949621985283
1258178660919578624
1258178457269346309
1258178396649111552
1258178134551269376
1258177877230706689
1258177626205798401
1258177442629459969
1258177407229575168
1258177240367579136
1258177232402616322
1258177078140248064
1258177052945133568
1258176431282106368
1258176035750895619
1258175614361710595
1258175208424378370
1258175208382496773
1258174880723451904
1258174662397353991
1258174454066274305
1258172906099572742
1258172138495803392
1258171998741635076
1258171781556449282
1258171694293843968
1258171604217069568
1258171453431861248
1258170980469522432
1258170611484037121
1258169972360175618
1258169780177076231
1258169562727669760
1258169494775697408
1258169480083054594
1258169160972021763
1258169080974106629
1258168320353845249
1258168025355870209
1258167498022797313
1258167213154086916
1258167172788076546
1258167056337379335
1258166841404542977
1258166180726145025
1258166116410589187
1258165940707102720
1258165928950407169
1258165827423141888
1258165790840426500
1258165600045670403
1258165331094376451
1258165221094567939
1258164873537695744
1258164828000202774
1258163777373175814
1258163325038465026
1258163013510746125
1258162916479709186
1258162340970799110
1258161944906944512
1258160777623633926
1258160596157112321
1258160210927144960
1258160091058114567
1258159602186756101
1258159160614682625
1258159037302087682
1258158940157853704
1258158605897007111
1258158520731676672
1258158354146476034
1258158167386722304
1258158066874417153
1258158043142983698
1258157951375859712
1258157802423541762
1258157728419074050
1258157707372253184
1258157681665343488
1258157477725691905
1258157335580639235
1258157206387728384
1258156851792957440
1258156171636211715
1258155664054071298
1258155571821322243
1258155382163341312
1258155001261764609
1258154623346642946
1258153702097108998
1258153454171758592
1258153064894267392
1258152931494371330
1258152806558687232
1258152681266466818
1258152396653461508
1258152140633190400
1258151858604040194
1258151818187681795
1258151693721784321
1258151569884839937
1258151399675891712
1258151301650747392
1258150370121060352
1258149229115117568
1258148925137092608
1258148502951034882
1258148391453949954
1258147914079141891
1258147889869721600
1258147872341733383
1258147865848881152
1258147671942074369
1258147663003955202
1258147215115157507
1258147088594096130
1258146822603800578
1258146678181433345
1258146145420836864
1258146119076511746
1258145891158036484
1258145812955238410
1258144539879096326
1258144386426208256
1258144364737552388
1258143960708546579
1258143770119462912
1258143648312590341
1258143299594072067
1258143186939191296
1258142809615470593
1258142806989733894
1258142660201717772
1258142638219419648
1258142604132323328
1258142491037089792
1258142451799412736
1258142404097474560
1258142276791959553
1258142185456795654
1258142048584118272
1258141613769011200
1258141177884393472
1258141175816560641
1258141106946088961
1258141026491019265
1258140980773085187
1258140807929958405
1258140579357249537
1258140151764733953
1258139938043965442
1258139870523994125
1258139588398383106
1258139415089684482
1258139218733301762
1258139071123259392
1258139065947508738
1258138484600176642
1258138451104468992
1258138372209553409
1258138338470563841
1258138261630988290
1258138185449852934
1258138017363099650
1258137966649790464
1258137380462235648
1258137370140041218
1258137304780222464
1258137234953457669
1258137176023465984
1258136931554263041
1258136882858377218
1258136721851637761
1258136556344410118
1258136187421839362
1258135921284833281
1258135693508907009
1258135606703644673
1258135563707781122
1258134999133495298
1258134852374847489
1258134672720232449
1258134605594595329
1258134404041498625
1258134322684592128
1258134296931586048
1258134201045483520
1258134147505303556
1258134020782731265
1258133996942262273
1258133604607148033
1258133557425377286
1258133410054356992
1258133205183586304
1258133021603123200
1258132897653030919
1258132815381757952
1258132729952174080
1258132531645419522
1258132330310483968
1258132311889108992
1258132239617077249
1258132116937887745
1258132035094417416
1258131706948857864
1258131644227170307
1258131489725841409
1258131320401731584
1258131165485072384
1258130859179286529
1258130237436473345
1258130199880839170
1258129741380554758
1258129569208578049
1258129491525763072
1258129417802592263
1258129313293090818
1258128699301511170
1258128680624193544
1258128273592238080
1258127653271453699
1258127408667992065
1258126949836361739
1258126875567808512
1258126816482676737
1258126635141865472
1258126316483813380
1258125985138053120
1258125946227490818
1258125912924717057
1258125848676306944
1258125726714400769
1258125306717708288
1258125204603187201
1258124942794731526
1258124694038986752
1258124492947296256
1258124288542019586
1258124188256256000
1258123833686536193
1258123815047045120
1258123776841199617
1258123744238804992
1258123574839259136
1258123523081543680
1258123354218823683
1258123175747104768
1258123137541120001
1258122892203773952
1258122659633733634
1258122601861390336
1258122553513648130
1258121983193165824
1258121943456321537
1258121803307929600
1258121728728989696
1258121708994809857
1258121593458503680
1258121381448953862
1258121325656322054
1258121310649167873
1258120847014932481
1258120815431897088
1258120782586273795
1258120763149815808
1258120713711607813
1258120702043054090
1258120491358752768
1258120138831933440
1258120082988961793
1258120068908679169
1258120010179936257
1258119972645220353
1258119927510286339
1258119885760204801
1258119847122272257
1258119768894255104
1258119648001826816
1258119609883992064
1258119574052012033
1258119511565373440
1258119507769528329
1258119494318383104
1258119471241330695
1258119439259762688
1258119398889488387
1258119349677764608
1258119303737618433
1258119264910938112
1258119234028212227
1258119185659580416
1258119150947401730
1258119112708050946
1258119101546971142
1258119072706965507
1258119032408092672
1258118994093117441
1258118984748150789
1258118955874619401
1258118922282377216
1258118910127325184
1258118876639965184
1258118859258822656
1258118845752938496
1258118817223512068
1258118784008806401
1258118779965452288
1258118743487643655
1258118709677301760
1258118636478308352
1258118603007823878
1258118570078343174
1258118560355946504
1258118013166981122
1258117674552496128
1258116841462992898
1258116396082507776
1258116182709764100
1258116102049222656
1258116060244574214
1258116053516931072
1258115791486169089
1258115663966670854
1258115602612457473
1258115420239933443
1258115399025152001
1258115272986316807
1258114767144747008
1258114716632846336
1258114689667563526
1258114311798566913
1258113966615728130
1258113694220746752
1258113693117632514
1258113692006182912
1258112573372862464
1258112241649532929
1258112140940128257
1258112101681369088
1258112049868967937
1258111893157359617
1258111753373847553
1258111739851309057
1258111712726827019
1258111649422233601
1258111638688993281
1258111599967195137
1258111569772380160
1258111566152597504
1258111522057920514
1258111489610842117
1258111431955943427
1258111393569681409
1258111338913714177
1258111308668559360
1258111260274688006
1258111229417095168
1258111078678122496
1258111001133752321
1258110965394149378
1258110929876779009
1258110894447476736
1258110879717101570
1258110859731140615
1258110823148519426
1258110782061019138
1258110754068332544
1258110720648118276
1258110690570756096
1258110657989394437
1258110656504528896
1258110589718724608
1258110551592448001
1258110375339450369
1258110319991443456
1258110278341984261
1258110213409984513
1258110178458767360
1258110165477478402
1258110151187456001
1258110120266997761
1258110116139659264
1258110063601999872
1258110009491193856
1258109741378809858
1258109703793586176
1258109697846099969
1258109087151259648
1258108874722287616
1258108823161667589
1258108782455947265
1258108776231481344
1258108683856347138
1258108620866281477
1258108590025564161
1258108546698395653
1258108537739382784
1258108494416359426
1258108451122749441
1258108435259887618
1258108407384543232
1258108398106705922
1258108368482439169
1258108357224927232
1258108340003094531
1258108285934338049
1258108198885736450
1258108122205433856
1258108069617242113
1258108033139441664
1258108014193713153
1258107958061383682
1258107903447314437
1258107804298227718
1258107778083815424
1258107770051661824
1258107747784167425
1258107709611802632
1258107677210796032
1258107608243863559
1258107580100087814
1258107551209721860
1258107483987554305
1258107459274780673
1258107427490275339
1258107393734574089
1258107368941944832
1258107327733010432
1258107295344533508
1258107291364179968
1258107259751673859
1258107232627175424
1258107140293693441
1258107105044766720
1258107051374456832
1258107005174198274
1258106981044367361
1258106931358679040
1258106899473428480
1258106745882316806
1258106557247754241
1258106337390624773
1258106259808620544
1258106171682181120
1258106028933210113
1258105712678440962
1258105694672347138
1258105668772470792
1258105594701021187
1258105589760212997
1258105303398260737
1258105213073993730
1258105166160691201
1258105056248856576
1258105026112880642
1258105001487917056
1258104769656348672
1258104722923421700
1258104580098920448
1258104293988671490
1258104286141186052
1258104124907884544
1258104022734647296
1258103961191620610
1258103402850070534
1258103118748889091
1258102849973690369
1258102635560927232
1258102403984961536
1258102378525532162
1258102020373917697
1258101984822874117
1258101525978775555
1258101514914185216
1258101067306409984
1258100931108974593
1258100854801997825
1258100691752681477
1258100541554597889
1258100462630457344
1258100016599580672
1258099750450139136
1258099715872301065
1258099666484371458
1258099531377500166
1258099301005303813
1258099155303641091
1258099032557322241
1258099003838869506
1258098929238933506
1258098907738972160
1258098894577315841
1258098859290525696
1258098836494585866
1258098819985793031
1258098400509267968
1258098163216519169
1258098067615682565
1258097220123004928
1258097110181912578
1258097108739129345
1258097004619718658
1258096648175194113
1258096295916589057
1258096209899720705
1258096100860407810
1258095981503135747
1258095621233393664
1258095568401948673
1258095522319142912
1258095492141068288
1258095451083091968
1258095409358155778
1258095328315822081
1258095193380642818
1258095191833014272
1258095049419743233
1258095004641382400
1258094946344673280
1258094760465760258
1258094372538724352
1258094357216968707
1258094343895879680
1258094325872963587
1258094207379689473
1258094107181842434
1258093928433229824
1258093894098735105
1258093576845697024
1258093520042278912
1258093399133032450
1258093384968929286
1258093320607318021
1258092730510606338
1258092699154108417
1258092248065064960
1258092244130844680
1258091932422672387
1258091862197448705
1258091369366781952
1258090966805872641
1258090927568105472
1258090813697019906
1258090797079109634
1258090782365540353
1258090702099136512
1258090485048127488
1258089930351431680
1258088779572707334
1258088778465452032
1258088388932108288
1258088340710199297
1258088316131565569
1258087959003303945
1258087947586490369
1258087710537011200
1258087493871730689
1258087162823749632
1258086582378287107
1258086470843277319
1258086291964559362
1258086087970471936
1258085956520939522
1258085714123784202
1258085216192782336
1258085021187006465
1258084774649966592
1258084693607682049
1258084558764945409
1258084480104968194
1258084472387440641
1258084434613501955
1258084276945522693
1258083884304130048
1258083789164683269
1258083610168643584
1258083140796645376
1258083059729141765
1258082684745572354
1258082373239033857
1258082139888910337
1258081976528982016
1258081943050207236
1258081890663305228
1258081099953176585
1258081019875545088
1258080848361988098
1258080341904052224
1258080322501124100
1258080024999219203
1258079939171155971
1258079462765150208
1258079460231790592
1258079153057906689
1258078815563243522
1258077942535663616
1258077578507833346
1258077553648177159
1258077416569950208
1258077076361445381
1258077041704030210
1258077025174257665
1258076659355435009
1258075651611013121
1258075288837197824
1258075287818043392
1258074956988141568
1258074143687348224
1258074081804668931
1258073865462452226
1258073372094758912
1258073354919186436
1258073176153763842
1258071429301575681
1258071158722871298
1258070883543011330
1258070663010623491
1258069362809896960
1258069243209355265
1258069136183353347
1258068628269871104
1258068310488473607
1258068257526951937
1258068066493227010
1258067807390089220
1258067692034174982
1258067012946976768
1258066925042753537
1258066921225928710
1258066665973186560
1258066551548362754
1258066245934604288
1258066204419391489
1258066041269297159
1258065935174455299
1258065748179800064
1258065674884255744
1258065651874267136
1258065536577146880
1258065435943227392
1258065301708701698
1258065272935796736
1258065045470273543
1258064919724986371
1258064864850763777
1258064819267276802
1258064661997649920
1258063913654067201
1258063880116453380
1258063207530455042
1258062807926521857
1258062756609228801
1258062740297601028
1258062659297185792
1258062410126163971
1258062164230840323
1258061959829901312
1258061871938224128
1258061840623558661
1258061184370081798
1258060890538233858
1258060876894044167
1258060774142087168
1258060308809224193
1258059809728933904
1258059324376649728
1258058598422327296
1258058506260881409
1258058362245300224
1258058303059505153
1258058229545947138
1258058164362240010
1258057993633124353
1258057770659708935
1258057740204871682
1258057646940160002
1258057626899959810
1258057514769317889
1258057497287495680
1258057401703546880
1258057054662656002
1258056430617153536
1258056031575445505
1258055567723106304
1258055482016763905
1258055375691145216
1258055345424957440
1258054811657928704
1258054780997570560
1258054284261949441
1258054227064225792
1258054149771583489
1258053195642933248
1258053167176015874
1258053166026772481
1258052936460099585
1258050827165618176
1258050815031476224
1258050687340085249
1258050597267308545
1258050552354803715
1258050525146341376
1258050135914930189
1258050062560657408
1258050017018941440
1258049632275501058
1258049598133862400
1258049049531465730
1258048903724838918
1258048745511493633
1258048577340932107
1258048425444216832
1258048339477700608
1258048125262053376
1258047939303411713
1258047922387791873
1258046249275662337
1258046142518001664
1258046032832798722
1258045511354941444
1258045482095566848
1258045027407876096
1258044961217482754
1258044308445433856
1258044268888932353
1258043904227774472
1258043131632717832
1258042985071116288
1258042784445014020
1258042579586818049
1258042355258621952
1258042256705101824
1258042237793026049
1258041890269732873
1258041837354393600
1258041638359891968
1258041611004624896
1258041523305922564
1258041463310553093
1258041367680487426
1258041237350813699
1258041205469974528
1258041181667233794
1258040944936603654
1258040905740816387
1258040787591409667
1258040781392224256
1258040563074564099
1258040391103905793
1258040335973965825
1258040320006201348
1258040285172465665
1258040105727660033
1258039890832510976
1258039882452271104
1258039802773082115
1258039668177846272
1258039426569158656
1258039424656371713
1258039103486132224
1258038145075032065
1258037515459661827
1258037003192619010
1258036679119638529
1258036052943466498
1258036050808561664
1258036049739001857
1258036038758531072
1258035989609476097
1258035880880672768
1258035757530394625
1258035495239630848
1258035227240345604
1258035064689930245
1258033836392316928
1258033740368023552
1258033730540769281
1258033268454313985
1258033193422290945
1258032824482963457
1258032785832333316
1258032782984351744
1258032779251421185
1258032777779273728
1258032692463054849
1258032618186125313
1258032614113452033
1258032536229482498
1258032452448198657
1258032197128388611
1258032184834883586
1258030893035253761
1258030871690477568
1258030735530897408
1258030666698100736
1258030232759656448
1258030136953384962
1258030086965641222
1258030075867521029
1258029953188270083
1258029613239996416
1258029382494564354
1258029322591485952
1258028725486133252
1258028592640004096
1258028497156689921
1258028318860939265
1258028099389788161
1258027977260097537
1258027787891486722
1258027626188414982
1258027548535119873
1258027511868469248
1258027288341499904
1258027235119976452
1258027131403149312
1258026922778464256
1258026837684477953
1258026764913258496
1258026614383837184
1258026545769259013
1258026508624502786
1258026397395824641
1258026358187442177
1258026266126700544
1258026237269868549
1258026236472733696
1258026223873056773
1258026188276146182
1258026143749414912
1258026066372952065
1258025948966014979
1258025873074196480
1258025518055723008
1258025395682791425
1258025243052032001
1258025118309199875
1258025088001204225
1258025087472721920
1258024642163412992
1258024609590452224
1258024593694089216
1258024390542974976
1258024147755642881
1258024124678537216
1258023862756937730
1258023644824911872
1258023583022034947
1258023383490613248
1258023128820854784
1258022535834357762
1258022509343133697
1258022324877406209
1258022240387563521
1258022126914867200
1258021793396330496
1258021447202635787
1258021201194086403
1258021199637970945
1258021198518038531
1258021138736861185
1258021036437749760
1258020530264903681
1258019945184661506
1258019693660475398
1258019530753925120
1258019274679091201
1258018893257416706
1258018666471395330
1258018457188253696
1258018409822007296
1258017354807685120
1258017085948661760
1258017065467854848
1258016972572418049
1258016951223201794
1258016252720807938
1258015619418591233
1258015167599837186
1258014877857255424
1258014843006746630
1258014786949914624
1258014658759397377
1258014146777489409
1258013984457986050
1258013602621140993
1258013531691192321
1258013447238844419
1258013208419414019
1258013157429256193
1258012754667024385
1258012541235707904
1258011937419526144
1258011134751318018
1258010793347633152
1258009372330004480
1258008758489210888
1258008459280343043
1258008167033831425
1258007854272909313
1258007345021497344
1258006671743385601
1258006594736066561
1258006556798595072
1258006474434936833
1258006333124739075
1258006062554329088
1258005778654466050
1258004505733537793
1258004254926737408
1258003765829021696
1258003521267515392
1258003140462469124
1258003042391244806
1258002292369960962
1258002095426482176
1258001044384210947
1258000957956390913
1258000788405866496
1258000785205612544
1258000617597009920
1258000509966913537
1257999542332637186
1257998949643956230
1257998781599055874
1257998532935651329
1257998419504881664
1257998366992150528
1257998354803499013
1257998341478195200
1257998328190689282
1257998311832932353
1257998301124800517
1257998291243077632
1257998276604956672
1257998265943015425
1257998250755399681
1257997885570002945
1257997827688538112
1257997785007259649
1257997683328987136
1257997461936918528
1257997432723562496
1257997287093145600
1257997113855750145
1257997044402343937
1257996554104946688
1257996261204070400
1257996212717977600
1257995465947328513
1257994902555803648
1257994853704699906
1257994703666110464
1257994090706337792
1257993956970901504
1257993942987046913
1257993906328911873
1257993666322468864
1257993381747347456
1257993310754557953
1257992385570668544
1257992193308065794
1257992102836875265
1257991825220153344
1257991792210972674
1257991702763188226
1257991633326522370
1257991405680689152
1257991311422115841
1257990940695957506
1257990773066412032
1257990075478159360
1257990036030660616
1257989888181514240
1257989815557128192
1257989672447475712
1257989498111062016
1257989053661798400
1257989017611763712
1257988368979410945
1257987606069026816
1257987063582011392
1257987032804134914
1257986944732147716
1257986883986038789
1257986763538169856
1257986575302098945
1257986089589014534
1257985751255564288
1257985734750937088
1257985472334307330
1257985385533243393
1257984718324236288
1257984275384881152
1257984174167818240
1257983939450413057
1257983570410381314
1257983484771151873
1257983408237678592
1257983322346721282
1257983054875934723
1257983045010939905
1257981659951050752
1257981577021308928
1257981339011289089
1257980664240013313
1257980656602288128
1257980363747536897
1257980199158845441
1257980122386313221
1257979927657418752
1257979805485670400
1257979574056636419
1257979535259242496
1257979525440438272
1257979366279176192
1257978870185279488
1257978389257957379
1257978233166970880
1257978189919531008
1257978091521130496
1257978048714084352
1257977744220192768
1257977631431065603
1257977423808925696
1257977301880442883
1257977242967293953
1257977059139338240
1257977019620614144
1257976704158650368
1257976619945377792
1257976600039165953
1257976314776162304
1257976253090537474
1257976195481776129
1257976173835046912
1257976149948448769
1257975638247555072
1257975606354104320
1257975432353374210
1257975258113544193
1257975203772145664
1257974918999932928
1257974708915572743
1257974570415464448
1257974555164975104
1257973828212461568
1257973826966769664
1257973825817530369
1257973824622116870
1257973823426760705
1257973820541018113
1257973808440528896
1257973583642583040
1257973009782104064
1257972204719034369
1257971969510817792
1257971459001135105
1257971002786660353
1257970869386842115
1257969761335627783
1257969421932539905
1257969111465897985
1257968259699298304
1257968103352406016
1257967743258820608
1257967164906242049
1257967056315613188
1257966971347300352
1257966922131476483
1257966890246381575
1257965874109087745
1257965345278767109
1257965334377553920
1257965279440711681
1257965251514990592
1257964738421690368
1257964514861092865
1257962863815061509
1257962803010379777
1257962321177010176
1257962318635298821
1257962315661447168
1257962301426143232
1257962119124877313
1257961774202093568
1257960969004896256
1257960835391148034
1257960821352812545
1257960791262846977
1257960615991226370
1257960078868652033
1257959402897842176
1257959391497728001
1257959298866520064
1257959297025110016
1257959295615774720
1257959054204379137
1257959041025925125
1257957712798908417
1257957712081674240
1257957685145808898
1257956781835378691
1257955794768793600
1257955669040418818
1257955604850708480
1257955488970522625
1257955069984735234
1257954745546878977
1257954616517562369
1257954571734994944
1257954479422529536
1257954159799615493
1257953777870610432
1257953575352840192
1257953423527481344
1257953071205945345
1257952437673103360
1257952242751229953
1257951585029758976
1257951271660720128
1257950678225498112
1257950582465273856
1257950459500904448
1257950146643611648
1257949842795646976
1257949826328801285
1257949200379252736
1257949064798310406
1257948640703897603
1257948563335778304
1257948493253091328
1257948068105850880
1257948032605270016
1257947395679232005
1257947249499389953
1257947135980560384
1257946926244417536
1257946507510255619
1257946348315389953
1257946330816753665
1257945761272205312
1257945504606019584
1257945451220926466
1257945098148409345
1257944925678731264
1257944900932448256
1257944696053215233
1257944603367522305
1257944511461892097
1257944500229595137
1257944209920647168
1257944072800608263
1257943968265965569
1257943592879955969
1257943484310454273
1257942861565366272
1257942811434979329
1257942802937364480
1257942404973211649
1257942249247293440
1257942092602658816
1257941956518449152
1257941680373805057
1257941203762532355
1257940876938170372
1257940607223443456
1257940411462664192
1257940057970728961
1257939884301529088
1257939773060251648
1257939655795847168
1257939173224386562
1257938884136222720
1257938858207072258
1257938833745870849
1257938690892062725
1257938470699442177
1257938428110520320
1257938278856228864
1257937789766819840
1257937739741384704
1257937695965405184
1257937572808011778
1257937513915854851
1257937368352542721
1257937174311337984
1257937135430250496
1257936981746728961
1257936933101146113
1257936921730453505
1257936847050870791
1257936467902464005
1257936418724294656
1257936414450253825
1257936043829059584
1257935819962306560
1257935639959547904
1257934207441084417
1257933930784792576
1257933638722863104
1257933380261416961
1257933192209858560
1257933029164699648
1257932870569656320
1257932558001725446
1257932190534512641
1257932136532914177
1257932057336066048
1257931753827811329
1257931726074118145
1257931363505889281
1257930250287304705
1257930166417920000
1257929649193091072
1257929635184156672
1257928983913660416
1257928055445733376
1257928040807575552
1257928033018810368
1257928012542160896
1257927102600482817
1257926946572382208
1257926667357638656
1257926266398916613
1257926124480475136
1257925998743519232
1257925356780163073
1257925355823869953
1257924452144287745
1257924086661107713
1257924063852445697
1257923680358760448
1257923603636670464
1257923416658771973
1257923345078784002
1257923329438232577
1257923321930436608
1257923265919692801
1257922972901310469
1257922870707138560
1257922572123078657
1257922526744903680
1257922461049458688
1257921868041945090
1257921762966241281
1257921546582028288
1257921544967172096
1257920599160217600
1257920456168026112
1257920093696200704
1257919782164156416
1257919780809367552
1257919568477110277
1257919196123586561
1257917916030423040
1257917800137531392
1257917237408792578
1257916872856604672
1257916445754785794
1257916428424011776
1257914770285572099
1257914659224588289
1257913119747301378
1257912635481296896
1257912571639848961
1257912273017896965
1257912258438537216
1257911912018391042
1257911739540258816
1257911458215743488
1257910215095263232
1257910180852817920
1257910166869155840
1257909506744426500
1257909502952779777
1257909104271654914
1257908382251524096
1257907379896750082
1257907342701723649
1257907026535100416
1257906811555856386
1257906800113995776
1257906458189955073
1257906379689353217
1257903193910099969
1257902553775431680
1257902436536238081
1257901921605574656
1257901917973303297
1257901914798190595
1257901559750557697
1257900365472829441
1257899806179164160
1257899162231885831
1257898837940862977
1257898545870405632
1257898385434181635
1257898199223844864
1257898140004474880
1257898103048474624
1257898031103578118
1257897971674492929
1257897886098116609
1257897833912565761
1257897777192976390
1257897647840661504
1257897528500109312
1257897400645169153
1257897329958490112
1257897273675128833
1257897182335811584
1257897029436682241
1257896827568951296
1257896825912262656
1257896823240511493
1257896821529206784
1257896333215707137
1257896311510228992
1257895930931695622
1257895872903483392
1257894886830940160
1257894589802954752
1257894208888868865
1257893308854087680
1257893231150477314
1257893102280417280
1257892645038444544
1257892066127986689
1257892009957785600
1257891604406378496
1257891371542818817
1257891260741890048
1257891120866041858
1257890964087222273
1257890864262721537
1257889784296542208
1257889592717574150
1257889198226444289
1257889031179952130
1257888915295526912
1257888585203810304
1257887790802616323
1257886325723848705
1257885813452558341
1257885270847959041
1257885116585697281
1257885108243247109
1257884984926445568
1257881910874906625
1257881404890898432
1257880374044241922
1257879832794464257
1257879804713611264
1257879156714622982
1257878788429484032
1257877174893318144
1257876736043372546
1257876704732811264
1257875670673342466
1257875554067533825
1257875057461911553
1257874574710104064
1257874530669920260
1257873324937486336
1257872747021156353
1257872473443442694
1257869218114088960
1257868909874753536
1257867651008942080
1257867624505061376
1257867602103328769
1257863733432520711
1257861361981370368
1257861168070352896
1257859121128357894
1257858830840586241
1257856168237633538
1257855902545297413
1257854240002883588
1257854205299249152
1257853956275015683
1257853882035769346
1257853120266240002
1257852197913714688
1257851515160522753
1257851354946691073
1257851263934496771
1257849643356041216
1257849366943064064
1257849222143135750
1257849169022238724
1257848496801054724
1257847928326062081
1257847611186450433
1257847494207299585
1257847154988797957
1257846920308981762
1257846600136867841
1257846523104235520
1257846368187625473
1257845980730458114
1257845936459583489
1257845016145297408
1257844306221686784
1257844130711064581
1257843735427256321
1257843727227392001
1257840758117281792
1257838728262955008
1257838448964251648
1257838067488108544
1257837709751713792
1257832381211447296
1257831441729228802
1257831441376952320
1257828652919775232
1257827556448964608
1257827448928034819
1257825800247742472
1257825792760971265
1257825477907099653
1257823417287483394
1257823406482915330
1257822957524725760
1257822828973436930