1102715667982237697
1102702593317445632
1102697389230641152
1102681626910187520
1102679796532731905
1102679002232217600
1102669230242172928
1102666761948749824
1102666097088696323
1102660964162269185
1102654104466145282
1102651008210137089
1102644052053422082
1102643059865595904
1102642803513782272
1102642514295578624
1102640932619468801
1102640049773072387
1102636675480510464
1102636577220632578
1102635457542844418
1102634342201913344
1102634337827196928
1102631598636392448
1102631129184518144
1102630398369030144
1102630196425957377
1102629288950538240
1102622466461949952
1102621604436234241
1102619673135214592
1102618900619878401
1102618035649740802
1102613835410624513
1102610770095833094
1102610079004659712
1102610042002595840
1102610011577110530
1102608832130363398
1102606798060609536
1102606693408464897
1102600440947052544
1102599417817976832
1102597765744418817
1102596313940746240
1102593792232833024
1102593543204413446
1102592963496992769
1102592533257957382
1102590864486891520
1102590386172817409
1102583687521161216
1102580457458331648
1102580272069894144
1102578352563646470
1102575001453027329
1102572952674017283
1102572860663422976
1102572248928534529
1102572037850071041
1102570360225124352
1102566679782047744
1102565650604613632
1102562180896043008
1102561089533894657
1102556244026355712
1102553037648945152
1102553032053661696
1102552305931571203
1102552026339266560
1102552021759152128
1102551304587694080
1102551300133347328
1102551228238708736
1102549275488251904
1102549010223718404
1102549005232332805
1102548000352677889
1102547996187734016
1102547279884488705
1102545999824932864
1102545995529895938
1102544634348269570
1102543506080518145
1102540966236442624
1102540961249398784
1102539197913681920
1102539102568751104
1102538715962855427
1102535686270476288
1102529572875235328
1102529504042352640
1102525769786499078
1102525636067774465
1102522515371552768
1102522071387594752
1102521975849828353
1102520763251191809
1102513648986214400
1102512852554969088
1102511938896986112
1102511437086371841
1102510674138333184
1102510259602669569
1102506424431570944
1102505178291421185
1102504393956573185
1102502296112390146
1102500992132644864
1102493684547887104
1102491901779943426
1102484895694241792
1102483994753617921
1102481942346375168
1102478793753583617
1102475783342301184
1102469913761898496
1102468521940807680
1102468020717477888
1102467846066577409
1102462630311030785
1102458793907159041
1102453685190356993
1102448211866742784
1102447477423292418
1102447247168602112
1102447154956767232
1102441127079264258
1102434291320008704
1102361962757861377
1102358491900141568
1102358007055294464
1102357991528034310
1102357989263056896