1256734775987052547
1256734461611380741
1256733864531300353
1256733542840762368
1256733242440458240
1256733172890468355
1256733084092960768
1256732920015921154
1256732875547979776
1256729969188888576
1256728818859094016
1256728348660809728
1256727406309769217
1256727025194274824
1256725992871284738
1256725341529309184
1256724423798816768
1256723820620263427
1256721522602979330
1256721468039233539
1256721335402856448
1256721143412727808
1256721009484406784
1256720977502879753
1256720660505800704
1256720496571400202
1256719985105387521
1256719490626334720
1256719308861984773
1256718148180627458
1256717832810872839
1256717195633217536
1256717115199033350
1256716755533279233
1256716217081094144
1256716136458133512
1256715910548795398
1256715864289742848
1256715557593919492
1256715283672305665
1256715090151211009
1256714959100219392
1256714580304289793
1256714192742223873
1256714037179625473
1256713612791595010
1256713520059764737
1256713235597627392
1256713016407666688
1256712723238391813
1256712719685824512
1256712711267856385
1256712537384660992
1256712008042459137
1256711330893094912
1256711323515265027
1256710345151983617
1256710318111158272
1256709771501219840
1256709462833934342
1256708941062553605
1256708781548978181
1256708651080986624
1256708629778096137
1256708552657338368
1256708364375068674
1256707383583281152
1256706839208697856
1256706646241357827
1256706600867450882
1256706359141285890
1256706333031661571
1256706280242151426
1256706223396868099
1256706056077676545
1256706031469633536
1256705882911657984
1256705451024056320
1256705051248164867
1256705038505869317
1256704979261366274
1256704934109745152
1256704847212154880
1256704801318023174
1256704581423239169
1256703467181281282
1256702742988500992
1256702654706790400
1256702580270469125
1256702542953828353
1256702509286072321
1256702494769643521
1256702482228686848
1256702396635512832
1256702223830200321
1256702207384313856
1256702184907030530
1256702145820274688
1256702111192166401
1256702048386584577
1256702004954648578
1256701997207748609
1256701696136433665
1256701689056440320
1256701611566604290
1256701586379870214
1256701418699993089
1256701333824065537
1256701315893297154
1256701287627993089
1256701272473980930
1256701206942154752
1256701098389311493
1256701050041634816
1256700985369657346
1256700941522407430
1256700867744538625
1256700804175708165
1256700795648716800
1256700714593783809
1256700662496272384
1256700627507466246
1256700554664951812
1256700296375545863
1256700168663072770
1256700122328678402
1256700072944943105
1256700010303033346
1256699922839212033
1256699357904220165
1256699110217973761
1256699011295297539
1256698223814684674
1256697913394319360
1256697900500955136
1256697191038672897
1256697176463474690
1256697146562285574
1256697087372206081
1256696791921197062
1256696144266170368
1256695979769815041
1256695929790488577
1256695690526445569
1256695436850716674
1256695339886587905
1256694939364274178
1256694769406926849
1256694752549969924
1256694669385314305
1256694633163370497
1256694430586863616
1256694358084108291
1256694252039540737
1256693948468408329
1256693678715830275
1256693619391696904
1256693540907778048
1256693327103213569
1256693098404548608
1256693049553555456
1256692584828882945
1256692443514376194
1256692158926655492
1256691981373317127
1256691146568478726
1256691021209108483
1256690851239124999
1256690518194556929
1256690088194592769
1256689364182216704
1256688957808656384
1256688882361536513
1256688789407379456
1256688543986040837
1256688186199285760
1256688128175341570
1256688086232240131
1256687672875253765
1256686965065314304
1256686807455903744
1256686776745418758
1256686703089238016
1256686474017361920
1256686366525620225
1256685810952351749
1256685708032593926
1256685615149658116
1256685259166412802
1256685083987230722
1256684901820256259
1256684855594815489
1256684613688332289
1256684548689219586
1256684472252145665
1256684382343102464
1256684148489584643
1256684124389154817
1256684087416369154
1256683443842408450
1256683126732005377
1256683015490678785
1256682732295462913
1256682629597970443
1256682276475240451
1256682046598057984
1256681930650800128
1256681728925712387
1256681608918241280
1256680952841080832
1256680614968909831
1256680473390088192
1256679730948059138
1256679250960109568
1256678966791987200
1256678528038436865
1256678230498652160
1256677750825459727
1256677689726926848
1256677422126305280
1256677369592627205
1256677210079010816
1256677207432404993
1256677190709710851
1256677133478395904
1256677075467096066
1256676763280773120
1256676747648667649
1256676697774198786
1256676548805083136
1256676468760993795
1256676458765918209
1256676455414710272
1256676423596736512
1256676378411499523
1256676352712937479
1256675805041737728
1256675615656292355
1256675496756162566
1256675282867666946
1256675102508363782
1256674665008967680
1256674591516344323
1256674394052734976
1256674279816679428
1256674174543806465
1256674070000697345
1256674003504320516
1256673877759008769
1256673588112961539
1256673553694494727
1256673507150266368
1256673455866621952
1256673431275307019
1256673399448973312
1256673355736010756
1256673301222621185
1256673253134929920
1256673208520126464
1256673155030102017
1256673107395346432
1256672643480203265
1256672441109106689
1256671452415365120
1256671312304582661
1256670917058605057
1256670876487073798
1256670710061240326
1256670665089974273
1256670645397618689
1256670522127069184
1256670463905824768
1256670180811382784
1256669846839926790
1256669838120009730
1256669821078589440
1256669799578558464
1256669682066743296
1256669549887438858
1256669526470647813
1256669168213962752
1256668591472197632
1256668266623369219
1256668246721339399
1256668150583701509
1256667848551907329
1256667760236670976
1256667550156496898
1256667519273885703
1256667429658296322
1256666970973507586
1256666613874675718
1256666352938614789
1256666286593126400
1256666285326372870
1256666166182973440
1256665711239409672
1256665663613132806
1256665568851173379
1256665401695653888
1256665313543847943
1256665069947158534
1256664769341333512
1256664136420921350
1256663956497797125
1256663200910782465
1256663190890516487
1256662801260691456
1256662779202854913
1256662624378302470
1256662608607920128
1256662055135961093
1256661424195108866
1256661381581090817
1256661063728271361
1256660973693415424
1256660869053845504
1256660845364477953
1256660783905345537
1256660281650032644
1256660246690398208
1256659844519604224
1256659587647901698
1256659479715811328
1256659164845223936
1256658904622260227
1256658586543022081
1256657772726411265
1256657140372123654
1256656519413878798
1256655997772484609
1256655914968518656
1256655693865783297
1256655663079587842
1256655275110674432
1256655267762188290
1256655143485005824
1256654902069264384
1256654838382972931
1256654580458364930
1256654330058338304
1256654329018122241
1256654323829706754
1256654238035386368
1256654220390027267
1256653836019740672
1256653712669507584
1256653604037025796
1256653433781784576
1256653398428069889
1256653172199829504
1256652810508136448
1256652806129418241
1256652590764265472
1256652370945150977
1256651776733917184
1256651506113282049
1256651012795961344
1256650885586989056
1256650687976529931
1256650564152242176
1256649606718521346
1256649327029690369
1256649005100081161
1256647686956163075
1256647670954733568
1256647573391257601
1256647501664399360
1256647456080699399
1256647091121803271
1256646940261076992
1256646892303331331
1256646787378679811
1256646631040192512
1256646581308329986
1256646521891647493
1256646520822042629
1256646397333553152
1256646156660232192
1256646143678824450
1256646021314199552
1256645893211725825
1256645350816985090
1256645261113335809
1256645163503534080
1256645068993318912
1256644988626239490
1256643913135394821
1256643890259669000
1256643724135796738
1256643553280884737
1256642986265522178
1256642613131837440
1256642508492283906
1256642471754375169
1256642351742758923
1256641753848963072
1256641488164802560
1256640967039475712
1256640710406701056
1256640162471313408
1256640139188678662
1256640065901641730
1256639865724305408
1256639433195077634
1256639147437182976
1256638823821389825
1256638425207386119
1256638323365462017
1256637753544118273
1256637559628857344
1256636670620958720
1256636201903157248
1256636065408061441
1256635860126183424
1256635802471337995
1256635695357140992
1256635494621949953
1256634899156684802
1256634768642527232
1256634612702461957
1256634521346326531
1256634442103193600
1256634338533412864
1256634276801662976
1256634186695421953
1256633628051857410
1256633439308169216
1256633196600492032
1256633121082150917
1256633063116804097
1256632853577764864
1256632647780118529
1256632620072546309
1256632437418983426
1256632413368827905
1256632372793131008
1256632074762686465
1256631746088632320
1256631685074104322
1256631594963607554
1256631384183050240
1256631327018934272
1256630763656744961
1256630712939266048
1256630583163322371
1256630557615800321
1256630471053762560
1256630412111200257
1256630314304241667
1256630134150438913
1256629893414207491
1256629627302313986
1256629456342564866
1256629158009901057
1256629103291256832
1256628832825683969
1256628827029229573
1256628792732332036
1256628605284646912
1256628358751944711
1256628127603871745
1256627909353144325
1256627602208546816
1256627253968076800
1256627072526692353
1256627060241567746
1256626538352697344
1256626513425895427
1256626411575656448
1256626356420521984
1256625934616137736
1256625798280351744
1256625614016204800
1256625587264851980
1256625560517738497
1256625547112787975
1256625486123458560
1256625099257589762
1256625014968930304
1256624776870846464
1256624606338842625
1256624517440581635
1256624251219697664
1256624110207143936
1256623978317307904
1256623800046833669
1256623628474597376
1256623553820188674
1256623237196210180
1256623075971551232
1256622883486478338
1256622802779738112
1256622692184338433
1256622488143966208
1256622305763090432
1256622045674319877
1256621755814248448
1256620938306732034
1256620913375825924
1256620851476271105
1256620782714793984
1256620757872005122
1256620637302542337
1256620498101796865
1256620239753641985
1256619987126665218
1256619986900201473
1256619956281708549
1256619947893100544
1256619885129535488
1256619845241757697
1256619787964293124
1256619785154166785
1256619617402978305
1256619218977665026
1256619062819459074
1256618703556349952
1256618703426387970
1256618672292089856
1256618584484253701
1256618565396029448
1256618553635110914
1256617505461882881
1256617358485073920
1256616500062040066
1256616482823450624
1256616388954861570
1256616360223875073
1256615919301910529
1256615135692623873
1256615004633214976
1256614763594948608
1256614755093172225
1256614026567614465
1256613839606595584
1256613715870453760
1256613523905556483
1256613518473912333
1256613414719324160
1256613363838222336
1256612972455251968
1256612888309051394
1256612794654433282
1256612672746844165
1256612634289418243
1256612208529809410
1256612148421296135
1256612142456987650
1256612041118191616
1256611561059336192
1256611453907488768
1256611297191268352
1256610879422050307
1256610879132622851
1256610690833530888
1256610605282340876
1256610547048554496
1256610517591957506
1256610416010158090
1256610183826071554
1256610141807525890
1256609643394146305
1256609609512628229
1256609324035604480
1256609282646323202
1256609126869852165
1256608650409492480
1256608338932105216
1256607858138939394
1256607758008422403
1256607553397698560
1256607531000123393
1256607379891851269
1256607106595160064
1256606900491292672
1256606752424054784
1256606726377349121
1256606385950818304
1256606381894971393
1256606280518680576
1256606124054364160
1256606080991461377
1256605956605186048
1256605565549268996
1256605548683935745
1256605496984862720
1256605412054446083
1256605192939868161
1256605105140482048
1256605097183895553
1256604764676280320
1256604720824823808
1256604544852688899
1256604495720656897
1256604461956554752
1256604293672701953
1256603706428096517
1256603536793665536
1256603454883213315
1256602834809892864
1256602819509080067
1256602438947266565
1256602096331370496
1256601187039805443
1256601096975310850
1256601096102936578
1256600399009787904
1256600020767461379
1256599873215852545
1256599857021816838
1256599491257532418
1256599428166811650
1256599221760819202
1256598597963059203
1256598401912901632
1256598388121927680
1256598378458370049
1256598344916520962
1256598310569345025
1256598173570797568
1256597488003416064
1256597334609313793
1256597064600952833
1256596870585081856
1256596227115933698
1256596177014984704
1256596057930313728
1256595742828961792
1256595543301804033
1256595511571894273
1256595398828920832
1256595158264668160
1256594956816351234
1256594720173817864
1256594540762402817
1256594425637154816
1256593992894091264
1256593798844616704
1256593700861468672
1256593582972194820
1256593164527435776
1256593055970480129
1256593047309221888
1256592833466826753
1256592694341754881
1256592318884438017
1256592127615787011
1256591998238298112
1256591744906547203
1256591422159040514
1256591319973220353
1256591216684216321
1256591145087520770
1256590941688934400
1256590738101600258
1256590688491315200
1256590527165861888
1256590051682779138
1256589622529925120
1256589517420662784
1256588904439992320
1256588656309141504
1256588592207495168
1256588355762106368
1256588201667551232
1256587959836577792
1256587950428696579
1256587700385259522
1256587659876720640
1256587568260538368
1256587328233050116
1256587075081637895
1256587074414817280
1256586990755209219
1256586674164776960
1256586636160372736
1256586531210506240
1256586491783974918
1256586299605213185
1256586279552192512
1256585500737093637
1256585285594480640
1256584800921681921
1256584758211026944
1256584734160957442
1256584435354517506
1256583489274753025
1256583180615921664
1256582886725242887
1256582763991519232
1256582590519181319
1256582559242301441
1256582395081428992
1256582382301229056
1256582332724674560
1256582238977822720
1256582161223823360
1256582011285843969
1256581879085576193
1256581451518291968
1256581271171596288
1256581163906465793
1256581110756265988
1256580879457148928
1256580213544280065
1256579938595016706
1256579924116242432
1256579870055948288
1256579785091944448
1256579741206880256
1256579726552051715
1256579680314036224
1256579612009791489
1256579484368744448
1256579408007237636
1256579068323082242
1256579004301221888
1256578953311072259
1256578819068170241
1256578790735728642
1256578722930589703
1256578648943013888
1256578345942290432
1256578229676228608
1256578198374100992
1256578108817379329
1256577224834256898
1256576853730566144
1256576737841942529
1256576690538663941
1256576677762736128
1256576611241115651
1256576565665808385
1256576218096234496
1256576213134585858
1256576151218241537
1256575884099756035
1256575881197338624
1256575853133168641
1256575840621559813
1256575764356620289
1256575705640505350
1256575437028950021
1256575182971559936
1256575159747719177
1256575067242270720
1256574783480881152
1256574734462005249
1256574711829614592
1256574577788010496
1256574086064545792
1256573875527303168
1256573568537763841
1256573498874638337
1256573232276275203
1256573147962396675
1256572705727528965
1256572549481275392
1256572503297835008
1256572400495403010
1256572247596314624
1256572051831349248
1256571774260719617
1256571576146944001
1256571540671471616
1256571340724764672
1256571289147506689
1256571088076750849
1256571077708468225
1256571034930741248
1256570617656115201
1256570438236491784
1256570399346884611
1256570377330929664
1256570345307471872
1256570080827191296
1256570006026027009
1256569852392865793
1256569532753350660
1256569295821250561
1256569229920403456
1256569204310003712
1256569043286470656
1256568835458715648
1256568734468186113
1256568488333905920
1256568466330525696
1256568165175353344
1256568154182103040
1256568132749209602
1256568097877745666
1256568087404560385
1256568031108567042
1256567831614947328
1256567718498746369
1256567564752302081
1256567416974385153
1256567331574210560
1256567328411713536
1256566930183520262
1256566754890964996
1256566692731400192
1256566350992101376
1256565923252703233
1256565770617831426
1256565425111994368
1256565165224583171
1256565129824608258
1256565079975383043
1256565023880642564
1256564990766612480
1256564732254969856
1256564611291189250
1256564581968818177
1256564216741363712
1256563999954685958
1256563990085369861
1256563880471511040
1256563783402688512
1256563733356261376
1256563655971418112
1256563446352621571
1256563404459978753
1256562695219879937
1256562120059236352
1256562097028313089
1256561771713835008
1256561699567566848
1256561547935170560
1256561388044062720
1256561360965697537
1256561086096199680
1256560946316746764
1256560892478722048
1256560865043718144
1256560849814269953
1256560684697030662
1256560682566385671
1256560664363048967
1256560223701123074
1256560196786233345
1256560196186451968
1256560027944587264
1256559958352629760
1256559822570508288
1256559615434768389
1256559526888824833
1256559437168459778
1256559360832081921
1256558567945052160
1256558487406067712
1256558242420920321
1256557746801041408
1256557696666554368
1256557656598294529
1256557381196156933
1256556980950437888
1256556883684528128
1256556852072132608
1256556684576804864
1256556646555418625
1256556591815577601
1256556399619866625
1256556239280123906
1256556105976733696
1256556101803409408
1256555902485831680
1256555791974350854
1256555785666076672
1256555752086548486
1256555247813701636
1256555233817362434
1256555161591386112
1256555105517789185
1256554705246924800
1256554603484676097
1256554579484905472
1256554479165624321
1256554386379194368
1256554137258467329
1256553869083017218
1256553845288841221
1256553823184838662
1256553760769421314
1256553012249743364
1256552915344470016
1256552872113778688
1256552839184289792
1256552558392475648
1256552472602124291
1256552465702490113
1256552348509523969
1256552238660665346
1256552090006163456
1256551961706586112
1256551701072543744
1256551643115597825
1256551528149725184
1256551505932492807
1256551439985508357
1256551323480268800
1256551077807357952
1256550910383316993
1256550864250122240
1256550670267793408
1256550055521239041
1256550051922563072
1256550040082034692
1256549886704726016
1256549818706661377
1256549598685999104
1256549181789032450
1256549051501182978
1256549047604822018
1256549025546993664
1256548642514706432
1256548524885491714
1256548438013075456
1256548427741175808
1256548315702931458
1256548272350662660
1256548022332383232
1256547828383481858
1256547826026323975
1256547822909952000
1256547737476247552
1256547486132559873
1256547413386502144
1256547328363761665
1256547016567599107
1256546983160012800
1256546785431961600
1256546595799207937
1256546486919331841
1256546140016738307
1256546103132073984
1256545674243563526
1256545615611387904
1256545478700924928
1256545429644337152
1256545273607852032
1256545193614024706
1256545080971853830
1256544927061770241
1256544895931727877
1256544872045187072
1256544760745115649
1256544507186864130
1256544468305674240
1256544404170514433
1256544289670205440
1256543671580852224
1256543660772130816
1256543645043511296
1256543562205999105
1256543489854242817
1256543411894726658
1256543012433416193
1256542876072382465
1256542400652218369
1256541945637330947
1256541611644911616
1256541546331230208
1256541534658400256
1256541345432449024
1256541013201608704
1256541001101062144
1256540799791239168
1256540588930932736
1256540472866152448
1256539799369986048
1256539650581245952
1256539311186550785
1256538723854024706
1256538646037004289
1256538090094710784
1256537937182949377
1256537894115778566
1256537842056077313
1256537588334280704
1256537515470848001
1256537478841991169
1256537345081434112
1256537188143108097
1256537094421389313
1256536904071348225
1256536465623912448
1256536173943685120
1256536146923999232
1256535846431395843
1256535714671534081
1256535436199186433
1256535081793081346
1256534879929589760
1256534165023006721
1256533577442963456
1256533533721538560
1256532781284417538
1256532638250270720
1256532591383060485
1256532425393475590
1256532363137482752
1256532287166038017
1256532249475985408
1256532216924028928
1256531675988865024
1256531327127601153
1256531275416055808
1256531127080235008
1256530767863300096
1256530514913169408
1256530474350116864
1256530263234039809
1256529936048951296
1256529909264125953
1256529886967140353
1256529286657445890
1256529282194714625
1256529216033689600
1256529077659451393
1256529013146869760
1256528892275245056
1256528693989605378
1256528539895160832
1256528030454996992
1256528029855121408
1256527915799531520
1256527838670393347
1256527815945736193
1256527472000143360
1256527118101602305
1256527105145409536
1256526528386654208
1256526393883623430
1256526328465162240
1256526259263324160
1256526065788497920
1256525985413029889
1256525929435856897
1256525719368278016
1256524804334645249
1256524304696643585
1256524285776142337
1256523260621176832
1256523109789728769
1256522547937579010
1256522038262616066
1256521754484359168
1256521653141594112
1256521432651177984
1256521247472652288
1256521070204669952
1256520566359625728
1256520513112944641
1256520465763483649
1256520454145277952
1256520299211894784
1256520158891343873
1256520052070912001
1256519207094759425
1256519178179219456
1256519102987935745
1256518940219641856
1256518821919195137
1256518820786851842
1256518697918894081
1256518596244758529
1256518353214214144
1256518149392011267
1256518037446033409
1256517839109926912
1256517826581585920
1256517807224864768
1256517090741272581
1256516863359545344
1256516390808412162
1256516272294068225
1256516146133643264
1256516131470401536
1256516024641470464
1256515915203710976
1256515870999838721
1256515657119739904
1256515514530172928
1256515489867747329
1256515381876883458
1256515312960385024
1256515187047358464
1256515159486537728
1256515100837642240
1256515043925143552
1256514842212655104
1256514786675904514
1256514692664700928
1256514365060153345
1256514318293663746
1256513931952230400
1256513815409242112
1256513740167577603
1256513333370503169
1256513327628521473
1256513052943552512
1256513034987732992
1256512908177137665
1256512749112262657
1256512739650031616
1256512536276537345
1256512434409521154
1256512434044645377
1256512337282023424
1256512334874492928
1256511890978672640
1256511335669665795
1256511239473283073
1256510908400009216
1256510787235074048
1256510737461239808
1256510720759549952
1256510707421634560
1256510413052743685
1256510136266493953
1256510120697135109
1256510060823543808
1256509517346607105
1256509517287866368
1256509403697688576
1256509349679202304
1256509305479708678
1256509080102985728
1256509039850242054
1256508965128671232
1256508881393651713
1256508474361614338
1256508227530997760
1256508212477669376
1256507878858469376
1256507615238029314
1256507482869989376
1256507299465777152
1256506758715056128
1256506681367900160
1256506517903290368
1256506335270666241
1256506193557835779
1256505823393710086
1256505756033187840
1256505721388072960
1256505720104574977
1256505718670127104
1256505628446556161
1256504955592232961
1256503957272199169
1256503924028252160
1256503584570695680
1256503187227500544
1256503157699608576
1256503068394471425
1256502436753178625
1256502318880546816
1256502239402876929
1256501381755797504
1256501216886038530
1256500632296587265
1256500580375289856
1256500557214146563
1256500537450790918
1256500426779832320
1256500393288269825
1256499899287379968
1256499806622691328
1256499765853982721
1256499588468551680
1256499318518931457
1256498998506065920
1256498656653512704
1256498493805539328
1256497521507082240
1256497367932481536
1256497067683459072
1256496899806367744
1256496379372941312
1256496219125354496
1256495954838065152
1256495865092546566
1256495751817039872
1256495063733096448
1256494646525603846
1256494145180319746
1256493883380424704
1256492093758943232
1256491963945299969
1256491743895224320
1256491697216851968
1256491678988410880
1256491606561210369
1256490964283252736
1256490648762486784
1256490434081239040
1256490101946961920
1256489470511198210
1256489274096193536
1256489036329476097
1256488482060537857
1256488367799308288
1256488350741037056
1256488225058717698
1256487888038043650
1256487615156625408
1256487351662137344
1256487242132045824
1256486640165494786
1256486630187307009
1256486542266322944
1256486284505296897
1256486248513974272
1256485957701980160
1256485950680707075
1256485425381859329
1256485404171255814
1256485193701089281
1256485065137303552
1256485032723648515
1256484575959642112
1256484238976856067
1256484125437018112
1256483775426506753
1256483711631179776
1256483353836036097
1256483219182161921
1256483096511369227
1256482589247971329
1256482413825441794
1256481410203951104
1256481332735205378
1256481229907660801
1256481103227084800
1256481019512999936
1256480834305097734
1256480672316903424
1256480454645030912
1256480328081977344
1256480279595712513
1256480027652304897
1256479898358755333
1256479366466490368
1256479097661853697
1256479012442066947
1256478739946442754
1256478456411574275
1256477874963480576
1256477385685438465
1256477372100026368
1256477051877548032
1256474933263249408
1256474828837728257
1256474172567490560
1256473974164393984
1256473861975093250
1256473192375504898
1256472989446672390
1256472801470566400
1256472628325384192
1256471584287739904
1256471409787895808
1256470798686175232
1256469786135089152
1256469620183236608
1256469481372688386
1256469319678144513
1256469240321884161
1256468729610686464
1256468725798014976
1256468722241269760
1256468549251596289
1256468106387640322
1256467521198325761
1256467308618407938
1256467167127769090
1256466915058503681
1256466692689080320
1256465982496931840
1256464570392219649
1256461610085949441
1256460983381512198
1256460244072439809
1256459402829332480
1256459182301237248
1256459117604024322
1256458446771191808
1256458284820762625
1256457902891520000
1256456949715144704
1256456141640314880
1256456139333529602
1256456064242982918
1256456024225132547
1256455747338190848
1256453274498187265
1256453169250471937
1256453144776716290
1256453133544361985
1256452500405846016
1256451803610329089
1256449143091933191
1256448806947864578
1256448179635093506
1256447947266457602
1256445876165398528
1256444187626442752
1256444184703074305
1256443567066636288
1256443052018860033
1256443050051633152
1256442808275066880
1256442693900697605
1256441730561380353
1256441518262493185
1256441043056091144
1256440760859312128
1256439405809528832
1256438815725629441
1256438762197979137
1256436672608317441
1256436618279489536
1256435752600244224
1256434598915047424
1256433893923831808
1256431407267799040
1256431347930931202
1256427578849660928
1256427293209174017
1256426495624523780
1256423292556251139
1256422980219031553
1256421510127980544
1256421200621944832
1256418542431453189
1256416392145973248
1256415674223800325
1256409103909425155
1256409078282121216
1256407927709188096
1256407643192791040
1256407317026951170
1256407023794769921
1256406047545348104
1256403652299960320
1256402807252451335
1256402459162968064
1256402159169449985
1256402013786603527
1256401539482243073
1256401026212605954
1256399474173317127
1256399239485296640
1256398811607547912
1256398761342844930
1256398642925223936
1256397901879787525
1256397812662784001
1256397729745551360
1256397350815367170
1256396692489977864
1256396346820628486
1256395995363057664
1256395483943141378
1256395406839296000
1256395308176728064
1256394838980919303
1256393993140781057
1256393882423767041
1256392858292170752
1256392854114615297
1256392611671216129
1256392286189076492
1256391632972324864
1256391421277462530
1256391308895191040
1256391182499930112
1256391105156956162
1256390454301454337
1256388074017361926
1256387745016090631
1256387062569340928
1256386689595031553
1256385681330327553
1256385679430320129
1256384615796916224
1256383438078251010
1256383383225188353
1256383267365949440
1256383221463494657
1256383210986049536
1256383193244106754
1256382778213634048
1256382677546123265
1256381805285998592
1256381239969361920
1256379259993677824
1256378879062814721
1256377943355514880
1256376936756056065
1256376667725008896
1256375482108407808
1256374817307197444
1256373931235250178
1256373865175015424