1265432467852324865
1265431555587158016
1265431116573523979
1265428604298702853
1265427899001253888
1265427587318284290
1265425652439756801
1265425431903244288
1265425333479788551
1265425068810809345
1265424830037463041
1265424410023989249
1265424167148584960
1265423081344024576
1265423049828061185
1265422899860713472
1265421970046410752
1265421841100763136
1265421449206038528
1265420529575636993
1265418278215786496
1265417922073280512
1265417735607128070
1265417524088365056
1265416694014631941
1265416512665538563
1265416364765982721
1265412225927458817
1265412088953962498
1265411388832395269
1265411137895571459
1265411026440409089
1265409341466783761
1265408768050958342
1265408125814767617
1265407825611829249
1265407783471583238
1265407037741162497
1265406286180618241
1265406238344404994
1265405646230429698
1265405552231878657
1265405482908487682
1265405136307879936
1265404497746067461
1265403903086125056
1265403677206085639
1265403175185645569
1265402735685521408
1265402638193090560
1265402388157997063
1265402243945312256
1265401876406812675
1265401597049307136
1265401488479830019
1265401345428905984
1265400038248927232
1265399921152331778
1265399918308491267
1265399587520602113
1265399156518125569
1265398874631479298
1265398470766145538
1265398342336557056
1265398166175834114
1265397887887912962
1265397203654389761
1265396725444993033
1265396599846551552
1265396417322979332
1265396356161703936
1265396246568751107
1265395802681286659
1265395685630914560
1265395470593130499
1265395310618083328
1265395294516072450
1265395270680039436
1265394958988705794
1265394454627856384
1265394045699993600
1265393888598073345
1265393732301606914
1265393633458618370
1265393591003820033
1265392918258475013
1265392842991689728
1265392737802760193
1265392541706399744
1265392059831267330
1265391978340126722
1265391822664339459
1265391780406722560
1265391447387312129
1265391354101862400
1265391005198581761
1265390960671961094
1265390563148300294
1265390011731640320
1265389882911965196
1265389404404813824
1265389183234904064
1265388543968411649
1265388406223384587
1265388352850874369
1265388306063294471
1265388198865383424
1265388154766462980
1265388053738201089
1265388000801951748
1265387284788129800
1265387046811680773
1265387038041419777
1265386799305818112
1265386268126576640
1265386085179437056
1265385908980920326
1265385892849557504
1265385805876518912
1265385767066632194
1265385610539401221
1265385567119867912
1265385555812126726
1265385398160838656
1265385108086931458
1265384511119994886
1265384506548240390
1265384112912830464
1265384069334011912
1265383978862809089
1265383910789320714
1265383908889288707
1265383701006991363
1265383687224471552
1265383361721307136
1265383322135511044
1265382892806471682
1265382798480769026
1265382774896316417
1265382553009127429
1265382440853483521
1265382261987426305
1265382188163436545
1265382157696086016
1265381921409978375
1265381824907411456
1265381721605881858
1265381661832884224
1265381539455610880
1265381427593560064
1265381196734902282
1265380759231225857
1265380625567145986
1265380600208392194
1265380591580647426
1265380499914178563
1265380385111920640
1265380249505878016
1265380215636852736
1265380095969107977
1265379700286857216
1265379557328199682
1265379353153744897
1265379212782862336
1265379203454767114
1265379083942334466
1265378977063075841
1265378692630491136
1265378688763408387
1265378433032499207
1265378382646259719
1265378302006628355
1265378057109594113
1265377858085687298
1265377827148398596
1265377701025796096
1265377636932558856
1265377587293048832
1265377531961782274
1265377505399226368
1265377457227608064
1265377309051232257
1265377139978833920
1265377038552174593
1265376853730168840
1265376772255875072
1265376724570836995
1265376618358374401
1265376428616531969
1265376379497058306
1265376376221286402
1265375836636667904
1265375724581650439
1265375412873564160
1265375203783303168
1265374953270063106
1265374819916414989
1265374747862478850
1265374632028356608
1265374545374052359
1265374430907314176
1265374307674394625
1265374184768765953
1265374015729872897
1265373808321597442
1265373748728868874
1265373673684381701
1265373555044290562
1265373487042113536
1265373400412938249
1265373261438824449
1265373063958364161
1265372942587899904
1265372802540023811
1265372790452113412
1265372623711670272
1265372345516032000
1265372336502554628
1265372227886813185
1265372149495275522
1265371345216589831
1265371073341784069
1265371026675904513
1265371016060076044
1265370740968259589
1265370696210923520
1265370439813120002
1265370404773912578
1265370381893935104
1265370274276524032
1265370099575382021
1265370014477103104
1265369629129691150
1265369508010737665
1265368832157368321
1265368812255350784
1265368669128929282
1265368447992631298
1265368297219985409
1265368041413660677
1265367954973130752
1265367414579044355
1265367401773912065
1265367303585173507
1265367044821790724
1265366980565127168
1265366942782820352
1265366894292471810
1265366880736489473
1265366823853326339
1265366795373948930
1265366685395161089
1265366560950157313
1265366427986530304
1265366361666138112
1265366311980404736
1265366257928482816
1265366180044386305
1265366176546328588
1265366080337457152
1265365958333468673
1265365843564728322
1265365803509207040
1265365695161909248
1265365616044711936
1265365566338076672
1265365496888791040
1265365416014159873
1265365395881500674
1265365363249815553
1265365354961874945
1265365171301683207
1265365043627151362
1265364998546694146
1265364975532609537
1265364838026534913
1265364767180558337
1265364542395232256
1265364415135825920
1265364390246780929
1265364380696358913
1265364348073127939
1265364055499452416
1265363805502128128
1265363751370403843
1265363614212526082
1265363422809657352
1265363303582380033
1265363280853426180
1265363198552743937
1265363159218601984
1265363079056904192
1265363030029807617
1265362935217520640
1265362848936603651
1265362832570408961
1265362285960278018
1265361890168975375
1265361804626141184
1265361770270601217
1265361635318865922
1265361426358697989
1265361389540999170
1265361384709271554
1265360768922456064
1265360765189599239
1265360270542675971
1265359866710896641
1265359793163833344
1265359360634519554
1265359318049853440
1265359203201409029
1265358999899209735
1265358993364574210
1265358709057871874
1265358365217230850
1265358046152155137
1265358042327060481
1265357323746398220
1265357090844930049
1265357082313854977
1265356966232293376
1265356936784097280
1265356795738013697
1265356759562096642
1265356664837943296
1265356642247376901
1265356492472975364
1265356371194793985
1265356249647984640
1265356155951427585
1265355802266738689
1265355692099219457
1265355542450573313
1265355509353394176
1265355412112650240
1265355408165818371
1265355404948779010
1265355204825939971
1265354889007374343
1265354849119584257
1265354491022409730
1265353985810214914
1265353681609936897
1265353502026600460
1265353333604323335
1265353031673171970
1265352701505921024
1265352374018887681
1265351292689551360
1265351165866315777
1265350971988770818
1265350819840393220
1265350810310979592
1265350331938017289
1265349991465275393
1265349873987129345
1265349659846946818
1265349447380275206
1265349195092889608
1265349045255581698
1265348928255508483
1265348928247140360
1265348616178282496
1265348404378570753
1265347962613436422
1265347926362112000
1265347922524241920
1265347227641425920
1265347122053906434
1265346984438792193
1265346617818972161
1265346267527462912
1265345633638133762
1265345425244147714
1265345329270083584
1265345267810869250
1265345129541513216
1265345121803022345
1265344958548054020
1265344929938780161
1265344771570139137
1265344636962377728
1265344442229231617
1265344420804726785
1265343853671919617
1265343702257422336
1265343623215841281
1265343543641505792
1265343513505521672
1265343484321554440
1265343478944477184
1265343350724603904
1265343165118189572
1265343159745331208
1265343145698627585
1265343107886956545
1265342911593529355
1265342850868359170
1265342652138106882
1265342533963481095
1265342526023774213
1265342455441952769
1265342050586841089
1265341994659872768
1265341941664944131
1265341839533658118
1265341674189963268
1265341251378917376
1265341102741225475
1265341090355458048
1265341061565743111
1265340848574803973
1265340318645399556
1265340206204551168
1265340095940485121
1265340001518268420
1265339898804011015
1265339603424350219
1265339439481589760
1265339267099897857
1265339183725453319
1265338910756016129
1265338862945153024
1265338856964005889
1265338830749667328
1265338693700771840
1265338652714061824
1265338585856774144
1265338566823084033
1265338420337029122
1265338327252811779
1265338272110305282
1265338248961851398
1265338222646829061
1265338137120780290
1265338013095264257
1265337932040359936
1265337843326562310
1265337758400352258
1265337692994383873
1265337654251569160
1265337573230235649
1265337526191087617
1265337495329349633
1265337449682698240
1265337250507882500
1265337080760197121
1265337014897033216
1265336626743595008
1265336525904056320
1265336223121444864
1265336031395667968
1265335879595409410
1265335851397058560
1265335569678307336
1265335314534498304
1265335307127459841
1265335263192059905
1265335203561705474
1265335153494286338
1265335049307729921
1265334883066445827
1265334337274286087
1265334183670448128
1265333655238565888
1265332887257321478
1265332844529881089
1265332769590214656
1265332695355273217
1265331646217302018
1265331636884828160
1265331631708991488
1265331627313356801
1265331623538470912
1265331611471679489
1265331539518291968
1265331372501069824
1265331189549879299
1265330714146484224
1265330531836755968
1265329110399795200
1265328904174174210
1265328872108822533
1265328189338980352
1265328096275771393
1265328003724251329
1265327787986034691
1265327783674290177
1265327495781535754
1265327330337206279
1265327235407532033
1265327210099064833
1265326997611458560
1265326860809965569
1265326702458220547
1265326323582599169
1265325973731454976
1265325781137395713
1265325609057730560
1265325160397144064
1265324902271287296
1265324679167971328
1265324576092848129
1265324475219935233
1265324437987102721
1265323716436791297
1265323711332265985
1265323627614011392
1265323333639385091
1265323313343102977
1265323190034862081
1265323118475780097
1265323005632184320
1265322768645738496
1265322745342111748
1265322642678124544
1265322462994202624
1265322398368370690
1265322355620003850
1265322297780469777
1265322263567622147
1265322184278446083
1265321856787152905
1265321848570593283
1265321845219262465
1265321824407171073
1265321587148042240
1265321523293966336
1265321080878764033
1265321029615980544
1265320670151487489
1265320568326414336
1265320552836857862
1265320535115935744
1265320489620250625
1265320467289780237
1265320357956857858
1265320109758914567
1265319841843511296
1265319628659621893
1265319533910384646
1265319473223020544
1265319288015126529
1265318897403772928
1265318870325354496
1265318628217491457
1265318383026868224
1265318116214611972
1265318063861387264
1265318049881772033
1265317954570289152
1265317938246103045
1265317853621821440
1265317641775972355
1265317596821442561
1265317408513888259
1265317124643397632
1265316857466191872
1265316771747311622
1265316677467746304
1265316624581656577
1265315895737376768
1265315540656103424
1265315389258555393
1265314990183133185
1265314947472523273
1265314803461107713
1265314685085200384
1265314633608581120
1265314600951730177
1265314516612657154
1265314311041355778
1265314231806820361
1265314162114207747
1265314016584437762
1265313952797523971
1265313893209038855
1265313872736550913
1265313519030992896
1265313421412708354
1265313215828897792
1265312822587805696
1265312670779088896
1265312526084050946
1265312497092812800
1265312078442758146
1265311895936020480
1265310957682724864
1265310517108801537
1265309985837330438
1265309681683226626
1265309137577140225
1265308876607574017
1265308379314114560
1265308045636243456
1265305886110646272
1265305697694220291
1265305639439536130
1265305607009075201
1265305579247017987
1265304529714675712
1265304502401458176
1265303376524447744
1265303242000551940
1265303079555076096
1265303018939060232
1265303005877895170
1265302955311464448
1265302851594616832
1265302816173756417
1265302474220601344
1265302059869503491
1265301473509900288
1265301332724011009
1265301250838536194
1265301227711139840
1265300975566360576
1265300862404042754
1265300828933492738
1265300790828204034
1265300777226117120
1265300512636887041
1265300370336645121
1265300312233050112
1265300238669156352
1265300156997566475
1265300105579675651
1265300002005491712
1265299743321862151
1265299601873162240
1265299587289550848
1265299474131431425
1265299145818071042
1265299144748433410
1265299125270188032
1265299019879899136
1265298893425840128
1265298653557649408
1265298508908806149
1265298393552891904
1265298173356097536
1265298141185785856
1265298068745977868
1265297913686753282
1265297581799768067
1265297531703111680
1265297497066475529
1265297397464383488
1265297183894634496
1265296372548411392
1265296010483503104
1265295859236966400
1265295846746316800
1265295799463919617
1265295574384984065
1265295565149126656
1265295326396600320
1265295229822828544
1265295043679735814
1265294573217120260
1265294421903527937
1265294245713371136
1265294077718904833
1265293937658527744
1265293916003274753
1265293879613456391
1265293750361825280
1265293583650820098
1265293145128009735
1265293134268960770
1265292885563449350
1265292637411688448
1265292557959004161
1265292407140220930
1265292325808472064
1265292315607937024
1265292102868652034
1265291474733862913
1265291273935749122
1265290708975484928
1265290404309676032
1265290131587694594
1265289380970758145
1265289219469082626
1265288866799521795
1265288797023068161
1265288693004328969
1265288639107514368
1265288329307750400
1265288222973837313
1265288019428487170
1265287875635163136
1265287813936951296
1265287798950690818
1265287793871327238
1265287384201117696
1265287356116021248
1265287173248552964
1265286858679947265
1265286687267184640
1265286481070956544
1265286363072602113
1265286308399849474
1265286237478322176
1265285991788695552
1265285936927199233
1265285717225361415
1265285484709896194
1265285442074816514
1265285298277232640
1265285224734359552
1265285194539503616
1265285083587645440
1265285045755023361
1265284868965109760
1265284623862509568
1265284616694497286
1265284498348019712
1265284327849558017
1265283967122657281
1265283415055761409
1265282968681144323
1265282865824182273
1265282789131325440
1265282499242004481
1265282086019227651
1265282060106817536
1265281866418065411
1265281847388405761
1265281733425053697
1265281418768285697
1265281220277088256
1265280905238720512
1265280682076573696
1265280677118742530
1265280614531547137
1265280534789357570
1265280342145085441
1265279743542386688
1265278926789603328
1265278836163309568
1265278735936184322
1265278733537034242
1265278460013899779
1265278182535491584
1265278058040184833
1265278008761282561
1265277980445532160
1265277835427500032
1265277585270861824
1265277113449381894
1265276739321769985
1265276330653790208
1265276196562046977
1265276149338304513
1265276056422023168
1265276035039260673
1265275847709097984
1265275750275579905
1265275388273426433
1265275279783546883
1265275239652560896
1265275217196113920
1265275018398715910
1265274894494961670
1265274356252336130
1265274290267545607
1265274208227078144
1265274046347788289
1265273880106524683
1265273732907405312
1265273416971583489
1265273264282058753
1265273052763435008
1265272889428729858
1265272831140478977
1265272794826358784
1265272545831530496
1265272436951584769
1265272033002258432
1265272030334681089
1265271980250378241
1265270563326451712
1265270553692143616
1265270437459775489
1265270249437515776
1265269932788527106
1265269880309329927
1265269801192218624
1265269687941816323
1265269190040092673
1265268953888305152
1265268908761796609
1265268681661169664
1265268662505738251
1265268240609132548
1265268203242094594
1265268186234204165
1265267971154415621
1265267919681970177
1265267754887716865
1265267379346563072
1265267222349520896
1265267156364726272
1265267049481338880
1265266943772278785
1265266808006807554
1265266798238318593
1265266788390129666
1265266328874745859
1265265650655735808
1265264825501978624
1265264623491694592
1265264588439924736
1265264362471804928
1265264362094235650
1265264083563134976
1265263979787628547
1265263867179012104
1265263686639370240
1265263374071410690
1265263290726469633
1265263201404325888
1265263168974196737
1265263067694272512
1265263003789864960
1265262971418222594
1265262718124199938
1265262581113110528
1265262123023810562
1265261690406518785
1265261302336929792
1265261200973139969
1265261170446999552
1265260897213308930
1265260718074535936
1265260310530793478
1265259612023988229
1265259516444147713
1265259208133554176
1265259111177793537
1265258394719588358
1265258292923768832
1265257998697578498
1265257829792919553
1265257394055118848
1265257391135887365
1265257226366865408
1265257153880829952
1265257023811223554
1265256944530608130
1265256789525835776
1265256520977190912
1265256139576487936
1265255980943761416
1265255912018673665
1265255882172051457
1265255453937872897
1265254230329380864
1265253760630226945
1265253564303147009
1265253395293540353
1265253107124101120
1265253053793476610
1265252457787121666
1265252345463607299
1265252328468348935
1265252054076964875
1265251851433377794
1265251594150559747
1265250531599167489
1265250006409383937
1265249769670291459
1265249623511306241
1265249483870416897
1265249291913871360
1265249213060956164
1265248837440090113
1265248823984750594
1265248530547052550
1265248331959336960
1265248319682629633
1265248264728776705
1265248177097244672
1265248044418764802
1265248011053121537
1265247894455672832
1265247817016246272
1265247812863877127
1265247753770336258
1265247742143672323
1265247588623712260
1265247497884176387
1265247381894901760
1265247210708533251
1265246924992581634
1265246133867118593
1265246071724412928
1265245782556450816
1265245708547952640
1265245609214251009
1265245443707088896
1265245331081572352
1265245146620350464
1265244825550491649
1265244439162892288
1265244326063456256
1265244192885952513
1265244158052257792
1265244148833177603
1265243901713158146
1265243835795476480
1265243310370807813
1265243275948064773
1265242930090070016
1265242818890600449
1265242603542515712
1265242478015385601
1265241225411649538
1265241101629259779
1265240885538754560
1265240619238244354
1265240589647450112
1265240367789637632
1265240290841034753
1265240116584423425
1265240100650340359
1265240018454491137
1265239935646339072
1265239797364375553
1265239545819410433
1265239472985247744
1265239165932916736
1265239053215174656
1265238817230991367
1265238135673245698
1265237708101881862
1265237666972471297
1265237451007832065
1265237270308761605
1265236967379386370
1265236744267538436
1265236247964012544
1265236117693087745
1265236035576967169
1265235664221634561
1265235493706481665
1265235353839026182
1265235144824229889
1265234542492823553
1265234541800759298
1265234531306659840
1265234160219754498
1265234113314897921
1265234067823435778
1265234014748635136
1265233746220978177
1265233471913578496
1265233387939340288
1265233354087161856
1265233189624299520
1265233139061972992
1265232594163183616
1265232273051463682
1265232262376968192
1265231736897765378
1265231412103438339
1265231348861714432
1265231327688904705
1265231207022944262
1265231031667392515
1265230943209603075
1265230903535640577
1265230771599663104
1265230719116328967
1265230613268832256
1265230376374603778
1265230338797604865
1265230337161887745
1265230335702257664
1265230332694949888
1265230066331639808
1265229665079263232
1265228985639854080
1265228966585122818
1265228861366820865
1265228851975774208
1265228823328550913
1265228804613603331
1265228646719074304
1265228411267698688
1265228096824913920
1265228004223000579
1265227912996884481
1265227745644199942
1265227534523867136
1265227424876371971
1265227332303949824
1265227326071209984
1265227258639323137
1265226963335229440
1265226943622000640
1265226921044062208
1265226518697050114
1265226413386465280
1265226366179586049
1265226116844978176
1265226001128337409
1265225716947353604
1265225438240165890
1265225420003323905
1265225366790115328
1265225258790944770
1265225169955667968
1265225077441863680
1265224146121904133
1265223793137651713
1265223413142114309
1265222853139599360
1265222426687930368
1265222401815543809
1265222398099554305
1265222336397086720
1265222099683196928
1265221942669434882
1265221913120514049
1265221794778296322
1265221729070256128
1265221505446825984
1265221278505545731
1265220789650980864
1265220642036563973
1265220588941033473
1265220138577657857
1265219804190949376
1265219538200788992
1265219519754182658
1265219456038514689
1265219363755511808
1265219164161159168
1265219134834393088
1265218511086944258
1265218359500685312
1265218292924534785
1265218017983692800
1265217842275909637
1265217668786851840
1265217606102941698
1265217537706508288
1265217459784683520
1265217375529398272
1265217372786311169
1265217134319280129
1265217067206291457
1265216702234669057
1265216340111097856
1265216175262359552
1265216129468903424
1265215958509117440
1265215911486787585
1265215810760515585
1265215787897360384
1265215648751390723
1265215579234893825
1265215512063152130
1265215111100325889
1265214819046756352
1265214603098808320
1265214413545537536
1265214164852715520
1265213904151629824
1265213839248949254
1265213795036774401
1265213745384640512
1265213583266381824
1265213516010721281
1265213506758086658
1265213430723723265
1265213319067185152
1265213190532628481
1265213105283399680
1265212692865912833
1265212641817104385
1265212085140623360
1265211844567937024
1265211606138527744
1265211604108480515
1265210311000408064
1265210255576891393
1265209884548702209
1265209761106145281
1265209529396011008
1265209419417169920
1265209372902404096
1265209114604552192
1265208962569383936
1265208778514927622
1265208708885340161
1265208560683646976
1265208469973499904
1265208413421744134
1265208373684944896
1265208336741478402
1265208222874570753
1265208211348602887
1265207844921585664
1265207744098942976
1265207716294930433
1265207611756089344
1265207085178015745
1265206946493333504
1265206753567932416
1265206677839638531
1265206565843488769
1265206167489347589
1265206068025724928
1265205845585006593
1265205785308606465
1265205755101229056
1265205494546944002
1265204747751088128
1265204655447040000
1265204274923003906
1265204058358517761
1265204005011107841
1265203519004565506
1265203426817970176
1265203281095057408
1265203280050675712
1265202917470081032
1265202785718599681
1265202625856897025
1265202352782540805
1265202279960936448
1265201894735130624
1265201432778735618
1265201312674742272
1265201216893657089
1265201068268552192
1265201051314974720
1265200856376512512
1265200095659798529
1265199883612418050
1265199882639249409
1265199881196470272
1265199380266717189
1265199280098357248
1265199056143474690
1265198829567082497
1265198825184071683
1265198230607998976
1265197867448369152
1265197581367476224
1265197067603005441
1265196709770137600
1265196442488131585
1265196093949857793
1265195804094062592
1265195384659480578
1265194942827319296
1265194827626446848
1265194826959593473
1265193957216190466
1265193941911179265
1265193879160131585
1265193598804508673
1265193278279790593
1265193040752369666
1265192480447889411
1265192241901056000
1265192010400620544
1265191808851730432
1265191645714227203
1265191626462375941
1265191500947824643
1265191472220889088
1265191425555214337
1265191395394027521
1265191362388885506
1265191285482123264
1265191258261204992
1265191068288589824
1265191050899009537
1265190962088771589
1265190877850460161
1265190767473176577
1265190705825267713
1265190666444947456
1265190561629249536
1265190503424954369
1265190435682684928
1265190356796215297
1265190176483131393
1265190170174926849
1265190095952531458
1265190065686425601
1265189798635081728
1265189705768935426
1265189582120931328
1265189450096795651
1265188816719052800
1265188524472614912
1265188379773329408
1265188071106121729
1265187849659449344
1265187728565641222
1265187425938219009
1265187322137624576
1265187103496904704
1265186670145495041
1265186669193383938
1265186471960551424
1265186263709241344
1265186080170655744
1265185971118710785
1265185950730260480
1265185879783505920
1265185773973880833
1265185718965600257
1265185620323942400
1265185556369149953
1265185545845604352
1265185483744821254
1265185378669035520
1265185300919263232
1265185273023025153
1265185116009172992
1265184739285176320
1265184679134736384
1265184495499608065
1265183400387727360
1265183393110769665
1265183119449231360
1265183025417109505
1265182892197625857
1265182744331649024
1265182667051589633
1265182633828462592
1265182568061820928
1265182548197507078
1265182465582383106
1265182227681497090
1265182089508511751
1265181921950289920
1265181886609076224
1265181697034911745
1265181452406272000
1265181331790737413
1265181275402506241
1265181073312493568
1265180559170588672
1265180072568328193
1265180065064783872
1265180041572425728
1265179955882835968
1265179648016736256
1265179575199334400
1265179459780521984
1265179192607551488
1265179181538840577
1265179134478757888
1265179089561845760
1265179032573882369
1265178976860979200
1265178678201376769
1265178677932961792
1265178523532251139
1265178481010376704
1265178467647328257
1265178368045133826
1265178251850321920
1265178166567612416
1265178016679895041
1265177939534061573
1265177756251426816
1265177650601046017
1265177472502566914
1265177469725876229
1265177361328324608
1265177358954266625
1265177300410269701
1265177053952798722
1265176854908080129
1265176852596846592
1265176663966523393
1265175801529597958
1265175799331729409
1265175677801844741
1265175618737639424
1265175555990851584
1265175388428304394
1265175275815436288
1265175143590002692
1265174554495901696
1265174463135584257
1265173864952315904
1265173559967649793
1265172886278541314
1265172799481622528
1265172636407136261
1265172619336118272
1265172388423008256
1265172052627066880
1265171388203257857
1265171321677320192
1265171232170938368
1265170330643038209
1265170251978768384
1265170094029787136
1265170005102125056
1265169762843328512
1265169529321197570
1265169410060439553
1265168953627811841
1265168818801913857
1265168397383467008
1265168358758121473
1265168108995710976
1265167235452219392
1265166626049208321
1265166511397908480
1265166446050639873
1265165869379960832
1265165694922100736
1265165461186019328
1265165209779556352
1265164997367382016
1265164642684252161
1265164603291570176
1265164492821970947
1265164019146436609
1265163742490345472
1265163491427655683
1265162735614033922
1265162511093043201
1265162428922449920
1265162386371051520
1265162385385418754
1265162147425894402
1265161940793516035
1265161123302604800
1265161099449679878
1265161087940464643
1265159871311339522
1265158820210360320
1265158760600829952
1265158687657799680
1265158531851960320
1265158388142542849
1265158091420680195
1265157949099511814
1265157932091445248
1265157752567013387
1265157269022560256
1265156345285804033
1265156077500485632
1265156044562595840
1265155748595740672
1265155705117564930
1265155620950417408
1265155378196762625
1265154629077274624
1265153954318450691
1265153952728797185
1265153063339335686
1265152911627243520
1265152353747046400
1265151847330983936
1265151620347813889
1265151484766957568
1265151331637043200
1265151302625083397
1265150951549214720
1265150835690016768
1265150813686640647
1265150559205699584
1265150557196615680
1265149317809164288
1265148395519381504
1265148200492707841
1265147786162352130
1265147627324178435
1265147564166393858
1265147163060965381
1265146915689242624
1265146642937909249
1265146504190230528
1265146079085035520
1265145641644240896
1265145265822093313
1265143552201367553
1265142295818653706
1265141388620058625
1265139541008146433
1265138524904439808
1265134863516143617
1265134390847381509
1265134355514605568
1265133606814482432
1265132249919479810
1265132184815513601
1265132163541929984
1265132039520628737
1265131606223785985
1265131593330503680
1265131052340670464
1265129870495014912
1265124518282113029
1265123705467949056
1265122888190963712
1265122477061156865
1265121101904035840
1265120834496143361
1265120454806732801
1265119368289157120
1265119284356739072
1265118576752635904
1265118538207027202
1265117852836691969
1265117653527670784
1265117361469825028
1265116455567122434
1265116374025875457
1265115960496795648
1265114942694469632
1265114882241974273
1265114476862476289
1265113577192652800
1265113305150042112
1265112655188103171
1265112531842084865
1265112313427832834
1265111669040205824
1265108265899298816
1265108216452657152
1265107369358430214
1265106642674335744
1265106117883019264
1265105813724704768
1265105536300744704
1265105507632779264
1265105484480229385
1265105170301620230
1265104938893488128
1265104746622390272
1265101434334392321
1265100950697582593
1265100385276121088
1265099500617637890
1265099381864370176
1265097921193705474
1265096883472564225
1265096180486139909
1265095990203351041
1265094360036716545
1265093666336579584
1265093566856073218
1265093180392902662
1265092538056290305
1265092125126991873
1265092041551286273
1265090918958407680
1265090188386107392
1265089499358470145
1265087816704364548
1265087087365304322
1265086668199133184
1265086598061985792
1265086404721344518
1265084625614929920
1265084246189694978
1265081842585255936
1265080824988348418
1265079360995950592
1265075302801252354
1265072584657420289