1224482371770232832
1224481639495061504
1224481208337387520
1224480783668273152
1224480507003645953
1224480505502011393
1224480468172709889
1224480158121328640
1224479813001449472
1224479700610883585
1224479549645344768
1224479088036995072
1224479035427901440
1224478794175651842
1224478677100122112
1224478277999394817
1224477341956608000
1224477131905867779
1224476724383100928
1224475683885371392
1224475399100518401
1224475197773926400
1224475110742069248
1224474988037787648
1224474700274946051
1224474288083828737
1224474025239298049
1224473883996250112
1224473653829603330
1224472155078955010
1224471928129363968
1224471634406453255
1224471280591736832
1224470744735846403
1224470648552087553
1224470191385477120
1224469628526698498
1224469304852340736
1224469186530947072
1224469120353214466
1224468224160432129
1224468005876379650
1224466041176240128
1224465523993464832
1224465322574598145
1224465071012794369
1224465045913923584
1224463812855783425
1224462945100423170
1224462466182238208
1224462424839016449
1224462410205057024
1224461646493556738
1224461468357275650
1224461161652989952
1224461005998247936
1224460788338917382
1224460528594145281
1224460279267893249
1224460164499111936
1224460051294887938
1224459682753937414
1224459356088852480
1224459031382822915
1224458461649559552
1224458415713308673
1224458220091166720
1224458132086116353
1224458061550641152
1224457982013890560
1224457934576541699
1224457835007938560
1224457827055538180
1224457648294322176
1224456984633565184
1224456130190905344
1224455903245520901
1224455688107089921
1224455626085957640
1224455543521021956
1224455049981489154
1224454968523948034
1224454673760808965
1224454596535283712
1224454377219379205
1224454267668287489
1224454058506739715
1224454015703891975
1224453918794473475
1224453584567144448
1224453341775683585
1224453305696284673
1224453124875644929
1224453099281997827
1224452975919124481
1224452640022487047
1224452546858610691
1224452247137873923
1224452239864938496
1224452101826174979
1224452085640384512
1224452065499344899
1224452037749825536
1224452035732373504
1224451845201920002
1224451707339337730
1224451642734440451
1224450992348942338
1224450781257928707
1224450678430396416
1224450561816195072
1224450048060035078
1224449833269751809
1224449806182928388
1224449254770348038
1224448794135187458
1224448710127435777
1224448603973767170
1224448578480791552
1224448439158595585
1224447950497054722
1224447686046171137
1224447585638735872
1224447510023819266
1224447351550443521
1224447248165031937
1224447177746894850
1224447118321967105
1224446944958803975
1224446695053750284
1224446688821071875
1224446567626657793
1224446495253876737
1224446143465046024
1224446108157349889
1224446029283479558
1224445639993413633
1224445610733920259
1224445562138660865
1224445519826546694
1224445327119306757
1224445071421870082
1224444975254949895
1224444740352954378
1224444164105891840
1224443966923231232
1224443840423051264
1224443713948016642
1224443697355317248
1224443469436833792
1224443408309075976
1224443343200874496
1224443267300745219
1224443223726145539
1224443167916744706
1224443129958297603
1224442884717346816
1224442654978535425
1224442617930248192
1224442266351071233
1224442225272053760
1224442171769544709
1224442066551230466
1224442011995893762
1224441904680427521
1224441817925447680
1224441781887979521
1224441232635547650
1224440873926021121
1224440837884366849
1224440664361881601
1224440578126925830
1224440517317951489
1224440364028719105
1224440224622624773
1224440197489643520
1224440193001738254
1224440119605616641
1224439781058179077
1224439773298708480
1224439638309212162
1224439545199902720
1224439504678686721
1224439376291090434
1224438896533966851
1224438891744116738
1224438677671006209
1224438582267396097
1224438484519112705
1224438183921717249
1224438034084425730
1224437944678641669
1224437904690122756
1224437851737079810
1224437813845737472
1224437657612083203
1224437560157425665
1224437468654518279
1224437377872957447
1224437376023314432
1224437210134372353
1224437177183944715
1224437112704913409
1224436909557989377
1224436878155239426
1224436502517571590
1224436462084427777
1224436374750679040
1224436184668987392
1224436112619274241
1224436040703676417
1224435895538872323
1224435612339453953
1224435536338673664
1224435418008961025
1224435177859903488
1224435088252755970
1224434924926554114
1224434873844191233
1224434799474966528
1224434508415397895
1224434231528439808
1224434202059239424
1224434152621010946
1224434090385920000
1224434054247804932
1224433998899712000
1224433688798056449
1224433673266614275
1224433626600730629
1224433518979076096
1224433374258794496
1224433236027138053
1224433140690636800
1224433116451762177
1224432754525237249
1224432705049264128
1224432702079692804
1224432638967967750
1224432221890609152
1224432168400760832
1224431949487329282
1224431842100572160
1224431701872394241
1224431521693495297
1224431441020248067
1224431303015026689
1224431264968478724
1224430514544824325
1224429663503646720
1224429485975535616
1224429450022084608
1224429211550736385
1224428865390546944
1224428629100302342
1224428391497113601
1224428330289631237
1224427880849068033
1224427672165593089
1224427399833583618
1224427132622987264
1224426937289990151
1224426836689596416
1224426830163337216
1224426762156769280
1224426738333163522
1224426728942120960
1224426483831246849
1224426460804534274
1224426458648588290
1224426254843162624
1224426036559040512
1224425701597753344
1224425477143744513
1224425137237262336
1224425100356804608
1224424935180906496
1224424897763516419
1224424798358556680
1224424770810281985
1224424678711791617
1224424501846454272
1224424456753418240
1224424357776318465
1224424265828749312
1224424063944339456
1224423958839222273
1224423809840766976
1224423407145701378
1224422699843440640
1224422385463496705
1224422285190107136
1224422282602459143
1224422138385444864
1224421980260261888
1224421195308847105
1224420930191007744
1224420408906211333
1224420222637150209
1224420120883269637
1224420091909083136
1224419750022909954
1224419730553032704
1224419537300398080
1224419369826115585
1224419260266577920
1224419207007363073
1224419084021981191
1224418959321128962
1224418790445928453
1224418780115283970
1224418742618271750
1224418722665857025
1224418629757870080
1224418611130925059
1224418315575222272
1224417849483124743
1224417846324801539
1224416512309592065
1224416149405949952
1224415738825531394
1224415687554338816
1224415454338396165
1224415275187130368
1224415068521148416
1224415000460242944
1224414812244975617
1224414810697338881
1224414685543510016
1224414624503750656
1224414580237049856
1224414483755556864
1224414399710081024
1224414069479870464
1224414066766237698
1224413861564030978
1224413514586099750
1224413356221702145
1224413322063306757
1224413260675534849
1224413156883206147
1224413105175891968
1224413088990081024
1224413087589195777
1224412938926272514
1224412623862730753
1224412297239678977
1224412196094009351
1224412159230271488
1224411921534930950
1224411831453802496
1224411651828482057
1224411642307497994
1224411453798649857
1224411423461335041
1224410829753331712
1224410528157663239
1224410524764573696
1224410379842990082
1224410171952259072
1224410098610647043
1224409929316032512
1224409361105260544
1224409144763068419
1224409103021363201
1224409021450543105
1224408669376393218
1224408588875071488
1224408501503561733
1224408339431469056
1224406333878870017
1224406195663986689
1224405934367223810
1224405623770619906
1224404878296014848
1224404472404856833
1224403995260866562
1224403903858511873
1224403584256704512
1224403355025444864
1224403123474718722
1224403032663826435
1224403016633278464
1224402939445420032
1224402885083107328
1224402779298582529
1224402391883227136
1224402362275631106
1224402108528676864
1224401926177153030
1224401797550432258
1224401600900407297
1224401482398781442
1224401370876383234
1224401327234732034
1224401124750430208
1224401116189855745
1224401055028367360
1224401050913902594
1224400954147201024
1224400736529895425
1224400358845440000
1224400061540511744
1224399992967892992
1224399781113618435
1224399602671083529
1224399447351799808
1224399399117361153
1224399387620757508
1224399069054894081
1224399027002839040
1224398820831875074
1224398791723376647
1224398617865310209
1224398441545183237
1224398324687654914
1224398263543123968
1224398102746017792
1224397856464830465
1224397800236027908
1224396970871140352
1224396797000536064
1224396482813612032
1224396457769361408
1224396321873956875
1224395649841496065
1224395330311147522
1224395145476550657
1224395124005797889
1224394915196624896
1224394700846698499
1224394693141827584
1224394537805717506
1224394367751933956
1224394145382502400
1224393890171584513
1224393878968721408
1224393754880233472
1224393180864491520
1224393161084153857
1224393062127935489
1224392938303696901
1224392736977162241
1224392091482185729
1224391331075756033
1224391170979237888
1224391101806710785
1224391059536478214
1224390677188038656
1224390524699906055
1224390385679654913
1224390337420058624
1224390311796977666
1224390076391677953
1224389973924773892
1224389687974014976
1224389614766563329
1224389564669796352
1224389216123215878
1224389091875311617
1224388801432367104
1224388467372806154
1224388416978202625
1224388411219488769
1224388384044523520
1224388149641609222
1224388046025646080
1224387949736996865
1224387768140341248
1224387712255451137
1224387354623954954
1224387098268008450
1224386129123794945
1224385611924213761
1224385371724812289
1224385368658796544
1224385341047611392
1224385252212334592
1224385087820779530
1224384487859113989
1224384043841617921
1224382366967353346
1224382176080191488
1224381989035356164
1224381936774328321
1224381245494349824
1224380459624222720
1224380429853175808
1224380252144664579
1224379735368749068
1224379353527660546
1224379343687823360
1224379259654942726
1224379137713897473
1224378969442660352
1224378578323804165
1224378354196975618
1224378232872558592
1224378130468605953
1224378044732923906
1224378038797979648
1224377635230318594
1224377353876463617
1224376886815592448
1224376293602578432
1224376101251833861
1224376012005433344
1224375906237665280
1224375869579452416
1224375779775086598
1224375762226237441
1224375632123088896
1224375573570555904
1224375540603346944
1224375523490586624
1224375240094093312
1224375153636843520
1224375048720482313
1224375029049315330
1224374808378519560
1224374779786014723
1224374759342907393
1224374723800444929
1224374704515035138
1224374411207286784
1224374366949036032
1224374202905636871
1224374009070047232
1224373869429108739
1224373667850792961
1224373650058551297
1224373442880966656
1224373342834188288
1224372921289912321
1224372890428198912
1224372664338407425
1224372585258999808
1224372480418119686
1224372438747754496
1224372353590792192
1224372132173488135
1224372049700884480
1224371903671914497
1224371891437285376
1224371879512805377
1224371510615384066
1224370600325664771
1224370471770169344
1224369300779212801
1224369157094985730
1224368751551963136
1224368618844119040
1224368239431553024
1224367995218206721
1224367870047670272
1224367573095067648
1224367022974349312
1224366699312558080
1224366381413621760
1224366035178049536
1224365926210002946
1224365707028312065
1224365090666926080
1224365063169040384
1224364873171308544
1224364755005165569
1224364506500997124
1224363999736815618
1224363968149557248
1224363894321426435
1224363536173928451
1224363379986444290
1224363172892676096
1224363062515376133
1224362764304637953
1224362476906651648
1224362363605962754
1224362249525002248
1224362237701361664
1224361589681414146
1224361494034276354
1224361443002322945
1224361004353622017
1224360981742194688
1224360588966428672
1224360554908639232
1224360320598257664
1224359680643948545
1224359660230234113
1224359630916268032
1224359552205950977
1224359453497200640
1224359308680486913
1224359276979924994
1224358989221310469
1224358915321757698
1224358492372381697
1224358386139127814
1224358380275470338
1224358234858905606
1224358082156822529
1224357872643067904
1224357800354205697
1224357732779773955
1224357579884769288
1224357445528670208
1224357431540625410
1224357191441879040
1224357175927234561
1224356905952464902
1224356234075217921
1224355903081717760
1224355663964491781
1224355414109773824
1224354623185657857
1224354274332880898
1224354202220158976
1224354100936105985
1224353278915502086
1224353093351100416
1224353039538061313
1224352996164866050
1224352833216139265
1224352794842406912
1224352749501976576
1224352696809017344
1224352611194802176
1224352311310458884
1224352185225490432
1224351992035905536
1224351920581726209
1224351565139652614
1224351381622022144
1224351195445301248
1224350976850698240
1224350807262400513
1224350631051386880
1224350624109801472
1224350505004081152
1224350442009788417
1224350248388255746
1224350179471609856
1224350018708090880
1224349820414021632
1224349768660463616
1224349730437828610
1224349435443978240
1224349255357419520
1224348928394612736
1224348917195845633
1224348604489441281
1224348422028742656
1224346400269524992
1224346341603794945
1224346237652078593
1224346054176493569
1224345995925999618
1224345956755427329
1224345715310301186
1224345476469796864
1224344789346344961
1224344589101928452
1224344410994946049
1224344322298077184
1224343754401832961
1224343528693731328
1224343524365172736
1224343233687359490
1224343225584037889
1224343050991939586
1224342946075553793
1224342292166856714
1224341974188199942
1224341676803665922
1224341333319540737
1224341231649673216
1224340778958381056
1224340736147165185
1224340606064812032
1224340571608797184
1224339874939047938
1224339752079499264
1224339227044913153
1224338643608883202
1224338316868378624
1224338287789330435
1224338178573766657
1224337701350100993
1224337569237938183
1224337435787759617
1224336935403036673
1224336156000735232
1224336132831371266
1224336122282749955
1224336074492780544
1224335595541028870
1224335442000125954
1224335218586288129
1224335196167733248
1224334923508736002
1224334878663155714
1224334727936716801
1224334719027941377
1224334377737428992
1224334232602005507
1224333995590213632
1224333967404470273
1224333612738281473
1224333520824340482
1224333341421395969
1224333192515198976
1224333104371945473
1224333032104120320
1224332724938379264
1224332597490343938
1224332296314138626
1224332102877032448
1224331874283245569
1224331337852768257
1224331211935567872
1224331176938287105
1224331097431072769
1224331044746338304
1224330619070619649
1224330478037217287
1224330330456449024
1224329440890626048
1224328851939119104
1224328621365526530
1224328005792817153
1224327767212294149
1224327530435444736
1224327370712211457
1224327146744811521
1224326870432460800
1224326790044422144
1224326789960478725
1224325432742490113
1224325173765124103
1224324851810390016
1224324827164659712
1224324424951877632
1224324294076968961
1224324262019895296
1224324190263791616
1224324007643766784
1224323831302672386
1224323659545948160
1224323340090978307
1224323252211855360
1224323030626729984
1224322643794571264
1224322054389993472
1224322037491081216
1224321685471494151
1224321220612706314
1224321139968745473
1224320784086261761
1224320584189870082
1224320493525897225
1224320263753469952
1224320000569282560
1224319762785820672
1224319727952068609
1224319213579460608
1224318775614496771
1224318659402878977
1224318584035389441
1224318394566107137
1224318381345603586
1224317441611849728
1224317421621780482
1224317191199305731
1224316809274368003
1224316524611219456
1224316517417918464
1224316405274890240
1224316073341833216
1224315700803768328
1224314978703941633
1224314905991446528
1224314866061713415
1224314593184493568
1224314471910383616
1224314263893938176
1224314225323016195
1224314053604126720
1224313598203322368
1224313251858669568
1224313137580650499
1224312923868291072
1224312827269328896
1224312453749706764
1224312253761183747
1224311398412570625
1224311295538794496
1224310619614126080
1224310607010242561
1224310540425744384
1224310506380546048
1224310258073526273
1224309648465055744
1224309576985731072
1224309206217568257
1224309183404703744
1224308371274326016
1224307840178950147
1224307664911577088
1224306825874542597
1224306027442712597
1224305252368834561
1224305234492739586
1224305184207265794
1224304969282658311
1224304556705751042
1224304315071979520
1224304138822963200
1224303717467541504
1224303569937014784
1224302766069252096
1224302764173545475
1224302756049162246
1224302565455810567
1224302415538683904
1224302132163174400
1224301927904743424
1224301326097625089
1224301134736711680
1224300919493464065
1224300660188905477
1224300550184996864
1224300485303291905
1224300401698230274
1224300276435173376
1224300076102754306
1224299681129345027
1224299212759760897
1224299050406752257
1224299013899464706
1224298789458018304
1224298259239374849
1224298141752745985
1224297712243429377
1224297578801647617
1224297283065458690
1224297044854165505
1224296566904819713
1224296416203411456
1224295869387890689
1224295533973401600
1224295027289001984
1224294485930192897
1224293984060821504
1224293711665823749
1224293402801512448
1224293068708438016
1224292940756987904
1224292818476240896
1224292256057823232
1224292079217577985
1224292064201973762
1224291922057093120
1224291458561323013
1224291400503742464
1224290228078305280
1224289726603186177
1224289554036817920
1224289514148986883
1224289451536461824
1224289305604083713
1224289111839854592
1224289087756087297
1224288843718955011
1224288560414625793
1224288372786696192
1224288351240454144
1224288336388460544
1224288318268948489
1224288257262919681
1224288067835568129
1224286434309394432
1224285256452333568
1224284748568309760
1224284717383651328
1224284587439939586
1224284282757242880
1224284060341633026
1224283926090391552
1224283601140887558
1224283440754954240
1224283004706619393
1224282952428851200
1224282631577243648
1224282290035011584
1224282234754158593
1224281916976848896
1224281357439905792
1224281331741462534
1224280652264214528
1224279501011673088
1224278813934342145
1224278616382541824
1224278414108037121
1224277841854025728
1224277336247427074
1224277248796172293
1224276722197172225
1224276624784461824
1224276409159426050
1224275901770354690
1224275879326552067
1224275660694179840
1224275544444952581
1224274764421828609
1224274567952244739
1224274135523692546
1224273744279035904
1224273696027746304
1224273651966652416
1224273544659509249
1224273518722015232
1224273013413175296
1224272931590680576
1224272897532928005
1224272826166845441
1224272283881103361
1224272227409047552
1224271912701960193
1224271887322185728
1224271611395743745
1224271372752429057
1224271197598363652
1224271045466710016
1224270956388061185
1224270792969588739
1224270483656519680
1224270307407560704
1224270059339702272
1224269856176005120
1224269705202020352
1224269347339763712
1224269336342339585
1224269134969655296
1224268932049244161
1224268208284356609
1224268150201638913
1224268099266007040
1224267706704285700
1224267618376437762
1224266933509533697
1224266780392263680
1224266600108429312
1224265788502216704
1224265723792498688
1224264849410207747
1224264639229440000
1224264437311213568
1224263390014689281
1224263107142410241
1224262881522352129
1224262788228567040
1224262697102999555
1224262534787751936
1224262459017572353
1224260889265786880
1224260598260817920
1224260503951892480
1224259740429168641
1224259704047775744
1224259646556426240
1224259301553922049
1224259282474086400
1224259275155034114
1224259067104956416
1224259028185907201
1224258272292675585
1224258270313009152
1224258209675911170
1224257067634122753
1224256918887321600
1224256107939553280
1224255907594489856
1224255812534767616
1224255616203591682
1224255507487170560
1224255421050912768
1224255332953792514
1224253776044941313
1224253293540581379
1224253108261396480
1224252613400633344
1224252573693153280
1224252423050530818
1224252273745854464
1224252265344782337
1224252112114274306
1224252069189705728
1224251862544764929
1224251847357145088
1224251333777248256
1224251330669293568
1224251133612429312
1224250499723153409
1224250332689195008
1224250143601504256
1224249884523540480
1224249314152763397
1224248619118755840
1224248538143522816
1224248093329313792
1224247721722249217
1224247391915778048
1224247150751748096
1224247012343926784
1224246952717705216
1224246811822579712
1224246705631178752
1224246013185155072
1224245903587991552
1224245325612961793
1224245259317719040
1224244912960479232
1224244777425809408
1224244720177688577
1224244544163794947
1224243849721262080
1224243452000514055
1224243378948395008
1224242829758693376
1224242746862555136
1224242376656523265
1224242071621586944
1224241921452888065
1224241874694787072
1224241765923872768
1224241519240077312
1224241318924255232
1224241213852803073
1224241019295805440
1224240969320738816
1224240729314201600
1224239537464979456
1224239537200803840
1224239376592490498
1224239263040057350
1224239185609052165
1224238839625064448
1224238231119650816
1224238122889830400
1224236746067599361
1224236570330456065
1224236459516932099
1224236332974792704
1224236038119444480
1224235503064625152
1224235280837890048
1224234667076919296
1224234624060207104
1224234555214827523
1224234193938538496
1224232478631702528
1224232030017347584
1224230726641635329
1224230600783147011
1224230595607306240
1224230518516068353
1224230471493726210
1224230356028739584
1224230161610149888
1224230136221966336
1224230038930894849
1224229907976290305
1224229405121220608
1224228715854532609
1224228666789462016
1224228386622656512
1224228383510474752
1224228238026821633
1224227765077053446
1224227538282651648
1224226482928656384
1224226295673913345
1224225970707714055
1224225544834818048
1224225164747067393
1224224738681159680
1224224352562044928
1224224338204856320
1224224332131467264
1224224122881953799
1224223747714035712
1224223721059164161
1224223289071017984
1224222957444136960
1224222699842670592
1224222502932697088
1224222373609603073
1224222329837957120
1224221765989281793
1224221586984751104
1224221517527027713
1224221494986846208
1224221251868200960
1224221183119413248
1224221176374943744
1224221152526118914
1224221074759606272
1224220988130451456
1224220809704722433
1224220309491982336
1224219400036868096
1224218789849583616
1224218581077983232
1224218401930981377
1224218175870468097
1224217962204352512
1224217901898633217
1224217489581727744
1224217223335567362
1224217170877521920
1224216793071439872
1224216366259089408
1224216271513903105
1224216175845863424
1224216021785071616
1224215780042125312
1224215756411482113
1224215540132130817
1224214868716392449
1224214632249921536
1224214438749839362
1224213656998752256
1224213241691344896
1224213011633786881
1224212682003361793
1224212561438048256
1224212539095101440
1224212503082696705
1224212270898712583
1224212219912687617
1224212168389922817
1224212004325470208
1224211741535559680
1224211397132914688
1224210871993470977
1224210797351571457
1224210106612703233
1224209828387655685
1224209599731027968
1224209480382066689
1224208788711989248
1224208472109211649
1224208358141497344
1224207869274460160
1224207774457958401
1224207607440793600
1224207011690074113
1224206400936710144
1224206131301478401
1224206079715958788
1224206009251614720
1224205038001836032
1224201810610655232
1224200265689182208
1224198230092734470
1224197905042550784
1224197083890094084
1224193572636897281
1224193308693598208
1224191366198124545
1224189802171576323
1224188532714946560
1224187152466108417
1224187024191651843
1224184057875062785
1224183867600445440
1224183322655543296
1224180867725025280
1224180839698837504
1224180616125657089
1224179079194316801
1224178785307758594
1224178310743314433
1224178237816877058
1224177635263205377
1224177470720610304
1224172926678851584
1224171712360730624
1224170827987505152
1224170390227968001
1224170232740306944
1224169929836023810
1224169309901086721
1224168041786892288
1224167391334146049
1224166356028923904
1224164501559369728
1224164264824406017
1224163679249272832
1224163208518344704
1224162735723884547
1224162446249725954
1224162123233755137
1224161909974487041
1224161428589961217
1224161100255694848
1224160587887804416
1224159759412219904
1224159651555614727
1224159514385174528
1224159467954229250
1224159444893863936
1224159305559134214
1224158833767043077
1224158181649195009
1224155181513936896
1224154758350540800
1224154509917724674
1224154355827445761
1224154277028995072
1224154110976516097
1224153678212403200
1224152952975380485
1224152816735997957
1224152336282443776
1224151769716084736
1224151500248797185
1224150300300279808
1224150288602468354
1224149997333237763
1224149532323254272
1224148560935104513
1224148435965792256
1224147876915417088
1224147748359933952
1224147551923863552
1224147267134902273
1224146885138690049
1224146205246181376
1224145740072718339
1224145721693294592
1224145697836097538
1224145616378515458
1224145066501066756
1224145063858647040
1224144970887704576
1224144702754168832
1224144527025430528
1224143933275549697
1224143930335383552
1224143576461905920
1224143419829837826
1224143296437592070
1224143125662371843
1224143087913656320
1224143081701871622
1224142696928944132
1224142620621975553
1224142548857430016
1224142543593639936
1224142330476875781
1224142061030584322
1224141877798109184
1224141570380828672
1224141489678307328
1224141299865047040
1224141151936155648
1224141048437493761
1224141039797141504
1224140833689153536
1224140692135600134
1224140327419891713
1224140066366349313
1224139973932277761
1224139720780865541
1224139404387680262
1224139231313977345
1224138896923156480
1224138875112689664
1224138645663309829
1224138602617167872
1224138349222514689
1224138139700203520
1224138020904939520
1224137544763412485
1224136923188539392
1224136862383722497
1224136656325947394
1224136641788416005
1224136286954496005
1224135759051083776
1224135312949096450
1224135214382899200
1224134540190527488
1224133561290297345
1224133452737454083
1224133168745369600
1224132846740287491
1224132563180060674
1224131940925759489
1224131806703779842
1224131554378731521
1224131551765639170
1224131542873792512
1224131451429564417
1224131431015817217
1224131137469067265
1224131071517786112
1224130844132069378
1224130512744263680
1224130282703458304
1224130056789876736
1224130023139028999
1224129724206764032
1224128785601236992
1224128597343993856
1224128182036713473
1224127746701393920
1224127563431383040
1224126548313354241
1224126438216998912
1224126282490957824
1224126191344463878
1224126153948114945
1224125887236464640
1224125748455276545
1224125583891759104
1224124865617199105
1224124679503450112
1224124510938464271
1224124353241141253
1224124115923144705
1224123950713786370
1224123927938699266
1224123557564895232
1224123175858049025
1224123171298779139
1224122828888453120
1224121900210716672
1224120929715916801
1224120878608322560
1224120748865921024
1224120328810639360
1224120314948354054