1253111146460196866
1253109818371473417
1253109452099727361
1253108436096745475
1253107960865271815
1253105086466871298
1253103525313359873
1253102665640411143
1253102484870045697
1253101839802908673
1253101593509212161
1253100550738059264
1253099175920775172
1253098383524483075
1253098250866962432
1253097342535979012
1253097097156591617
1253096913974558721
1253096803328811011
1253096495802454021
1253096011976884224
1253095708418355202
1253095301797294080
1253094824204554248
1253093928817041408
1253093488981393408
1253092921018122245
1253092474291134467
1253092404057509893
1253092044102422534
1253091594414313472
1253091303090421760
1253090576171483136
1253090127125123078
1253089866851762176
1253089717505208320
1253088473637990401
1253088323129815048
1253088004962430976
1253087887568101376
1253087576866553868
1253087368036433923
1253087339779424256
1253087251397062657
1253086664223850498
1253086502910918658
1253086424280285189
1253086132268675077
1253086020251398147
1253085019695910913
1253084900896505858
1253084765504372737
1253084083560820737
1253083842199654401
1253083821957885952
1253083336194613248
1253083088231583747
1253082074103402497
1253081887331037186
1253081546501881857
1253081342880944129
1253080927644856322
1253080790029807617
1253080742491455488
1253080451356516354
1253080167372685313
1253079940175663106
1253079790657179649
1253079603339460609
1253079599124287488
1253079482694598656
1253079118448603142
1253079054795898880
1253078926999633925
1253078818849542145
1253078335120388096
1253078323787431936
1253078302778109954
1253078180837183489
1253078025895399424
1253077703365922817
1253077651037831170
1253077193787392004
1253077132894486535
1253076908155248641
1253076844393439234
1253076643880620033
1253076553552089091
1253076368281219072
1253076348748341249
1253076335066583041
1253075866504105985
1253075679823921152
1253075379310538754
1253075056311369730
1253074916754313218
1253074698151362560
1253074660989841409
1253074168670638080
1253073237040418817
1253073123110531073
1253072987047288834
1253072939643285507
1253072585237188615
1253072350142226434
1253072338893094912
1253072305997131776
1253072219661615107
1253072208303456260
1253072135645540352
1253072017311633408
1253072015667445760
1253071783370129412
1253071487428374534
1253071241390497792
1253071185241350145
1253070942458306560
1253070826758443014
1253070786551779328
1253070570973024257
1253070214268424192
1253070133599313923
1253070098333601793
1253070081367715840
1253069924521717770
1253069776030556160
1253069601933529094
1253069488213372929
1253069466595987456
1253069435025448961
1253069162177536002
1253068530179858432
1253067995724886018
1253067964473016321
1253067911998124032
1253067856679440384
1253067814367367170
1253067735518584835
1253067474855178241
1253067228871905285
1253067022340161536
1253066884431458307
1253066775819927554
1253066745763508224
1253066679736840205
1253066589307617283
1253066568646311936
1253066564221300737
1253066558982590464
1253066491475496961
1253066085865271297
1253065653130534917
1253065029835993089
1253065000421404673
1253064942862901249
1253064168879636483
1253064165159325698
1253064127423090690
1253064015405858816
1253063653567365121
1253063569312231425
1253063488345444352
1253063181255270401
1253063119758340097
1253062793110138881
1253062408781860870
1253062097665228802
1253062091453411329
1253061699483176960
1253061687290351617
1253061651215065091
1253061222141964288
1253061136473358336
1253060713234432005
1253060550709456896
1253060420673458177
1253060336523108352
1253060204532510720
1253059953608331264
1253059793562017792
1253059671402954753
1253059566423748610
1253059243416195073
1253058946048327688
1253058944261656578
1253058828343672833
1253058680548921346
1253058263647690755
1253057943035088896
1253057695172775941
1253057677653168128
1253057485432373248
1253057324857667585
1253056964373905409
1253056923315974147
1253056826838593536
1253056740267945985
1253056739164876805
1253056737604546560
1253056467868975105
1253056456133410822
1253056425728892936
1253056411677929475
1253056329821966336
1253056163819720704
1253056040574300160
1253056022840827907
1253055934898810884
1253055863239127040
1253055722646011904
1253055720909615104
1253055715775787009
1253055713561268224
1253055710692347904
1253055540927791109
1253055385017221122
1253055104388718592
1253054794060742656
1253054744723181570
1253054718756126720
1253054614540292099
1253054431425376256
1253054425096245254
1253054306435108864
1253054133189427206
1253054092815015938
1253053976565735425
1253053747015581701
1253053675569897472
1253053566283104257
1253053478697566208
1253053473052069888
1253053402680082434
1253052907345391616
1253052701824425985
1253052562095341568
1253052384328253442
1253052353634283524
1253052234516107268
1253051850204557318
1253051833091633153
1253051800434991105
1253051527494844417
1253051006776115216
1253050540612890626
1253049630369042432
1253049325401317376
1253049038955581444
1253048440851886080
1253048439606136832
1253048438624641025
1253048437458694144
1253048421105258504
1253048038672793601
1253047611491266560
1253047549931462659
1253047410009559040
1253047317416030208
1253047168904105985
1253047054303191041
1253046728074432513
1253046604245929985
1253046498276900865
1253046404576088065
1253046065022095363
1253046061956059142
1253045677099270146
1253045620396433408
1253045434538475520
1253045409343320072
1253045395686592517
1253045289281376256
1253045288027090944
1253045227218178048
1253044611288793091
1253044291242524674
1253044185869029376
1253043956981653506
1253043920482729985
1253043859073961984
1253043411285938181
1253043354268569601
1253043284454367232
1253042322863947777
1253042281889882112
1253042082748522496
1253041917627183104
1253041401048293381
1253041225260818438
1253041018930434050
1253040840957665280
1253040794027667456
1253040790009532418
1253040753212874753
1253040682635341825
1253040561923280900
1253040355689332742
1253040250751983622
1253039960451678214
1253039867900067841
1253039851034873856
1253039538458542081
1253039150690963456
1253039009032519682
1253038963721408514
1253038886395228160
1253038823992426501
1253038801234071554
1253038281333313537
1253038127633088514
1253037951111618563
1253037837521469446
1253037484042342406
1253037292081594369
1253037284779319305
1253037277883912199
1253037245994430464
1253037244656398336
1253036853332189185
1253036695483752450
1253036620443537415
1253035924646232071
1253035821822889985
1253035802780749825
1253035801908314113
1253035742684688384
1253035661353013248
1253035437666578434
1253035304451268608
1253035179310043138
1253034961487224835
1253034870357594112
1253034832634011649
1253034816464916484
1253034621308198912
1253034560029446146
1253034545806540804
1253034385235943426
1253034381540823041
1253034366172831745
1253034250338799617
1253034115689058305
1253034098135912448
1253034056327016455
1253033630722658306
1253033581498245120
1253033517639970817
1253033405064925185
1253033388543483910
1253033028810670083
1253032956182122499
1253032951497011200
1253032513276166146
1253032499892162561
1253032456669630464
1253032455533064192
1253032454304067584
1253032213907755008
1253032101919719432
1253031467078336516
1253031196608598016
1253031131559211008
1253031084754952195
1253030791262736396
1253030776225984512
1253030567009898497
1253030487809044480
1253030301049262080
1253030299686121472
1253030171873021952
1253030103107461121
1253030095373074433
1253029903802531840
1253029787851018242
1253029754153971715
1253029714110881792
1253029701536399361
1253029367153922048
1253028981722550274
1253028876437147651
1253028746048798720
1253028473658060805
1253028059671932929
1253027755094130691
1253027535824306176
1253027490383233024
1253027254063583236
1253026931198627843
1253026815909789696
1253026509993979904
1253026218619867140
1253025857955921922
1253025839027040260
1253025822153170944
1253025351283941380
1253025285588389891
1253025031623528448
1253025004087902213
1253024770100166663
1253024750106017792
1253024569155358720
1253024409083838466
1253024258747441153
1253024211393818626
1253024167261351936
1253023529764716545
1253022862618787842
1253022761305477125
1253022302494572546
1253022287261040643
1253021788445048833
1253021636384575489
1253021089829195777
1253020747087450115
1253020737889280001
1253019955072811010
1253019616366006272
1253019442516287490
1253019415022575618
1253019159287472129
1253019119772991488
1253019109291368448
1253018640624091137
1253018218572193792
1253018192328511489
1253018162834092032
1253017719286398977
1253017391841398784
1253017190980374528
1253017147913232385
1253016909261549574
1253016624338219010
1253016476870569984
1253016402983890946
1253015703269097474
1253015508489768962
1253015439812296704
1253015060382986243
1253014597503598592
1253014595083485185
1253014592571097095
1253014591514132480
1253014335913369600
1253014293668298758
1253014219395653632
1253013895482138627
1253013813915455489
1253013531236106249
1253013023373090816
1253012881391718400
1253012346152333315
1253012201004322826
1253011386294304768
1253011309551136770
1253010971494420490
1253010351299399681
1253009795457658881
1253009620798509058
1253009514108014598
1253009418771476480
1253009276215480322
1253009251162886149
1253009137690173440
1253008992646946819
1253008756931207174
1253008675339411463
1253008424872357889
1253008397051531267
1253008272392630272
1253008048056143877
1253008037708734464
1253008016389136387
1253007922734514176
1253007716492234754
1253007665409789952
1253007660456312832
1253007545565732864
1253007194456576007
1253007187082981376
1253006815949979648
1253006732508499968
1253006582327189504
1253006267184041986
1253006208535089153
1253006150456541186
1253006106554761216
1253005907455365122
1253005905400135683
1253005904082956288
1253005832289234947
1253005702077046790
1253005481146306563
1253005163171848200
1253005044489871361
1253005030426370048
1253004943633547264
1253004607674036227
1253004482138591238
1253004346733756417
1253004302035099648
1253004205931081729
1253004105359990784
1253004065581281280
1253003945561260034
1253003819899895809
1253003802095112194
1253003711414185984
1253003482535206912
1253003052002533378
1253003032134127626
1253002920842362882
1253002530449240064
1253002241725935616
1253002208355983366
1253002104165273602
1253002088453373962
1253002074310283265
1253002044035694601
1253001826070401024
1253001093786861569
1253000454411255808
1253000207626915841
1252999908862373894
1252999172560695311
1252998948664508424
1252998679629357061
1252998641154916360
1252998639968038913
1252998278704177155
1252997514640441350
1252997008144633857
1252996858445783041
1252996601314004993
1252996299949068289
1252996262678474752
1252996226712297472
1252996114401411072
1252995841343623171
1252995839070330880
1252995837678047233
1252995626863939584
1252995541828603911
1252995322529357827
1252995304363876354
1252995168992722946
1252994949555109888
1252994944467378176
1252994552908189697
1252994225219801089
1252994213593186305
1252994099382190080
1252994051504320515
1252993808356253698
1252993797195268101
1252993487194202112
1252993454424154112
1252993366842884097
1252993291890634752
1252993246164385792
1252993021211271168
1252992943478145025
1252992934519209991
1252992916634640387
1252992902025957377
1252992476987654149
1252992327934636032
1252992323614502912
1252992319881482240
1252992302114639873
1252992218794786818
1252992173257170947
1252991808310841345
1252991667336105999
1252991496057319427
1252991462142337024
1252991319775023105
1252991201298591747
1252990616096604161
1252990510706417673
1252990345983528968
1252989841496657922
1252989826003013633
1252989758067945472
1252989684491390978
1252989495949037569
1252989419537063936
1252989088224985096
1252988983652618241
1252988874818826241
1252988716861267975
1252988558144614401
1252988181156450304
1252987962712903680
1252987764003360772
1252987555794083840
1252987523313393664
1252987481907253249
1252987334322270211
1252987273911689225
1252987226994155526
1252987141145141251
1252987074367631363
1252986755642507264
1252986709127692288
1252986651908943874
1252986533545721858
1252986491111976960
1252986329216028675
1252986293287636993
1252986256864219139
1252985932581650435
1252985840239882240
1252985649969463298
1252985172586266625
1252984996685545472
1252984792045555712
1252984756897296387
1252984614739738624
1252984576743542785
1252984439522693125
1252984410565160962
1252984278511648773
1252984208718512129
1252983732279148544
1252983513810382858
1252983365768282113
1252983322189365255
1252982665118179328
1252982443566608386
1252982239283097600
1252981431426482176
1252981327206498305
1252981040588689411
1252980794831843331
1252980354669072385
1252979985125535751
1252979983733030912
1252979982638264322
1252979485215010817
1252979473286340608
1252979125482119170
1252978625034571776
1252978584907665408
1252978089879011328
1252977919951020033
1252977757891502082
1252977723686912000
1252977690405220352
1252977107711463425
1252977092129632256
1252976979730747392
1252976970645868545
1252976793214234625
1252976514238492672
1252976462493253632
1252976341068025858
1252976338928939017
1252975917821054980
1252975781245939716
1252975375237472256
1252975293251358721
1252975149604843520
1252975066448617472
1252974740861526016
1252974493821255684
1252974035664801793
1252973739412684800
1252973424626085888
1252973315947466753
1252973288407683072
1252973003266277376
1252972638726762496
1252972375370579969
1252971994343182337
1252971913053429762
1252971862767919104
1252971336072396800
1252971317822992384
1252971254644080640
1252971018366398464
1252970912208629760
1252970323386957824
1252970246115385345
1252969915880964097
1252969742744326145
1252969691011784705
1252969668777820160
1252969623605202945
1252969542705385472
1252969478314504193
1252969460404715521
1252969426242150400
1252969354649624578
1252968734865731585
1252968705279037441
1252968293075423234
1252968259705614336
1252968231859630081
1252968192022122497
1252968058110521345
1252967881551360001
1252967160097497088
1252967136554778624
1252967125960077312
1252967042585628672
1252966767888084994
1252966732362403840
1252966364920381442
1252965877957476352
1252965858407862272
1252965668284174339
1252965577016201217
1252965334165970944
1252965168956477440
1252965038358437890
1252964836465684480
1252964583549124608
1252964113988423681
1252963913110638592
1252963908459118593
1252963284266999808
1252963099717632001
1252961218203172867
1252960668275400704
1252960318956978176
1252959501642338304
1252959493807386625
1252959369374904320
1252959364652191746
1252959077707243520
1252959052247838721
1252958727797235713
1252958700266033154
1252958484762632192
1252958108185432065
1252957693003825155
1252957677191299073
1252957369732120576
1252957300597428224
1252956981545009154
1252956897772277762
1252956625591205890
1252956574466945026
1252956059544752129
1252955838031048704
1252954180404367361
1252954149278359554
1252954099546492930
1252953751184388098
1252953668711854080
1252953660067373056
1252953409587724288
1252953312711913472
1252953091823022081
1252953028660953088
1252952884418838529
1252952837908246528
1252952767800446977
1252952398487793668
1252952067586625537
1252952032828424194
1252951801726468096
1252951613423132673
1252951456401051651
1252950811941965825
1252950557704273920
1252950551857369088
1252950367559659520
1252950246361108480
1252950063187361792
1252949948766785536
1252949520960413696
1252949387388628992
1252948749346918401
1252948720548790273
1252948612327276544
1252948191995203584
1252948096335609856
1252948083131940864
1252947978215739392
1252947975879475200
1252947676586553344
1252947509720293376
1252947349846007808
1252947331789590528
1252947269806161920
1252946930772119552
1252946751352422400
1252946516479705089
1252946130209583105
1252945947191054336
1252945872632967169
1252945867943936001
1252945845399556096
1252945663647797250
1252945639534743553
1252945472068648962
1252945447200731137
1252945390099410944
1252945158032801793
1252944850196013057
1252944829149073409
1252944760685432832
1252944710014062592
1252944564169703425
1252944474092732419
1252944461610520576
1252944407868907520
1252944389070036994
1252944100803960833
1252943808519639043
1252943730233028608
1252943645319233537
1252943619612385280
1252943574318145536
1252943530089230337
1252943452045803521
1252943266917613568
1252943246558445568
1252943195354337280
1252943091906084865
1252942731938275328
1252942616427204608
1252942615558983683
1252942579815022592
1252942494637137920
1252942470297591809
1252942340269969408
1252941584141824001
1252941464901947392
1252941307133247488
1252941092917575681
1252941015251652608
1252940895734960128
1252940843641720832
1252940780580331520
1252940352216010753
1252939818813849600
1252939672399024129
1252939582808772611
1252939249680355328
1252939224346775552
1252939148006248448
1252938979399340032
1252938844623843329
1252938841687756801
1252938723966230530
1252938472895262722
1252938255806410752
1252938240249810944
1252938033076277248
1252937879111847937
1252937489205116930
1252937288260235264
1252937153857888256
1252936740182114304
1252936294935728129
1252936228426715136
1252936074034393090
1252935911228223489
1252935721121452032
1252935702767157248
1252935605706776577
1252934675200380930
1252934413970784256
1252934404638420993
1252934272119443457
1252934068439842816
1252934050773372928
1252933677279055873
1252933432671449091
1252933236084420608
1252932906802122753
1252932846911717377
1252932690548084736
1252932596868268033
1252932356912173057
1252932214435782658
1252931903302361089
1252930660089692161
1252930634626015232
1252929970437009408
1252929939072000001
1252929402201128963
1252929319053209600
1252929286819938304
1252928646379118592
1252928527785242624
1252928361497796609
1252927970605518849
1252927393347633152
1252927206566879233
1252926431761510400
1252926403965857794
1252926338937294848
1252926004110163968
1252925352093114368
1252924831584174081
1252924775212691456
1252924025594150912
1252923746375131137
1252923738791821313
1252923716557844481
1252923659779538944
1252923234862981120
1252923117170819073
1252922788396052481
1252922705977970691
1252922694909284356
1252922273239052290
1252922005562810368
1252921803321860098
1252921580373585923
1252921464329777152
1252921447959408640
1252921395841032193
1252921131314696192
1252920829152763904
1252920436846997506
1252920435794214912
1252920383340187648
1252920369704587265
1252919994087866368
1252919794707443714
1252919609663029248
1252919515790401536
1252919333082345472
1252919317718499328
1252919298663895041
1252919290522632192
1252919026440900608
1252919007075880960
1252918948565323776
1252918935411929088
1252918815727419392
1252918670067666944
1252918068906463232
1252917955513536512
1252917801389641728
1252917784507551744
1252917580446269440
1252917525731516416
1252917497835257858
1252917481544585217
1252917453241421824
1252917091948249090
1252917036927369217
1252916961761275904
1252916883092897792
1252916844408774659
1252916807020797953
1252916794186240000
1252916773407637506
1252916629631090688
1252916622551113729
1252916537008275456
1252916510718394370
1252916359492710400
1252916310725603328
1252916281612939265
1252916248389783554
1252915995586580480
1252915892847022080
1252915844251824129
1252915735573266432
1252915638349303808
1252915568631582720
1252915357372776448
1252915208126902272
1252915166842441729
1252915078699114496
1252914576917749761
1252914568231374848
1252914528834269184
1252914169663361025
1252914110645272577
1252913970425606145
1252913859603705856
1252913814988783616
1252913753231962112
1252913618762555392
1252913376872759298
1252913264331235328
1252913071682617344
1252912853360824320
1252912805067452423
1252912637693870080
1252912501974597633
1252912211871387648
1252912114173427712
1252912111988232193
1252911966642995202
1252911796681408513
1252911710710661121
1252911579395432449
1252911540828876800
1252911423904243712
1252910917962129408
1252910587622940672
1252910403203543040
1252910402901544960
1252910252997124097
1252910054946242560
1252910049963520000
1252909613462290432
1252909195336323074
1252908897293172736
1252908744033345538
1252908531835158528
1252908264314015745
1252908198002151424
1252908057740353536
1252907845949014016
1252907485285036033
1252907052885827584
1252906990721998848
1252906813663719425
1252906513166893057
1252906220995969025
1252906103593144325
1252906047745990657
1252905757986689024
1252905419724468224
1252905302585946112
1252905274320568320
1252905262031273985
1252904762305118212
1252904610102161408
1252904081343098881
1252903961025302530
1252903603557236736
1252903422732443648
1252903305979801602
1252903099297136640
1252903089125896194
1252902476015194112
1252901875944480768
1252901739797381125
1252901654883680256
1252901304806113281
1252901191723474944
1252901116087500800
1252900679015858176
1252900670383980546
1252900668970610690
1252900667758391304
1252900666319818752
1252900664667254784
1252900663496978432
1252900661588643841
1252900655523643393
1252900625853153281
1252900349280649217
1252900292712169474
1252900287255379969
1252899896417550337
1252899894945333248
1252899733074522112
1252899618918203392
1252899611259387905
1252899595262275584
1252899581442109441
1252899578241708032
1252899547166257152
1252899445789863936
1252899441322975232
1252899370636279810
1252899281427726338
1252899214499119106
1252898965646958593
1252898379581009920
1252898369720156160
1252898248060219392
1252898169538719746
1252898101347614720
1252898031973871618
1252897975384367104
1252897885764456448
1252897833914716160
1252897682932236288
1252897520952446976
1252897326613618688
1252897203422724098
1252897182308536320
1252897047184846850
1252896687967875074
1252896547077083142
1252896454089342977
1252896306625994752
1252896123007705089
1252896109862608898
1252895924940148741
1252895842425593857
1252895821143642113
1252895800629374977
1252895583527931904
1252894962037002241
1252894927551442944
1252894918437154816
1252894901425102849
1252894796773044224
1252894702250217472
1252894627478331395
1252894426369798150
1252894392282685440
1252894309134872576
1252893967131250688
1252893943001493504
1252893905143693312
1252893697714327552
1252893659311325184
1252893641594621952
1252893498271059970
1252893410069004288
1252893303810523137
1252893127444234240
1252892813987102720
1252892758940975104
1252892725088829442
1252892663872970752
1252892467529203712
1252892281629216768
1252892181813223424
1252892044269432833
1252891931719450624
1252891551241469952
1252891463203074049
1252890927351332864
1252890508394999808
1252890182887636992
1252889685371826181
1252889604300120064
1252889474838736896
1252889300561264642
1252889220789809153
1252889144482816002
1252889102892109824
1252889068310061056
1252888691523100673
1252888600435359745
1252888451894181888
1252888433728655360
1252888174143180800
1252888108338642944
1252887975316389888
1252887952675557377
1252887674484076545
1252887277447102465
1252887096085356550
1252886920725749760
1252886724100923393
1252886710859546625
1252886664952844289
1252886492688547840
1252886443871162369
1252886350128390149
1252886274102497280
1252885849223704583
1252885720328548353
1252885001592602624
1252884870407184384
1252884672201326592
1252884585991426049
1252884103629885441
1252883906573066240
1252883725681135616
1252883635763634176
1252883296423460865
1252883256204161025
1252883251963650049
1252883229062754304
1252882951462809601
1252882754418536449
1252882745560309761
1252882733270880258
1252882494170337280
1252882241098625025
1252882194772746240
1252882158890303488
1252881904287637504
1252881715367821313
1252881688880836611
1252881606341058560
1252881498518065158
1252880683774558209
1252880257029300231
1252880201853231104
1252880161705320452
1252880155883659271
1252879991169118208
1252879968272396291
1252879612830380035
1252879389429125121
1252879062743179270
1252878396217946114
1252878326923853824
1252878178722312197
1252878046060638208
1252878025470832643
1252877817135501317
1252877205564125184
1252876858892283905
1252876584316317696
1252876400408662017
1252876326647685121
1252876286499778560
1252876236235223043
1252876226949115907
1252876179607961602
1252875754292928515
1252875389963132929
1252874263343722498
1252873887534026754
1252873832689364997
1252873768847896577
1252873766696185856
1252873190897926146
1252873184212168705
1252873151769309185
1252873043237433349
1252872996441604096
1252872850991484928
1252872795056246785
1252872790329286657
1252872537865777152
1252872490130370562
1252872123892154372
1252872118351523847
1252871821105348611
1252871719649333248
1252871344498200577
1252871126880972803
1252871008157003778
1252870906096963587
1252870682343403520
1252870641054695425
1252870598742556672
1252870142284845062
1252870035653025792
1252870014966722561
1252869858238140421
1252869019301851137
1252868978038304771
1252868722416431105
1252868623846137856
1252868429649817600
1252867866975596544
1252867523818610690
1252867494089351168
1252867327852310528
1252867146108923905
1252866628418592775
1252866463834099713
1252866356673802240
1252866355914698758
1252866005073719296
1252865926594101249
1252865868142239744
1252865855362224136
1252865515493617664
1252865313453903872
1252865181639512065
1252865161938866176
1252865019118645248
1252864528603246593
1252864487897485318
1252864483665440768
1252864271702085633
1252864180215939072
1252863994051743750
1252863845653045248
1252863828418674695
1252863716963450883
1252863617692622850
1252863458955063300
1252863311772696577
1252863176095326209
1252862969748193281
1252862785635024896
1252862430452969472
1252862192988217344
1252861551259738113
1252861402475192320
1252861188666298370
1252860859883220993
1252860738692976643
1252860702525517837
1252860575790456834
1252860280675028997
1252860124227465222
1252859751446179840
1252859702758617088
1252859637029728257
1252859557857996803
1252859223098048514
1252859102725722115
1252858997813637122
1252858812102410240
1252858680984272903
1252858502315270147
1252858174295601158
1252857432788725768
1252857218208165889
1252856825864544258
1252855845454401538
1252855577660678144
1252855359091298305
1252855355454812167
1252855168783151105
1252854421790154754
1252854188662349824
1252853872172789762
1252853834323333120
1252853582786727938
1252853549806940160
1252853469121134594
1252852792982552576
1252852780185710593
1252852679698558976
1252852518612168706
1252852465055088640
1252852453881470978
1252852371610144772
1252852290647547904
1252852227527471104
1252852053421903874
1252849474696671233
1252849065714266154
1252848380880932865
1252848317353979905
1252848097257943042
1252847789312061442
1252847729903976448
1252847602556518400
1252847545534935043
1252846871006965761
1252845659587137536
1252844714186833920
1252844673502113793
1252844624667762689
1252844524268687363
1252844305837780994
1252843480121880578
1252843233203245060
1252843139569598465
1252843013274955787
1252842853341949954
1252842519768883203
1252842350063177731
1252842229057507331
1252842135436447744
1252841804296122375
1252841731164258304
1252841713426558976
1252841587018612738
1252841465002131456
1252840762749759489
1252840336105168896
1252839767152025605
1252839277244776450
1252838908598968324
1252838525172543488
1252837729219407876
1252837453041266688
1252837335844052993
1252837303828926464
1252837276494618625
1252836322948997120
1252836316531703810
1252836038554169353
1252836036985516035
1252835405633777669
1252835063089135618
1252834886257307649
1252834390561878017
1252833355646685185
1252833220866961408
1252832535211433985
1252831194737070081
1252830516119625731
1252830270719328262
1252830269385502720
1252830266919317504
1252830251408781313
1252830239396261896
1252830212137422848
1252830034252804102
1252829951197196295
1252829842183094274
1252829708091183104
1252829629242466306
1252829454641987586
1252829451206811650
1252829364200198152
1252829338929524740
1252828547497906177
1252828407525568519
1252827427908096000
1252827130552922113
1252826731003568130
1252825708864237568
1252825608276439040
1252825344903544832
1252824225531883522
1252824145198329856
1252823995130343424
1252823729983197185
1252823471437930496
1252823018931318784
1252822563731804160
1252822207656366083
1252822101590814723
1252821569891479553
1252820842532073478
1252820430085210118
1252819907948896265
1252819827867017219
1252819442691534848
1252818629726359557
1252818454815469568
1252818408309010437
1252817642634657794
1252817604109987846
1252816507400122370
1252815662713430017
1252815212396244995
1252814967952162816
1252814192995758080
1252813598717472775
1252812573080055814
1252809703563784193
1252809227548061696
1252808999940042752
1252808555675205632
1252808364167270402
1252807095889489924
1252805908813381637
1252804106164383744
1252803701057548288
1252801745597501445
1252800975057809409
1252798006484701190
1252796351424991233
1252794009975697408
1252793333874860032
1252793253604274177
1252793199971766272
1252789676420878336
1252789384430194688
1252789319166824455
1252789144650121217
1252789134302814209
1252788973715546114
1252786818778648576
1252776230736232448
1252770650298646529
1252769374785736705
1252768918562836480
1252765801972748289
1252764073051201538
1252763445205913606
1252763253597405185
1252763055991271424
1252761169305251846
1252760224647299074
1252760101699584001
1252759842542018560
1252759714951237632
1252759174636847104
1252758788106588161
1252758758096322571
1252758455309434880
1252757200189165571
1252756249197924358
1252756115361878018
1252755006920548355
1252754521580765184
1252754313845395456
1252754084097961985
1252753847799463936
1252753663753433089
1252753338061512704
1252753025531359232
1252752968337801217
1252752792294432768
1252752756345122816
1252752397115576320
1252752091963064321
1252752048900145157
1252751926812442626
1252751567394144267
1252751430936678400
1252751057102479360
1252750689773772802
1252750600128913408
1252749667550494726
1252749514781405184
1252749438642159617