1233179958723448835
1233179044851613703
1233178482412261376
1233178385221931010
1233178166744711170
1233177987719290881
1233177744160305153
1233177122702864384
1233177090121510913
1233176585802481665
1233176463794483200
1233175728088375299
1233175197596995590
1233175077157470212
1233174686525263872
1233174198593433601
1233173851837693952
1233172944899256321
1233172704846630915
1233172475208441856
1233171999771394048
1233171810394542082
1233170729992163328
1233170625998606338
1233170459845447683
1233170411615027201
1233170348377505794
1233170078931279877
1233169322345992193
1233169151562309632
1233169048277540866
1233168895302946817
1233167793949990912
1233167768595451904
1233167493528768513
1233167467347927040
1233167340537368576
1233166850357329924
1233166502586732544
1233166499508039680
1233166164475379712
1233165944781930496
1233165235562909698
1233165138271797248
1233164983611133952
1233164811044823044
1233164515702902785
1233164515635793920
1233164355392413697
1233164093416202240
1233163804567048199
1233163464358662146
1233162928515354629
1233162445327405059
1233162377912373253
1233162255530889217
1233161965326958595
1233161780010127362
1233161607603204096
1233161056492687360
1233160911738884097
1233160890335350784
1233160650853056512
1233159842443014145
1233159766341562368
1233159649999847425
1233159282935369728
1233159097543012352
1233158694633902081
1233158511569375237
1233158501008101377
1233158470909792256
1233158016184262658
1233157897863016449
1233157699015147520
1233157474871631872
1233157469414854659
1233157286505467904
1233157228275929088
1233157221476859905
1233156510835970048
1233156159185571845
1233156077224591361
1233156066411778050
1233156005644656641
1233155947624910849
1233155891110658048
1233155480786292736
1233155297868484609
1233154893881450498
1233154753007431680
1233154025190821888
1233153999412584449
1233153532364279809
1233153525661732864
1233153480690368512
1233152921531027458
1233152841298124800
1233152439173382145
1233152159782506499
1233151396687511554
1233151189287567360
1233151082571927560
1233150949029445633
1233150884588261378
1233150722381877249
1233150721484378112
1233150657789669376
1233150601275543553
1233150503028187137
1233150199582863365
1233150140606754816
1233149489529180160
1233149312403738625
1233149215578128386
1233149018873749509
1233149002226569217
1233148987626205184
1233148845288312833
1233148478907387904
1233147851120816130
1233147539408523264
1233147474333794310
1233147472681340928
1233147232779673600
1233146659581956097
1233146561561088001
1233146520528130048
1233146494162784257
1233145901100785666
1233145701330231302
1233145351856697344
1233144613575286784
1233144561033261086
1233144483971321857
1233144375502426114
1233144290106195968
1233144170593898496
1233144072115752960
1233143450884878340
1233143219392827392
1233143166536212485
1233143038089867268
1233142993277849601
1233142948088492050
1233142942640091167
1233142813145149445
1233142499935444993
1233142312810749953
1233142038138408960
1233141923063508995
1233141679953076224
1233141304550469650
1233141201697722368
1233141135133921280
1233140739430920205
1233140626260209683
1233140555363889155
1233140364833435648
1233140349373206528
1233139987971026948
1233139940592177153
1233139580808966152
1233139449078460427
1233139435665076224
1233138925390245900
1233138742795395073
1233138594686099456
1233137926655086592
1233137862696148992
1233137685478486029
1233136914804416513
1233136727847579648
1233136623812071424
1233135909412966401
1233135834142007302
1233135732476325899
1233135731025027072
1233135430956199940
1233135246314483715
1233135240413089793
1233135118367313921
1233134819942576139
1233134755505430528
1233134747276259332
1233134585623597061
1233134481831342095
1233134406820401157
1233134218353553410
1233134147687911425
1233133957002166272
1233133949087625226
1233133267320287243
1233133195975176204
1233133009169195008
1233132951606644738
1233132860636311554
1233132844681224192
1233132698056695808
1233132696181919744
1233132517701619713
1233132408909836318
1233132263073886212
1233132244711157761
1233131190338629632
1233131070477996033
1233130820128432129
1233130806937358336
1233130699932262406
1233130589156454400
1233130462341685249
1233130302333214725
1233130288533983232
1233130270506790914
1233129906785181696
1233129427481042945
1233129301727490058
1233129262498054144
1233129093518053378
1233128974202654723
1233128500837670912
1233127796710526976
1233127608881229829
1233127355847184384
1233127235994968064
1233127096618299394
1233126437114261504
1233126203697004544
1233126061485043720
1233125294120349699
1233125217951780866
1233125190726496257
1233125109663248390
1233125044152414211
1233124770813747206
1233124568186970112
1233124410040705024
1233124036361715712
1233123624099491843
1233123363368972295
1233123259501219841
1233123092945395712
1233122911323594758
1233122342508863488
1233122302654603264
1233122222946029569
1233122162069975043
1233121876039393280
1233121746842267650
1233121599374708741
1233121314371723265
1233121312102588418
1233121094468587521
1233120785914630145
1233120102129774598
1233119943983497218
1233119933556543489
1233119693835264003
1233118756915863552
1233118710027759618
1233118484269293573
1233118313607237634
1233117724018126848
1233116898981818379
1233116844376182788
1233116239716851714
1233116237871316993
1233116204505673728
1233116025308184578
1233115757644521473
1233115542812319745
1233115425086504960
1233115180298534916
1233115099595931648
1233114999960326148
1233114530684821505
1233113918458953729
1233113826419265542
1233113745842483200
1233113702624264192
1233113476798832642
1233112799716478979
1233112718955208705
1233112516315709443
1233112475584909313
1233112282600820737
1233112223486181376
1233112214267191296
1233112206927126536
1233112199075373058
1233112194965016579
1233112192813293568
1233112110940532738
1233112095962664961
1233111980988387328
1233111814025687046
1233111588921597954
1233111034103246849
1233110790867046401
1233110400356536326
1233110395860213762
1233110258974892032
1233109949447888897
1233109893990830082
1233109599676440576
1233109004899012609
1233108947109863424
1233108515415347206
1233108453981335552
1233108253963411458
1233108080184918025
1233107917756403712
1233107795442110465
1233107467669852160
1233107458782048263
1233107112173154304
1233107077645598721
1233106906165776391
1233106843972571136
1233106688212946949
1233106582424162304
1233106477482684418
1233105769228382208
1233105573803065347
1233105150333587457
1233105089121935360
1233105058633519106
1233104850990309379
1233104663790178305
1233104629568876547
1233104233420947468
1233103639478243328
1233103602299920385
1233103535128096768
1233103295188697096
1233102868602814464
1233102384508887047
1233101413481353216
1233100998387826688
1233100435977908227
1233099128663662594
1233098965530398720
1233098394995961859
1233097942803898370
1233097699001610241
1233097643267674116
1233097464179232768
1233097344717131777
1233097090156417025
1233097024297472004
1233096905929961473
1233096891057004544
1233096757917241345
1233096746827423744
1233096744482803720
1233096646428418051
1233096435773603840
1233096422834216963
1233096329183793153
1233096326717607937
1233096164104384514
1233095694950338562
1233095616991023109
1233095460082110464
1233095364426764289
1233095355677528069
1233095351193808896
1233095307203735552
1233095204590235650
1233095005520191490
1233094704973197313
1233094136959524864
1233093986836979712
1233093718330220544
1233093580811575296
1233093290486091776
1233092817226010624
1233092730093547525
1233092551986614272
1233092153439662081
1233091670297792513
1233091462943907846
1233091230659227649
1233091149423927297
1233091110303608833
1233090997279694848
1233090925808640002
1233090788579586048
1233090576221966337
1233090521624666119
1233090258679582722
1233090094447431680
1233089916172742656
1233089892344877056
1233089810321092608
1233089207247216640
1233089148346683393
1233089064615718912
1233088713355399170
1233088517040943104
1233087669091143682
1233087559485530112
1233086998577123329
1233086903009849344
1233086694322298884
1233086269841956875
1233085540473430016
1233085386685112321
1233085380611710976
1233085332213637128
1233085264119173120
1233085237669892099
1233085202081206273
1233085188814647297
1233085160540852224
1233085040231362560
1233084938662088707
1233084834949586950
1233084755094183938
1233084589914181633
1233084347038814208
1233084077907070976
1233084051914940419
1233084039529144322
1233083868464414721
1233083865364926465
1233083798033707008
1233083554051055616
1233083498946269185
1233083483146326018
1233083346487533571
1233083287536570368
1233083152958095363
1233083057160192003
1233082868445929475
1233082851698106368
1233082698853425158
1233082612765294593
1233082402823639042
1233082400441356293
1233082362860359680
1233082264315191297
1233081957950554112
1233081709756850176
1233081580027088897
1233081320433242113
1233081305786703872
1233080689593061378
1233080689228165122
1233080600078307328
1233080554347794433
1233080485900902401
1233080323707146241
1233080166299193344
1233080045763252226
1233080024720388096
1233079914305347589
1233079789357084674
1233079537728196613
1233079487694360576
1233079427640299524
1233079356165103616
1233079356043513857
1233079243552313349
1233079201353392130
1233079036575961089
1233078618051444737
1233078575324110849
1233078362308055040
1233078234125914112
1233077997076439040
1233077804293611523
1233077742511575040
1233077502978990082
1233077299832074241
1233077229799825410
1233077158999986179
1233077133842534401
1233076528461815810
1233076245392502785
1233075876780216326
1233075516326006797
1233075133104971776
1233075101681274882
1233074881945915392
1233074867190325249
1233074858625556482
1233074770763227140
1233074730086825984
1233074524708536327
1233074509621743616
1233074489241591813
1233074366092644354
1233074249050591232
1233073940509188096
1233073917214052352
1233073587059187712
1233073496596586499
1233073036313735168
1233072983951933442
1233072958396129281
1233072758763986944
1233072656926355457
1233072442005954561
1233072316839612416
1233072248287834120
1233072052158050312
1233071715493785601
1233071527878438918
1233071319081721858
1233071262399913985
1233071185140822016
1233071048729464832
1233070989698793472
1233070920648024065
1233070615898120195
1233070413007200259
1233070140482314240
1233069995397132295
1233069965315641347
1233069953366056960
1233069620527013888
1233069588516147200
1233069534749261824
1233069491397046273
1233069417388486658
1233069223662014464
1233069124005384192
1233069065423294464
1233068718529269760
1233068517345366016
1233068275434708992
1233067883833516033
1233067843408797701
1233067817760673792
1233067717676146689
1233067621504909314
1233067608162918402
1233067540835917825
1233067359495163904
1233067346501128192
1233067343410073600
1233067323524866048
1233067242809630722
1233067163084345347
1233067091105853440
1233066984285319168
1233066907089108995
1233066647071621121
1233066636120383488
1233066462279065600
1233066386433495041
1233065790468952064
1233065788048891905
1233065697611264001
1233065613926420481
1233065209264246784
1233065101323833346
1233065021699219456
1233065002350895106
1233064884469981190
1233064875536134145
1233064851032936448
1233064668891054082
1233063823466168320
1233063285102170112
1233062624058802178
1233061670521573378
1233061437318352899
1233061192752652294
1233061181243510786
1233061134699237376
1233060249806032896
1233059800906436610
1233058709326245889
1233058581055930370
1233058513288560646
1233058498520457217
1233058486986190853
1233058479004409862
1233058478601723904
1233058434557325313
1233058382594084864
1233057731126480896
1233057727468965888
1233057683810504706
1233057617012023296
1233057603372167170
1233057572208414726
1233057467023732737
1233057434773737473
1233057356336058370
1233057183581003776
1233057024113565696
1233056668457619456
1233056520566341632
1233056434872602627
1233056265888305157
1233056262281142272
1233056233302695936
1233055810646728704
1233055736206446593
1233055558535655430
1233055397994541062
1233054802990505986
1233054765422129152
1233054598371389446
1233054547209314304
1233054390413557760
1233054284440313856
1233054261245890560
1233053708377821184
1233053563632394241
1233053375106867201
1233053348863107073
1233053071065976832
1233053066972344321
1233052535965077509
1233051859134373892
1233051803031392258
1233051695166390272
1233051557274554368
1233051506020102144
1233051311756709888
1233051146199142404
1233050976518594561
1233050834772123649
1233050791734321152
1233050678286802946
1233050644547883009
1233050601090682881
1233050055076175873
1233049822665506816
1233049776175886338
1233049662019526657
1233049328031293441
1233049250709360640
1233048836677029890
1233048759086522369
1233048366554210310
1233048212140953601
1233048187868499968
1233048113679683585
1233047937791528960
1233047876919529472
1233047821097590786
1233047784770723840
1233047575693070337
1233047340078043136
1233047267080331266
1233047254405206018
1233047191167565826
1233046863328292865
1233046523291873281
1233046405578665984
1233046306387628036
1233046289731981312
1233046267955118086
1233046213710184450
1233045972156022785
1233045887296921602
1233045503748775938
1233045444797829120
1233045444613353473
1233044969000181763
1233044810409398274
1233044611846852613
1233044202453438464
1233044199815208961
1233044174859112448
1233044013013442560
1233043317958610945
1233042954828353536
1233042812536573952
1233042315721179137
1233042284314320897
1233042262982057991
1233041816133435392
1233040665963040768
1233040647881289728
1233040532043182080
1233040406205648899
1233040359791513601
1233039480766058496
1233039215534977029
1233039177991774208
1233039142457683969
1233039133263745025
1233039008575500288
1233038444412227584
1233037915216924674
1233037860535721984
1233037650908545024
1233037622773272576
1233037586643419136
1233037578103853058
1233037402601594880
1233037379235127299
1233036869312618498
1233036733140422661
1233036710747017216
1233036612960911361
1233036592400433152
1233036247356104704
1233035927993364480
1233035897957965826
1233034313068838912
1233034258492592130
1233034046688677890
1233033510400724993
1233033080073531397
1233032803761229824
1233032649645731843
1233032280819617792
1233031638994554880
1233031405753577474
1233031325197701125
1233031248605478912
1233031063296974850
1233030781959839744
1233030596810747910
1233029920529485826
1233029555591483393
1233029531214262273
1233029375899160577
1233029287973937152
1233029227290583040
1233029195418259456
1233028886000173057
1233028587294461953
1233028412471742466
1233028366934183937
1233028272054730753
1233027888267571206
1233027508888621056
1233027352902471680
1233027331104616454
1233027247528955905
1233027099465678848
1233027056386134018
1233026616919494656
1233026323188191234
1233026134796914688
1233025817220960257
1233025648773521408
1233025556544921600
1233025372867977219
1233025169700114433
1233025111906799618
1233025058727243776
1233025028612087809
1233024532799160320
1233024438477737984
1233024039922339842
1233024027251310592
1233023872917737473
1233023367055278082
1233023019712417799
1233022929195192324
1233022909578403840
1233022582045233153
1233022294806626306
1233022291870699520
1233022123221929984
1233022113625387008
1233021696233398273
1233021662158823424
1233021617778888705
1233021322260815873
1233021282423365633
1233021207269736449
1233021094602383365
1233021055377297408
1233021037346009089
1233020885994557440
1233020805707108352
1233020767111204865
1233020744143167488
1233020659363721218
1233020515004100613
1233020512588136449
1233020396523413510
1233020325987782659
1233019866191466496
1233019696435355652
1233019276077957120
1233019215638093825
1233019193097932800
1233019099535626240
1233018377381335041
1233018262104965121
1233017987709448195
1233017880666615811
1233017867525918721
1233017574243340288
1233017491200278528
1233017389958209536
1233017191664095233
1233017104389066754
1233017066229260289
1233016865255018498
1233016499687784456
1233016387041464320
1233016014377451520
1233015945049903106
1233015856214482945
1233015791349403649
1233015688358514689
1233015537669677057
1233015438508011520
1233015315509977088
1233015222987829248
1233015003772542977
1233014926005813249
1233014849812209666
1233014774725660672
1233014344058884097
1233014191889506305
1233014134066819075
1233014044518473729
1233013703643193344
1233013619912253440
1233013608671522816
1233013516115812352
1233013437778841600
1233013163894935553
1233013044747423744
1233013018516185090
1233012947796070400
1233012828027543555
1233012642089971714
1233012371930652677
1233012206603849728
1233012178392879104
1233011908191694849
1233011797680119809
1233011794165338112
1233011693766225920
1233011197357821952
1233011110619553793
1233010950002921473
1233010912136769536
1233010555297943552
1233010285528702981
1233010208840060928
1233010206784749569
1233010144574873606
1233010062882414594
1233009755372871681
1233009592403099649
1233009373842169856
1233009365336150017
1233009158494019584
1233008796898906114
1233008604548075520
1233008457994903553
1233007708774768642
1233007602885431301
1233007490834599936
1233007281341632512
1233007196205613056
1233007161296539648
1233007076043042816
1233006965074169856
1233006783171645441
1233006622378725381
1233006509472305152
1233006507438039040
1233006461657239552
1233006373446787073
1233006371156697089
1233006318069350400
1233006284183625728
1233005577950912512
1233005283309445122
1233005263885651969
1233005082972737536
1233004964823343104
1233004835399774208
1233004671213670400
1233004390375620608
1233004212520390659
1233003961009025025
1233003873201201153
1233003619085168640
1233003618661474306
1233003591868321792
1233003491209162754
1233003433973690368
1233003416487628801
1233003268793610242
1233003136106758144
1233003086718918663
1233003040153767936
1233002935698837504
1233002876131147779
1233002741297025024
1233002727661297664
1233002724918222848
1233002446206722048
1233002333170216960
1233002294209392641
1233002286038896640
1233002167058956292
1233002164093583361
1233001960669884418
1233001772106616833
1233001585120337920
1233001386306129922
1233001361463300098
1233001330039455746
1233001273244430337
1233000978766495744
1233000945585442816
1233000794682789888
1233000742828544002
1233000603296595969
1233000442587701248
1233000236022411265
1233000095207043073
1233000078001999872
1232999934158364673
1232999823806259202
1232999371341430784
1232999285530202119
1232999128310910977
1232998737682870274
1232998691847516166
1232998583168884736
1232998350682640384
1232998298497228801
1232997848104480768
1232997751778140160
1232997251242393600
1232996840301367296
1232996650265612288
1232996633966759938
1232996441997660161
1232996194219184129
1232996181925560320
1232996009212555267
1232995883899326470
1232995426401443841
1232995228556156929
1232995179931541505
1232994977048879105
1232994731317190657
1232993951860371457
1232993896675692547
1232993588302221312
1232993408010113033
1232993355245768704
1232993193358221313
1232993098038378496
1232992880991645696
1232992739689717761
1232992710941958144
1232992229330952192
1232992147839897600
1232991339798761472
1232991069454946314
1232990885551407104
1232990873035661312
1232990840999628802
1232990785857105921
1232990750364721152
1232990631397601280
1232990205633859584
1232990052621471746
1232989981167300608
1232989945939320833
1232989941640069121
1232989936795750400
1232989894278074369
1232989719727951872
1232989577662603270
1232989526731165696
1232989254449496064
1232989230613323778
1232989080369221633
1232988549705846784
1232988211045113858
1232987914654683136
1232987886011719685
1232987825156579328
1232987825139834881
1232987723096612864
1232987652875485184
1232987524563382272
1232987374252064768
1232987187261644800
1232987121419460609
1232986633596817408
1232986631189258244
1232986508254117892
1232986476671045635
1232986068863066112
1232985764587241473
1232985653580791808
1232985642579173378
1232985614754222087
1232985345047662595
1232985248331231232
1232985171844046848
1232985102612910080
1232984925852327936
1232984889009614848
1232984798945255424
1232984686751879170
1232984616732155904
1232984407713206272
1232983795533598720
1232983784963919873
1232983718383570944
1232983632496779264
1232983567728283648
1232983437415505920
1232983120028323843
1232982292487905281
1232982184304218114
1232981969178431488
1232981836193767424
1232981460681883648
1232981009794293760
1232980910481559553
1232980513310285824
1232980408154890240
1232980044210982912
1232979737900978182
1232979560909754368
1232979508912906240
1232979499689664514
1232979268801572864
1232978656621924492
1232978130140352512
1232977935897853952
1232977916310491141
1232977858047479808
1232977662228017153
1232977531759996929
1232977434485645314
1232976901578334211
1232976317118865408
1232976052131160064
1232975982593761280
1232975763676237826
1232975729702375425
1232975310477545475
1232975101064249344
1232974964124459010
1232974804090748929
1232974293539131393
1232974033731407872
1232973946745753600
1232973758333358080
1232973658005688320
1232973265406242817
1232973110586023936
1232972954822156288
1232972833711673348
1232972803873427457
1232972633488216064
1232972609966526465
1232971983735971840
1232971713685659649
1232971682098356229
1232970964679438336
1232970766137864192
1232970191211986946
1232970150909005825
1232969622493827072
1232969557108822016
1232969154770153472
1232968866000785408
1232968830764421120
1232968393956917248
1232967793315909632
1232967445834534912
1232966118584856578
1232964761987506176
1232964665392717824
1232964121777393665
1232964064114040835
1232963419785093121
1232963016574087168
1232962608594026496
1232962546711310336
1232962126215553027
1232962014617776128
1232961985039552512
1232961842382868480
1232961475054047232
1232960746079838215
1232960198941315072
1232959855322894336
1232959839170650112
1232959564288548864
1232959196628385792
1232958612089208832
1232958594536103936
1232958065684684800
1232957909664980993
1232957696107831296
1232957640864608256
1232957500858753024
1232956871377596416
1232956405927358466
1232956203308810240
1232956161009311744
1232955601254260736
1232955199293140992
1232954742466281473
1232954591542677504
1232954483392598016
1232954327230287875
1232953437005975552
1232953085296828416
1232952556155998208
1232952090642845702
1232952062096351233
1232951582393864192
1232951024475922439
1232950890971222016
1232950579451879429
1232950459469647873
1232950236747829248
1232949992693866502
1232949991779512320
1232949881238671360
1232949709268037632
1232949417726140416
1232949100649295873
1232949087860936705
1232948542160986114
1232948464084017152
1232948243937550336
1232947671037546496
1232947428598435840
1232947102394785793
1232947076817997825
1232946923096694785
1232946746029899776
1232946588512931840
1232945868606726144
1232945720854040577
1232945664587374593
1232945659004833793
1232944697389260800
1232944628061687808
1232944192688676864
1232942931419398146
1232942605505302528
1232942428598022149
1232942099303223297
1232941982659567616
1232941744448253952
1232941735669571586
1232941673962860545
1232941145749102592
1232940918837260288
1232940779473195008
1232940641199546374
1232939978637881345
1232939658209845250
1232939454496739329
1232939363920760832
1232939345469984769
1232939257263685632
1232939090833702912
1232938672544256001
1232938459867815936
1232938375272968192
1232938286328446977
1232938090077073409
1232937480875278336
1232936901486809088
1232936571705446406
1232936021370769408
1232935942316576768
1232935382901284864
1232934943749234689
1232934844000325634
1232934703319191552
1232934125960679424
1232933911082291200
1232933852127125504
1232933732450996224
1232933702218534912
1232933286281908226
1232933202521677825
1232933089661374464
1232932601742188544
1232932599749861376
1232932324460752896
1232932121074962432
1232932112124325888
1232932042851135488
1232932000618643457
1232931748989800450
1232931693058822145
1232931375008886784
1232930466367442944
1232930271877566464
1232929923192565760
1232929656476749824
1232929277164871680
1232929215705690112
1232929118334935040
1232928469807456256
1232927889747824640
1232927786567962624
1232927498339524608
1232926911220928515
1232926909245329408
1232926271618850818
1232925891245879297
1232925819988828160
1232925540929146881
1232925500529573888
1232925129849679872
1232925057103650816
1232924745370423297
1232924408450363392
1232923645384806401
1232922707819405312
1232922147468664833
1232922066422243328
1232921465231749125
1232921217713278976
1232921008195198982
1232919921656508419
1232919553581240320
1232919521675161600
1232919430646173698
1232919159647895552
1232919133429387264
1232919042085859328
1232918969771798528
1232918913173934080
1232918899936649216
1232918543630508032
1232918321265364992
1232917568563875841
1232917352909541376
1232917282067820544
1232917048772190208
1232916939284058115
1232916355856392193
1232914870770847745
1232914254069686272
1232912495574179840
1232912475030458368
1232912427584540672
1232912314095013889
1232910974740463616
1232910109350801408
1232909911283191814
1232909613974069249
1232909245269413888
1232909163484893184
1232909004952801280
1232908420770140162
1232908237869109249
1232907795596488706
1232907751526932480
1232907263460986880
1232906892747431937
1232905513354039296
1232905255605743616
1232904405738852358
1232904006256779264
1232903873888649216
1232903778267025409
1232903519507755008
1232903405552619520
1232903107069214720
1232903073816772609
1232903056859246593
1232902173639487488
1232902017594597376
1232901626748375040
1232900966128783360
1232900827959963649
1232899550337216512
1232899207423561728
1232899040150421504
1232898913641824256
1232897616486260736
1232896228339470336
1232895443627102209
1232895089799782400
1232894982396284928
1232894350075596801
1232894265790996480
1232894048886759424
1232893938912169984
1232893332025724928
1232892956400590849
1232892925266268160
1232891634137722880
1232891013225762816
1232890533976199173
1232890283605528577
1232889516886806528
1232886901998333953
1232886846524477445
1232884564735004672
1232883480897388545
1232882141773647875
1232881555925880834
1232879460808118272
1232878624547778560
1232877069975117824
1232872623513722881
1232871967969161217
1232867017641910273
1232864060636565504
1232862780438519809
1232861977208381440
1232861208493072384
1232858497114681346
1232855194075004931
1232854277812559874
1232853883250237440
1232853358995791874
1232852771881267200
1232851859162923008
1232842399715667969
1232839830536642561
1232836756204064768
1232835591047458816
1232833714352246784
1232831546333286402
1232827834370068480
1232825635728433152
1232824518131027973
1232823547313127424
1232820199457460230
1232820151847989250
1232818181426810882
1232817840681603073