1236078573099921419
1236077015255658496
1236076609930657793
1236075802237775872
1236075789503926273
1236074886898081793
1236074729594695680
1236074306645393414
1236074070439010305
1236073528719523840
1236073506003136513
1236072950773755906
1236072517695086593
1236072473415868416
1236072268079521793
1236072175897059328
1236072037870755840
1236071977967857665
1236071305855803393
1236069564649213953
1236069405433487367
1236069398047268865
1236068685632155648
1236067407019507713
1236067257370972160
1236067033802067969
1236066241875451907
1236065949347975168
1236065827713175553
1236065318419795968
1236064140944384000
1236063801306472452
1236063605742854145
1236063177315684358
1236063145904529408
1236061346728497153
1236060428633071617
1236060152857538560
1236060151947370496
1236060071400026115
1236059449145659393
1236059235533942789
1236059188918353921
1236058700089040898
1236058527715782658
1236057723105615872
1236057618285826048
1236057533703483392
1236057315079581700
1236057291474063362
1236057037202743296
1236057006248726534
1236055663316525062
1236055517925117955
1236055386026803200
1236055330561421312
1236055156497805312
1236054998791974912
1236054950075133952
1236053954041188354
1236053849707810816
1236053753641517057
1236053571336056834
1236053194804998144
1236053083077120005
1236052736954773504
1236052594554015746
1236052565261012992
1236052245336199169
1236052107826016257
1236051854301241344
1236051750282387456
1236051174773731336
1236050754798055424
1236050711852564481
1236049532477206530
1236049476399386624
1236049262150115333
1236048795097538561
1236048382877200389
1236048248713949185
1236047912645378049
1236047814813265921
1236047747280777218
1236047399602343941
1236046573823352832
1236046282327719937
1236046158222503937
1236046076785963008
1236045787504807943
1236045739882680321
1236045725198360577
1236045378853756929
1236045334477930497
1236045293679980546
1236045121877168130
1236045110049230849
1236044992482865153
1236044445889556487
1236044385327943682
1236044337131253760
1236044213025980418
1236043458332291072
1236042554937954304
1236042229933735936
1236042181833564160
1236042055434080256
1236041477442199561
1236041146050260992
1236041062143201280
1236040950260150272
1236040705518252033
1236040572139433984
1236040560693129223
1236040250205536265
1236040192114507777
1236039168574337024
1236039123619786753
1236039039540699139
1236038673067577344
1236038298746974211
1236037794423808000
1236037402466160642
1236037177877938177
1236036858754347010
1236036686972440576
1236036675748474881
1236036556953182210
1236036502733369351
1236036406738370564
1236036179650322435
1236035958639915019
1236035278898442242
1236035266072240129
1236035261118795776
1236035063533486080
1236034872805912579
1236034831567466501
1236034637719363586
1236034515157561344
1236034427907715073
1236034230259519493
1236033941808779264
1236033919558041600
1236033774070218752
1236033531840573440
1236033324893822979
1236032635434082308
1236032613225291777
1236032511551078402
1236032435055362048
1236032241345667077
1236032219996712961
1236032090287857668
1236032078669647873
1236031995504996359
1236031718974459905
1236031681217409024
1236031601944989700
1236031555363057664
1236031290501144576
1236031155985625088
1236031152428851202
1236030998741225473
1236030785137840128
1236030547899621376
1236030207234015241
1236030109246730241
1236030027860504577
1236030008428281857
1236029799338053632
1236029600364474369
1236029536732659712
1236029412908453888
1236029299553112065
1236029251943624704
1236029166685949952
1236029088713912320
1236029006258098176
1236028912678965249
1236028806168788997
1236028779715342336
1236028742235049990
1236028687751012352
1236028659019984898
1236028549284458497
1236028522226839552
1236028490132205568
1236028471152869379
1236028442157764612
1236028208069435394
1236028167795732480
1236028028981035008
1236027981006594048
1236027785992384512
1236027625581219841
1236027009064751104
1236026938482966531
1236026801903845376
1236026762758361089
1236026665916141568
1236026440874893312
1236026421581053953
1236026024657371136
1236025882969399297
1236025700416737280
1236025407717208064
1236025311164272641
1236025202481512448
1236025031936835589
1236025026995982336
1236024765644750855
1236024660661321733
1236024621654257669
1236024431480356869
1236024412555657218
1236024341583687681
1236024249485230081
1236024222893461505
1236024015967248384
1236023901723004930
1236023682985799686
1236023666082791431
1236023663717203968
1236022628915310592
1236022524795895809
1236022481233866753
1236022417853747200
1236022174294724614
1236022168888029184
1236021718810087425
1236021701886042113
1236021573116715008
1236021364491988994
1236021353628790784
1236021344556511232
1236021100905193472
1236021023704743936
1236020763322441729
1236020587933454336
1236020504689094656
1236020484413808640
1236020303031136257
1236020282084806656
1236020201642221569
1236019972805136386
1236019912440795136
1236019837610180608
1236019763601715201
1236019692583731205
1236019613684477952
1236019503441547265
1236019455475494912
1236019374374481921
1236019150214098947
1236018739176407041
1236018717361913856
1236018702962876418
1236018325588766722
1236018120562741249
1236017743448674304
1236017640243675136
1236017490808930304
1236017472114954241
1236017267974041601
1236017210117615617
1236017132133023750
1236017010443616256
1236016986490122248
1236016937479659522
1236016857347493889
1236016784697962496
1236016682512060418
1236016655479816193
1236016562366267396
1236016505625722880
1236016240700854273
1236016093053046785
1236016036320813057
1236015715964108806
1236015688101347331
1236015566726541313
1236015503665225731
1236015348010430467
1236015298316296192
1236015150567653376
1236015105889972224
1236015051032666113
1236014755468455936
1236014608403640320
1236014492871536640
1236014480259256320
1236014457886773249
1236014381953101824
1236014128562614273
1236013880565878784
1236013878796042240
1236013586889261059
1236013377706692609
1236013225277378565
1236013162115276800
1236013001163108353
1236012914315800576
1236012864105836544
1236012818698326016
1236012739572699142
1236012684866457601
1236012460907393028
1236012408075948033
1236012399569842177
1236012223497220098
1236012041305051136
1236011853333114883
1236011777244176384
1236011771695153154
1236011724735762433
1236011531206307843
1236011447454400514
1236011441100124160
1236011408397123584
1236011406014717955
1236011333927292933
1236011118247792641
1236011044734210048
1236011003940306951
1236010349956141056
1236010061102821377
1236009894244950018
1236009855648964608
1236009755572948996
1236009695854366721
1236009539188731905
1236009534113615872
1236009472180588546
1236009312696352771
1236009299555516426
1236009139949776904
1236009058454421504
1236009025382334464
1236008713716215815
1236008696456646657
1236008581922775040
1236008511026401286
1236008194557841409
1236008182524362753
1236007925509996548
1236007821180899328
1236007518213672960
1236007296926453760
1236007193608101888
1236007176671498240
1236007065165930500
1236006921674665985
1236006860978884608
1236006831211925512
1236006580157640706
1236006244709740545
1236006244319727616
1236005742651596800
1236005286080638977
1236005278878965760
1236004864695681031
1236004793447059458
1236004784190222338
1236004702619406336
1236004636106141700
1236004615109455873
1236004460498952195
1236003976719593473
1236003752190136323
1236003539547312137
1236003248068231169
1236003236156497921
1236002915166359553
1236002709825822721
1236002608055271426
1236002567227924480
1236002424843878400
1236002030780583942
1236001924731809799
1236001743017857025
1236001737879760896
1236001679486660609
1236001472485175298
1236001411277524992
1236001357779349504
1236000869138788353
1236000675827458048
1236000490133037057
1236000274529083392
1236000161756741632
1236000128802197504
1236000078004998147
1236000071977758720
1235999843279163393
1235999831392505856
1235999249051115520
1235998743029309440
1235998713916649472
1235998605145780230
1235998572308574208
1235998450778595330
1235998196704456712
1235998189662150659
1235998115695661057
1235997989988192257
1235997957587165184
1235997743245676546
1235997633270996992
1235997450659344385
1235997303305056257
1235997291053559809
1235997244593188864
1235997191401025544
1235997134870188033
1235996977701236741
1235996942196445185
1235996831609430019
1235996770343231488
1235996630714810369
1235996605934899203
1235996596531335172
1235996510376153096
1235996471893295104
1235996370844213249
1235996363202138115
1235996006157778949
1235995892496429057
1235995772941983744
1235995629454848001
1235995626271313922
1235995271051579394
1235995257046736896
1235994942956359680
1235994735053074432
1235994458983817217
1235993710518775810
1235993613294804993
1235993593422262272
1235993120610955264
1235992726925119490
1235992719811661825
1235992275567685634
1235992164582281218
1235991862332264454
1235991808045441028
1235991493409746944
1235991455866523648
1235991309657214977
1235991019105239041
1235990945579126784
1235990818504273927
1235990785222467590
1235990767614791686
1235990630939140096
1235990600371105792
1235990538618363904
1235990458704302080
1235990436424151040
1235990392065142785
1235990018382082051
1235989986211753989
1235989692493049857
1235989505389342721
1235989503996817408
1235989388980613120
1235989359205191683
1235989189075841024
1235988855444078594
1235988486903209984
1235987978486517760
1235987978419400716
1235987876950822914
1235987637024051200
1235987622893240321
1235987039604166659
1235986752038461441
1235986592558460928
1235986242023632898
1235985411727601664
1235985221713096704
1235984943857233920
1235984448874844160
1235984031092805644
1235983470062702593
1235983455797874688
1235983348327231491
1235983246770438144
1235983075202469889
1235983032009580544
1235982988216872960
1235982702408540160
1235982522074509313
1235982328285089793
1235981594013446146
1235981456343736320
1235981300001058816
1235981223828258827
1235981123185934341
1235980936505942016
1235980869648736257
1235980597190955009
1235979593108131842
1235979447339229191
1235979340594241536
1235979119134941186
1235979001216319488
1235978871515893760
1235978447173955585
1235978096932802560
1235977368398946305
1235977132309966848
1235976030634024960
1235976015211622400
1235975570577657860
1235975531516112896
1235975466890268680
1235975343821017089
1235975204221988865
1235975179601432577
1235975016321347584
1235974951359963137
1235974902332764160
1235974735953047553
1235974728881487873
1235974579266387968
1235974177552764928
1235974154911969286
1235973844810244097
1235973805669040129
1235973453477482497
1235973272484950016
1235973137264775169
1235972992418619397
1235972713350561792
1235972667515207681
1235972554982150144
1235972166195253248
1235972008682426373
1235971881024606208
1235971706080067592
1235971651180933126
1235971521702658048
1235971475804491776
1235971377993261057
1235971212830027776
1235971038384701441
1235971018771943425
1235970791256346625
1235970642031316992
1235970473214857218
1235970382181666818
1235969866655383553
1235969321224024064
1235969288240009216
1235968205874769921
1235967999494025217
1235967967386574852
1235967831457574913
1235967646719455232
1235967556365824002
1235967346960928769
1235967164475203584
1235966761180295173
1235966563729190913
1235966267045134336
1235966224452005889
1235966204528951296
1235966126884089856
1235965682468126720
1235965490482339840
1235965486363533312
1235965228615118848
1235965200593031170
1235965083953647618
1235964808161357826
1235964803304300546
1235964624350167041
1235964419483619329
1235964350550114307
1235964240550342656
1235964229192159232
1235964166470594562
1235964085747007488
1235964028112994304
1235963981552025602
1235963936610103301
1235963922429235200
1235963820239093760
1235963491581861888
1235963370051964930
1235963368885956609
1235963300099371009
1235962848666361857
1235962780941012995
1235962096858300416
1235961584939405312
1235961458313359361
1235961341975973888
1235961150245752832
1235961014883176448
1235960807843868674
1235960777959501830
1235960675387813889
1235960423029059584
1235960281882337280
1235960173048496129
1235959891732451328
1235959857435549698
1235959714212655109
1235959566686355456
1235959418119954434
1235959353527713792
1235959328168960003
1235959317188222976
1235959312943665152
1235959236435337216
1235958825921978369
1235958714240294912
1235958555041296385
1235958413538009094
1235958356164128776
1235957997546991616
1235957737768587266
1235957324348522497
1235957221139402753
1235957047998459905
1235956347105087489
1235956106293399553
1235956046436413441
1235955788037984256
1235955661533560833
1235955526636355584
1235955471779082240
1235955436194541570
1235955229629259776
1235955173513662465
1235955150243708928
1235954984094707712
1235954837877121025
1235954728477093890
1235954548931522561
1235954332228636678
1235954166473920512
1235953934172401664
1235953663581007873
1235953492298280960
1235953379316244480
1235953340753772544
1235953180187516928
1235953013178675200
1235952815274708992
1235952678787846144
1235952603445506049
1235952475758358530
1235952103140581377
1235951948429430785
1235951904221511681
1235951767805988866
1235951764370870272
1235951632443207686
1235951516667822080
1235951196583727105
1235950966287065088
1235950800482037761
1235950760900378625
1235950375850606592
1235950012552577025
1235949820747137031
1235949616279019526
1235949575078371331
1235949227437699073
1235949069891231750
1235949004221042688
1235948851070148609
1235948731264049154
1235948484567711746
1235948415735017478
1235948296620908546
1235948180019216385
1235947915161620480
1235947730658357248
1235947544934592514
1235947181028372480
1235947100338368512
1235947035674673152
1235947026514395144
1235946728404197376
1235946179076255744
1235946069277753344
1235945949605892097
1235945642024976390
1235945465872609280
1235945255079460865
1235945142588182528
1235944571235950592
1235944489824456711
1235943949149376512
1235943943302496258
1235943811643314176
1235943619237949440
1235943323854163971
1235943148834164737
1235942783195713536
1235942390709530624
1235941855168167937
1235941605728804865
1235941523176460288
1235941277239296003
1235941244330704896
1235941184322916358
1235941084754296834
1235941007688192003
1235940648110428161
1235940507915780096
1235940502652022784
1235940289703030785
1235940224976510978
1235939385616429058
1235939307199836162
1235938834958954496
1235938793133420546
1235938657766379520
1235938292106919937
1235938261383761921
1235938243063025668
1235938059717431299
1235937603905638401
1235937518534746113
1235937352100478977
1235936741569294336
1235936622631403520
1235936230078132224
1235936221207171073
1235935874828963841
1235935457147527169
1235935166603898880
1235935055173824515
1235934969027063808
1235934955328372748
1235934869747838977
1235934815037333504
1235934547398635520
1235934498946244608
1235934180321746944
1235934146394013703
1235934139389554688
1235933993398341634
1235933974519742469
1235933240185311235
1235932959665827840
1235932764215619584
1235932632464187397
1235932441036165121
1235932292255748096
1235932124143906818
1235931542968467457
1235931518410907649
1235931348881338368
1235931109801758720
1235931101471916032
1235930759363522561
1235930624827023360
1235930305795624962
1235930103412068353
1235929981135409152
1235929927138111490
1235929801162190848
1235929784506560514
1235929749152837632
1235929691783127040
1235929258217943040
1235928117379821568
1235927792258252800
1235927786860273664
1235927422349897730
1235927387981918208
1235927014537859072
1235926428853690368
1235925489891586048
1235925385034035200
1235925336514232321
1235925074496151554
1235924908347199493
1235924373229285377
1235923353514504202
1235923209171668992
1235923141911810049
1235923053542027265
1235923049590988802
1235922778857123841
1235922070925701125
1235921861059411968
1235921859432112129
1235921308732592128
1235921293280710656
1235921196702666754
1235921049289621505
1235921033464512513
1235920650927251457
1235920512573898755
1235918602072657929
1235917849136414720
1235917798758637568
1235917701157183489
1235917524056846341
1235917364899778566
1235917277171798017
1235917047520989186
1235916981079019520
1235916972057137153
1235916880566726666
1235916849742852097
1235916839814823936
1235916827110371329
1235916709774667777
1235916621941792768
1235916590836838401
1235916271121768451
1235916052133023746
1235915953633976322
1235915939893448704
1235915739195994117
1235915714520899589
1235915695680086016
1235915620258066432
1235915530810388482
1235915521134071809
1235915447406669824
1235915432126803972
1235915393786621953
1235915382642429954
1235915235506208780
1235915191201787906
1235915163167059968
1235915136898039809
1235915128983388160
1235915054500937730
1235915009571647489
1235914962880663553
1235914922246180864
1235914910523154438
1235914644453314560
1235914392010731522
1235914276444999680
1235914230945189888
1235914118860857348
1235914109759229952
1235914105011216391
1235914091404890112
1235914083850956803
1235913793437384706
1235913668300165121
1235913552579477508
1235913353932963841
1235913230444384259
1235913187951853569
1235913183757561856
1235913096474095616
1235912963648876544
1235912955998466048
1235912806446370816
1235912646593036288
1235912178592608256
1235912067497984001
1235911998308786176
1235911930272980992
1235911887658852354
1235911871372423168
1235911512344190976
1235911259167567873
1235910763841236994
1235910536044457992
1235909856969793542
1235909510033747978
1235909263337426945
1235909224460410884
1235908754329214979
1235908535151726597
1235908446001786881
1235908358441521157
1235908267370569729
1235908200593068033
1235907720651444224
1235907536257245186
1235907493475295232
1235907477826396164
1235907120006148097
1235906900140740608
1235906389081575425
1235906378755182592
1235906266037448705
1235906186488279040
1235906084566638592
1235905626586460160
1235905350768918528
1235905028063399936
1235904882621722624
1235904045371580416
1235903929449410563
1235903539450449920
1235903531204386823
1235903491413094400
1235903423721230337
1235903321665351680
1235902948472954881
1235902884887367681
1235902422016548870
1235902328760422401
1235902116310519813
1235901661815676928
1235901635961991173
1235901548317704193
1235901404641931266
1235901111904632832
1235900867200548864
1235900589156052994
1235900471023259648
1235900413888450562
1235900298192916481
1235900163413233664
1235900022417485824
1235899973704847361
1235899613825175554
1235899439430217735
1235899263902797825
1235899181660848128
1235898928014426112
1235898834288545793
1235898764621230080
1235898748129013760
1235898537898016768
1235898394033426433
1235898321694318598
1235898236361203712
1235897832999137280
1235897538500313090
1235897327753342978
1235897316004986880
1235897253463822337
1235896856611360768
1235896661928534019
1235895920400764928
1235895361073549312
1235895315225628672
1235895289510277123
1235895202440716288
1235895069904953345
1235894947859124226
1235894758528217090
1235894605750636544
1235894344550420480
1235894242125414407
1235894240561033218
1235894090329452544
1235894068812660737
1235893854550790145
1235893744034971648
1235893615525793792
1235893001328750592
1235892842276454401
1235892133392941056
1235892001939148804
1235891957903298560
1235891804534452224
1235891619049676802
1235891457652920320
1235891253658750983
1235891149027577857
1235891136218136578
1235891097005690880
1235890986410299392
1235890894076891143
1235890811230777345
1235890655798398976
1235890351606558721
1235890048899452928
1235889897925378048
1235889767360983040
1235889712046448641
1235889683260989440
1235889672393547776
1235888526127960065
1235888487712403456
1235888209508339713
1235887704031850496
1235887580731801600
1235887426297573376
1235887281489272834
1235887278712655872
1235887133338017794
1235887003381702656
1235886927888478214
1235886844648321024
1235886837262159873
1235886631665704960
1235886517681360897
1235886228202979328
1235886128441503744
1235886124117233664
1235886117301477376
1235885901823307777
1235885886291742720
1235885704850419712
1235885651830112259
1235885633094238209
1235885284476284928
1235885222220009472
1235885005156515841
1235884905847980032
1235884614893400064
1235884501114462209
1235884436211843072
1235884391269793797
1235884342850789376
1235884233790373889
1235884183576330242
1235884151871614982
1235883976042196994
1235883743354720257
1235883597296435200
1235883508528222219
1235883215606382593
1235883111155720193
1235882952174850049
1235882939533217793
1235882779277225987
1235882179298758657
1235882081995182082
1235881701496066049
1235881641106694144
1235881399309266944
1235881103992422400
1235880897402019840
1235880577921933312
1235879991411445765
1235879990983606272
1235879957223661569
1235879904304037889
1235879886700544001
1235879767146221572
1235879687957753860
1235879041456115712
1235878748706287621
1235878563523571713
1235877965411618816
1235877909086310401
1235877282834767872
1235877246793117697
1235877183270371328
1235876814284783616
1235875910529794051
1235875529540153344
1235874953800626178
1235874739685593091
1235874412269797377
1235874273992019968
1235874264546410497
1235874251804114944
1235873710055337985
1235873584771403776
1235873326691684353
1235873261617061891
1235872821588475904
1235872714402996226
1235872460857380866
1235872289528389634
1235872247010779138
1235871964079812610
1235871903195291648
1235871870840340483
1235871697066168321
1235871545043673088
1235871543663702016
1235871542296186880
1235871539574321153
1235871416400166912
1235871397806628864
1235870690504515584
1235870688805863424
1235870686641393664
1235870684578025473
1235870631566114816
1235870502524194816
1235869433093959681
1235869356149444609
1235868953286590465
1235868946491822088
1235868571701407744
1235868516261064705
1235868358291017729
1235868185028464640
1235867976349302784
1235867255923064833
1235866983180021763
1235866539322003456
1235866518853808130
1235866447970045954
1235866155836817411
1235865725073379329
1235865645763289099
1235865053452095495
1235865053082992641
1235865011320324101
1235864911600705536
1235864665164378112
1235864541952499717
1235864466354360326
1235864264419586050
1235864119791632384
1235863882154962944
1235863849795907584
1235863725749309440
1235863552230973440
1235863489190612993
1235862994183008256
1235862980824141825
1235862861609447425
1235862861152313344
1235862823395184642
1235862310545055744
1235862222359818240
1235862016998301699
1235861361525051395
1235861079713955841
1235860640691961858
1235860556105433090
1235860553093877762
1235860391428673538
1235860108678053888
1235859014769979393
1235858997288161281
1235858966019592194
1235858959652683777
1235858817746759681
1235858536120242177
1235858532303437825
1235858369413394432
1235857831569412103
1235857490861895682
1235857277535408128
1235857118197997569
1235856273213538304
1235855897290670080
1235855719598940160
1235855629433982976
1235855358251257856
1235855239464382466
1235855104424562695
1235854901323780096
1235854431523991558
1235854002379567104
1235853928660496385
1235853784158326785
1235852881040793601
1235852585162006528
1235852264314556416
1235851907031109633
1235851717574447112
1235851336471564293
1235850855879852033
1235849075460722688
1235848470101016577
1235848456679198721
1235848314488107009
1235848208279994375
1235847793656262657
1235847683098554370
1235847638777393153
1235847630313291776
1235847556581621761
1235846956506697729
1235846754995539969
1235846700981338113
1235846367437713409
1235846299322179585
1235846214446272513
1235846211413757952
1235845776984518656
1235845630754344963
1235845437623427072
1235845423530569729
1235845362536943616
1235845208429879301
1235845038803836929
1235844959132999686
1235844767667212290
1235844407040987136
1235844222550327297
1235844123292123136
1235843629878370310
1235843527558356994
1235842992948170754
1235842798651228162
1235842789042085888
1235842782024970240
1235842343091064834
1235842143953899520
1235842068238323713
1235841993281900545
1235841771587788801
1235841288437559296
1235841287187607555
1235841153196388356
1235841142022758401
1235840868445122562
1235840714983915520
1235840646998458369
1235840308945903616
1235840296967004163
1235840268139520003
1235839128584904705
1235838710135967745
1235838607576813573
1235838358879735809
1235838228797591554
1235838091350298624
1235837700881526786
1235837605398196226
1235837476503076866
1235837419280187392
1235837370684936198
1235836836708093954
1235836804508422145
1235836710207885312
1235836527537565696
1235836410843688960
1235836375284330497
1235836246083039232
1235836242568163328
1235836223442182145
1235836218882945024
1235835878427123712
1235835686864818176
1235835439900012546
1235835435462430726
1235835246525861888
1235833978755530752
1235833814863056897
1235833768646041601
1235833688228679683
1235833583803052034
1235833456157798400
1235833338692173832
1235833100178837505
1235832889536733184
1235832775044816896
1235832406071889921
1235832345774579713
1235832286756474880
1235832153830617088
1235832099375960068
1235832012780359683
1235831795897126913
1235831751475224576
1235831706566836224
1235831605437976576
1235831162397814785
1235831124716212228
1235830921426653188
1235830620980297729
1235830463446388739
1235830434388303873
1235830403023306757
1235830343963308034
1235830277802356739
1235830240015839236
1235830222840193024
1235829740650369024
1235829704994590721
1235829099039350789
1235828975189942272
1235828936312946688
1235828716485226496
1235828642996871169
1235828452919365635
1235828342961483776
1235827669972869122
1235826904101343233
1235826313736237056
1235825231802929155
1235824875983360003
1235824717556146176
1235824532553752581
1235824002888691714
1235823885422964736
1235823659731673088
1235823639758397442
1235823541586550785
1235823418123018242
1235823405624000513
1235823399248650240
1235823355820834816
1235823047023550464
1235823026718957569
1235822935329214464
1235822821277753347
1235822733629349889
1235822682312073216
1235822478615691265
1235822464266932225
1235822387112730624
1235822316203814912
1235821942747222021
1235821561820499969
1235821511308537857
1235821184421257216
1235820257253552129
1235819917502373895
1235819564975316992
1235819514081599488
1235819458486128640
1235819334678614017
1235819291192115201
1235819102842712065
1235817954228359174
1235817124590845954
1235816832856031234
1235816724236095488
1235816404361699328
1235816317812236288
1235816156155404289
1235815521934659584
1235815217935704065
1235815031633145857
1235814531818860545
1235814299051778056
1235814170555080705
1235814016158580736
1235813808926416903
1235813175586508802
1235813108616028165
1235813028345466881
1235812945914769414
1235812503424098304
1235812289569157120
1235812125576060929
1235811851981578242
1235811772843446272
1235811279379378177
1235811109254250501
1235810620550729728
1235810504620138497
1235810449708310529
1235810321429757952
1235810083793072129
1235810053967368192
1235809881367523328
1235809809095471104
1235809176728637440
1235809104972505089
1235808990426091527
1235808910268747776
1235808794615017473
1235808657431912448
1235808528637366272
1235808359695056896
1235808001778257920
1235807933109129216
1235807828318646272
1235807773742559232
1235807420904955904
1235807349765365760
1235805428338102272
1235805397920841729
1235805392791367680
1235804101314822144
1235803608278421506
1235803096938250241
1235802876938612737
1235802796345004032
1235802494573436928
1235802120789647360
1235802012861648896
1235801755926949889
1235800576685793280
1235799973611982848
1235799592861667328
1235799510846066691
1235799197992927232
1235799093106049024
1235798608332484609
1235798562555846656
1235796649718448129
1235795710970335234
1235794391379267585
1235793828579168256
1235793542993326082
1235793197663690752
1235793141355016193
1235791736703791105
1235791656676233217
1235789606395752448
1235789134331080705
1235787076894961664
1235785929970905090
1235784717557002240
1235783849801637888
1235783697607127045
1235783204700897284
1235782954376454144
1235782681515999238
1235780757806817281
1235780593356541958
1235779850775994369
1235778147771133952
1235778005340958720
1235777188605161480
1235775456940523522
1235774521484992514
1235774377595154433
1235774290294910979
1235772863224975360
1235772192731918336
1235770150864982016
1235768793533681669
1235767404044660739
1235764808974315520
1235763968871993344
1235762673100431370
1235758940903874560
1235755776905535490
1235755295512694785
1235741046056812544
1235736714532073472
1235736346288738304
1235736314571411457
1235736174179872768
1235734823723044864
1235731851387572225
1235730476708646913
1235728911398588416
1235728424368472069
1235728162283233281
1235727234335272961
1235727222125690880
1235724793757855744
1235723898638852096
1235723316490645509
1235722346633232386
1235721877588410368
1235721637997277185
1235721620112551936
1235721104771215360
1235719856298905601
1235719103408676870
1235718156804648960
1235717469802819586
1235716954993852417
1235716914250502144