1234991934533320705
1234991845022679040
1234991121257746432
1234990708815040512
1234990645355245568
1234989761560858624
1234989432039596033
1234988971572092928
1234988638976401408
1234987862065463297
1234987010177155073
1234985288784441344
1234984401215184896
1234984176350220288
1234984145282928644
1234982498242715651
1234982427765829632
1234982205291544577
1234982114396753920
1234982005781057536
1234981628872511491
1234981616524546049
1234981373154213888
1234981360197963776
1234980680267784193
1234980675448492033
1234980660948766721
1234980480761511936
1234979961213083648
1234979538326544384
1234979411075559424
1234979210139070466
1234979080329498624
1234978979951468545
1234978841258414082
1234978274826022912
1234977802526412800
1234977714886467585
1234977633076568069
1234977551430275072
1234977346785964032
1234977281920995328
1234976768584384513
1234975424091844609
1234974145609269248
1234973664891682817
1234973620847312896
1234973473161674753
1234973247273234432
1234972872700915716
1234972865667055617
1234972835556151296
1234972577308631040
1234972245660852224
1234972202732146688
1234971924268118016
1234971513998065664
1234971164876763137
1234970844939423744
1234970714953801729
1234970612033961984
1234970417791561728
1234970412900966403
1234970262640029697
1234970003021021187
1234969887640096768
1234969800687915008
1234969732224294912
1234969584547115011
1234968987953508356
1234968636831473666
1234967903230885888
1234967841616601088
1234967794137079809
1234967560019468294
1234967200051662849
1234966925551316997
1234966529776783361
1234966529294376961
1234966320074149888
1234966040049856512
1234965860957245442
1234965858843320320
1234965591087292418
1234965452956274688
1234965319803981829
1234965264422273026
1234965080153952256
1234965021312081924
1234964792760324102
1234964305860321280
1234964268132552704
1234964085533442056
1234963676437843976
1234963170449612800
1234962870795931649
1234962495128862723
1234962340833038336
1234962268347076608
1234962086087798786
1234962011194302465
1234961963928739840
1234961898262671361
1234961821032996864
1234961014132822023
1234960925402288128
1234960834989821954
1234960554382458881
1234960453559881730
1234960437701160960
1234960297577897995
1234959916483387398
1234959869024796672
1234959690402074630
1234959283294523393
1234959048807714822
1234958928196329472
1234958917580386304
1234958799708073984
1234958758511509511
1234958751049961473
1234958692644216833
1234958570317238273
1234958471201730560
1234958313072230400
1234958247246934017
1234957409602408450
1234957401020825601
1234957288588357632
1234957275816767488
1234957070245429254
1234956795367567365
1234956409420353536
1234956308169752576
1234955629854363648
1234955623990747136
1234955126948945920
1234955034481303553
1234954954227486722
1234954509052452864
1234954356400775168
1234954318664601601
1234953758007795719
1234953524657737734
1234953512980746241
1234953304171569154
1234953242821496837
1234952785306824705
1234952454715740160
1234952113874227200
1234951880704512000
1234951734721728512
1234951219161944064
1234951056649596934
1234950914731118593
1234950859106213888
1234950745511923712
1234950727644176384
1234950698036531206
1234950440837619713
1234950405144162304
1234950328795246594
1234950200449523716
1234949971637567488
1234949789432848387
1234949535794958338
1234949464433025024
1234949154012618753
1234949065269547010
1234948848881164288
1234948696112074757
1234948574649233408
1234948572258295808
1234948278086664192
1234948219605594112
1234948216472375296
1234947997869445120
1234947695883804673
1234947543831924736
1234947475724783616
1234947453624995840
1234947315703697408
1234947242789941248
1234947202075811841
1234947054499180546
1234946818540265480
1234946798193692674
1234946775032705024
1234946648868036609
1234946469112819712
1234946299386044421
1234946232633700352
1234946050814889992
1234945976181325824
1234945859193884672
1234945438651998210
1234945245168783360
1234944724978544640
1234944711334473728
1234944599606595584
1234944381247000576
1234944203123306499
1234944117349715968
1234944031014182912
1234944027121811456
1234943966556180493
1234943801988390912
1234943657251344384
1234943271941615619
1234942978843607042
1234942966571110402
1234942935730442242
1234942500017713160
1234942453028966400
1234942238075105282
1234941916694876160
1234941474715860993
1234941296193744906
1234941189863936000
1234940822191210496
1234940515264667648
1234940139757096967
1234940024451452930
1234939833526738946
1234939808725770242
1234939531369074688
1234939511488098306
1234939402427752448
1234939238615060483
1234939181232685059
1234938708706590723
1234938296733765634
1234938209253122048
1234938099203026944
1234938050444132354
1234937838392815623
1234937722139181058
1234937596960223234
1234937405754482694
1234937115999457281
1234937043853234176
1234937017252925443
1234936984688304130
1234936883433660422
1234936874952790020
1234936803091795970
1234936471393644546
1234936244179734533
1234936192690507776
1234936180526985217
1234936067998003203
1234935896262291457
1234935845578301447
1234935821196763144
1234935670575190018
1234935455726100481
1234935114515337221
1234935014468571137
1234934988468051974
1234934945187028992
1234934934168571904
1234934465723600896
1234934334454366208
1234934226383966209
1234934063049445378
1234934027230027778
1234933907998593025
1234933811625984001
1234933733859438593
1234933717271040001
1234933369080877057
1234933304836706306
1234933240575799297
1234933149550993408
1234933097449295872
1234932944516657153
1234932943430221826
1234932722205908998
1234932598666940419
1234932526264856582
1234932455691423755
1234932455045500929
1234932418001428480
1234932093815283714
1234932010390564864
1234931877783461892
1234931828789796864
1234931718215413762
1234931575692955650
1234931502586175488
1234931387850993664
1234931385707593728
1234931365818204160
1234931281823227904
1234931110137729024
1234931106551603200
1234931088906162176
1234931069616623619
1234931060850466823
1234930952276783110
1234930921087930369
1234930693840494593
1234930621253898242
1234930544070230016
1234930189362171904
1234930102041030656
1234929730207379456
1234929534501343238
1234929429719265280
1234929352086818818
1234929319983697920
1234929231311900672
1234929042421317632
1234928571866546176
1234928528669495297
1234928479105359872
1234928131720597504
1234927768862953474
1234927692950188033
1234927537622573056
1234927513471766529
1234927382424932359
1234927263004667904
1234927199532306433
1234926991595491330
1234926932166352896
1234926890235944960
1234926745280753666
1234926699768315905
1234926684127858690
1234926644990791680
1234926616343699458
1234926460839829507
1234926440380076035
1234926337053335552
1234926142555029504
1234926069368709120
1234926053602267137
1234925883980419074
1234925670645534720
1234925170999136256
1234925166163001345
1234925106868211712
1234925025125376000
1234924951435726848
1234924722959286274
1234924651912056838
1234924539672485889
1234924509028896769
1234924388325187585
1234924356800843778
1234924315260395521
1234924280456105984
1234924223543508992
1234923984212414470
1234923882156580864
1234923410725199872
1234923180793434113
1234922998278295552
1234922914954252288
1234922719612936192
1234922502406713344
1234922494542438402
1234922492562534400
1234922486757720065
1234922465060696065
1234922452599398402
1234922357539647488
1234922302673956876
1234922124176961536
1234921942014136320
1234921909134987266
1234921892265562113
1234921789572206594
1234921699218460672
1234921504959275008
1234921302902878211
1234921189140766721
1234920980117630976
1234920900228714499
1234920578584322051
1234920490805927936
1234920153298673664
1234920004086267905
1234919874213875712
1234919838142926857
1234919794325041152
1234919614129344512
1234919267654684673
1234919163975610369
1234918650437685248
1234918529075466241
1234918486146600960
1234918480513617920
1234918434816843777
1234918395822428160
1234918345914408962
1234918182621786113
1234918036127338497
1234917798243164161
1234917779133927426
1234917602620735488
1234917541744693250
1234917522903830529
1234917345920999425
1234917337595285505
1234917293680975873
1234917113409785857
1234916932756951041
1234916845276336129
1234916801449992193
1234916779014737920
1234916690795933696
1234916586978496517
1234916563096084481
1234916466501324800
1234916435346051072
1234916432384872451
1234916313467949058
1234916263211782146
1234915822868606977
1234915610120871937
1234915594257997825
1234915463060127745
1234915380612812802
1234915302460313600
1234915249691807744
1234915170641698824
1234915170515869701
1234915151855394817
1234914933244153857
1234914861567610880
1234914860107997184
1234914698337964039
1234914155368472576
1234914145620955143
1234914143137935362
1234914056613564417
1234913999847907329
1234913868452974592
1234913852611072003
1234913845010890752
1234913823510929409
1234913730791706624
1234913620808622082
1234913576189669376
1234913469830508545
1234913370719080453
1234913143933067264
1234913000735281152
1234912719222059010
1234912608744038400
1234912283664449538
1234912078781145088
1234911976691785729
1234911721954914304
1234911655097585664
1234911293825540096
1234911158986997763
1234911066842419201
1234910948982431747
1234910531309461507
1234910509490679811
1234910479648161797
1234910181563273216
1234910149640413187
1234910098495021056
1234910047186100224
1234909863806930944
1234909311102521345
1234909200557453314
1234908894159343617
1234908870998405120
1234908758276542466
1234908631319142401
1234908205135859717
1234908062839910402
1234907903045328903
1234907826524475392
1234907753707167747
1234907626632335362
1234907322557829121
1234906892457168896
1234906817471406081
1234906704250359808
1234906697015209991
1234906588621758464
1234905480130068481
1234905333182730242
1234905320276865024
1234905181546041345
1234905170770890752
1234904379830013952
1234903977734627328
1234903873451675648
1234903789376868353
1234903633822650369
1234903454352650240
1234903445439729664
1234901960500924417
1234901959741759489
1234901381166829568
1234901351206969346
1234900956439023616
1234900810502414337
1234900484290482176
1234900362064207873
1234900193084149762
1234900061232017408
1234899891677286402
1234899860576505858
1234899817341575169
1234899613557063680
1234899491096072192
1234899436679159816
1234899180579151872
1234899143992184834
1234898766970396672
1234898758976131074
1234898746783207429
1234898670660747264
1234898425667375104
1234897973412270080
1234897860862365697
1234897842428203008
1234897769913077761
1234897678733058049
1234897108433539073
1234896949817548802
1234896086139011073
1234895862196850690
1234894842934824969
1234894709962813440
1234894215726931973
1234893630717886465
1234893146938626048
1234892724656115712
1234892621786599425
1234892482888028162
1234892318223847424
1234892132105834497
1234891957870170112
1234891686872076295
1234891211418279937
1234890740645466112
1234890363137150978
1234889931090165761
1234889554018078720
1234889052043841537
1234888742667800576
1234888272976994304
1234887083854094337
1234887028816449536
1234886814269366273
1234886600955396103
1234886367844368387
1234886367072538626
1234886270939271170
1234886268091338752
1234885792859901952
1234885466740183045
1234885311248969728
1234884515941756929
1234883974280994819
1234883664527396864
1234883335610159109
1234883319655010305
1234883208237453312
1234882912937500672
1234882845845401600
1234882709866065925
1234882517049757696
1234882414549356544
1234882297893183489
1234882248609976323
1234882232805920777
1234882106452520961
1234882074772934660
1234882041973551105
1234881956330057728
1234881947509370883
1234881626477387778
1234881552837988352
1234881510538465283
1234881457396514822
1234881399225802752
1234881316182728705
1234881274579316736
1234881254648172545
1234881083868622848
1234880962871341068
1234880812107079680
1234880664522182656
1234880608440127488
1234879974861090821
1234879910168186887
1234879828576391173
1234879764952965120
1234879706010398721
1234879687047942144
1234879619381256192
1234879567459995658
1234879537055502338
1234879297514614789
1234879273548369920
1234879225108353026
1234879190673039361
1234879142912561152
1234878967334756353
1234878928378048514
1234878912116789249
1234878905124839424
1234878760421339137
1234878525049573376
1234878225358184450
1234877951881048065
1234877925092200450
1234877458824015873
1234877361209868289
1234876885177425920
1234876745569968131
1234876328920408065
1234876216685006850
1234876145713254401
1234876011797504000
1234876011361316865
1234875884852699136
1234875826186981378
1234875694318080001
1234875081052053504
1234875073246507008
1234875040958734337
1234874849329369089
1234874821240029185
1234874716873273344
1234874703803768833
1234874609218052097
1234874591534886913
1234874574447271937
1234874436920193025
1234873985860501506
1234873983914385408
1234873782428471296
1234873775432314880
1234873700052324352
1234873397135446016
1234873176141762561
1234872954418335744
1234872903201632262
1234872824717856768
1234872706098659330
1234872279995162629
1234872052403798018
1234871668901908482
1234870766757433345
1234870241475407872
1234870155294863360
1234870125972639744
1234869830181904384
1234869654134444033
1234869427474194438
1234869203091542016
1234868822668173312
1234868805978988544
1234868468165599233
1234868345427636224
1234867942850023424
1234867740910989312
1234867570815197184
1234867389084393473
1234867182804312065
1234866940734328833
1234866723041554433
1234866722760462336
1234866593257181184
1234866169326325760
1234866090599165954
1234865647487721472
1234865353320280064
1234865263843139584
1234865071836270592
1234865045349314560
1234865006870700034
1234864679501082627
1234864617819660288
1234864399967498240
1234863953311870976
1234863440201687046
1234862035290206212
1234862000091602954
1234861863227318273
1234861790380613632
1234861362410643456
1234861294970449921
1234860908352036864
1234860399289405446
1234860250458664964
1234860116656185350
1234859542997086211
1234859531072688135
1234859260208713730
1234859226629054471
1234858979840397312
1234858821274738691
1234858684657930241
1234858516051087364
1234858475425009669
1234858075808522241
1234858035660644354
1234857870879023104
1234857585184034817
1234857344934305800
1234857136838127617
1234857086095364096
1234856781526061064
1234856719001452545
1234856349751750666
1234856265962094594
1234855986164269058
1234855533439524865
1234855251418779648
1234855122443886593
1234854460083621888
1234854413472346112
1234854314922958849
1234854121120858112
1234853897103171585
1234853894498418695
1234853568823336960
1234853429375328256
1234853278774628364
1234853108146212866
1234852958254309377
1234852079778308096
1234851519121498112
1234851328100306950
1234851169706618881
1234851074470764547
1234850591429582849
1234850386034515969
1234850378816069637
1234849705328287754
1234849324061921282
1234848957446152193
1234848002168193031
1234847840918212609
1234847297650991107
1234846716156928003
1234846473604472839
1234846059064700928
1234845957935812608
1234844598238883841
1234844563635830785
1234842166817587201
1234841859068977152
1234841763073970178
1234841666982420480
1234841632454905856
1234841602646040576
1234841425835167746
1234841352870993921
1234841110897401856
1234841095370158080
1234840823939969024
1234840738166378496
1234840638526541824
1234840414185807876
1234839945753354240
1234839846637666314
1234839631293796352
1234839594685865984
1234839581150924806
1234839230884524032
1234838955310362625
1234838788918140929
1234838659259609088
1234838631900164096
1234838434906345472
1234838320926150656
1234838223878266885
1234838143548960768
1234838054424195072
1234838026045579264
1234837854506889217
1234837386728656896
1234837213403217920
1234836798297296896
1234835363715305473
1234835250146160642
1234835097418944514
1234834886298656768
1234833985404096512
1234833746597220352
1234832845673320448
1234832822151602176
1234831607313453056
1234830842314317824
1234830621735837703
1234830312619888641
1234830025846902788
1234829588854910976
1234829568038625281
1234829313503039488
1234828812363485187
1234828800082444288
1234828364734697472
1234827762394943490
1234827683105779712
1234827659785445376
1234827368528797696
1234827139427557376
1234827120016285699
1234827071093784576
1234826969168125954
1234826770651734018
1234826737441296386
1234826467328118784
1234826449040879616
1234826358976585728
1234826242987307011
1234825730145517568
1234825591003795457
1234825093253038081
1234824935039815680
1234824819289600000
1234824614670479360
1234824319408230400
1234824186616516608
1234824158313435136
1234824003795247106
1234823976276430848
1234823855027388416
1234823765470728192
1234823383994568705
1234823032260169729
1234822787216412672
1234822767209582593
1234822700302032897
1234822354263531520
1234821880546254848
1234821188842663936
1234820726257078272
1234820701305102336
1234820551492935684
1234820519041609729
1234820375856517120
1234819199362588672
1234818908059770882
1234818611996430338
1234818485999542272
1234818351282741250
1234818213017477121
1234817892207747075
1234817673789419522
1234817556189523970
1234817459804225543
1234817369530404868
1234816983486599168
1234816768759279616
1234816685879721984
1234816510583091200
1234816258840944640
1234816179937726466
1234815483553230848
1234814951539298304
1234814487078883328
1234814015169335296
1234813988678008833
1234813808843141121
1234813682632269825
1234813621764530176
1234813327295029248
1234812289418715146
1234812090931712000
1234811637095378950
1234811583441797120
1234811231543996419
1234811181724033024
1234811069278887936
1234810884549226496
1234810719062740995
1234810699584589825
1234810402841800705
1234810376585404418
1234810290740572167
1234810260612886528
1234810073026891777
1234809792000135168
1234809672210604032
1234809423832518656
1234809225630507008
1234808893890605057
1234808856234074113
1234808218947407872
1234808197271166976
1234808179869044736
1234808085929066496
1234808016324743169
1234807743246151682
1234807495249412097
1234807193804976128
1234806920562794496
1234806906125983744
1234806569730281472
1234806486787907584
1234806393871511552
1234806083480440832
1234805391810232320
1234805297618857984
1234805216048041986
1234804975857020928
1234804568015409152
1234804522884661248
1234804196664320000
1234803951725350912
1234803841314496512
1234803761840738305
1234803726818455552
1234803597218603008
1234803564394012672
1234803562749845504
1234803560002596864
1234803378225545219
1234803015300808707
1234802496448716800
1234802232392142848
1234802031434571778
1234801600604114948
1234801517712084993
1234801454692651008
1234801267379183617
1234801267014279173
1234801056527323137
1234800669984423936
1234799819580956673
1234799711598661632
1234799401274630144
1234799226376392704
1234798735823077376
1234798551521202176
1234798336575725568
1234798278769881088
1234798270498705408
1234798267730403328
1234797673158520833
1234797441993469953
1234797411828215808
1234797206600929281
1234797105010675712
1234796992812838912
1234796540025360386
1234796436002394113
1234796366150414337
1234795729849331712
1234794923477651456
1234794533805854726
1234794475911815168
1234794115281215489
1234793600489312256
1234793263959334912
1234793188973477888
1234793095109148672
1234793028696580096
1234792129798406144
1234791953088339968
1234791431270731778
1234791143184965633
1234791122737811456
1234790889094033409
1234790780004454400
1234790696000872448
1234790519714308096
1234790461140865025
1234790317452382208
1234790285454041088
1234790170345562113
1234789783173550080
1234789424690540544
1234789420903096320
1234789399918993408
1234789291487899648
1234789142514536448
1234788709821812736
1234788503940222976
1234788431936544768
1234788082286768133
1234788046408691712
1234787987600400384
1234787760579522561
1234787694414307329
1234787585110740992
1234787566983041029
1234787479661817857
1234787299948449792
1234787215043125248
1234787104749735936
1234787047963054081
1234786978312355841
1234786755498455040
1234786723906957313
1234786670991609857
1234786636447256576
1234786422231617537
1234786312495992832
1234786296469639168
1234786205490929665
1234786051446755329
1234785830276870144
1234784807239999488
1234784602549620736
1234784538544549888
1234784107248455680
1234784058380619777
1234783955070701568
1234783794680430593
1234783352420491264
1234783266521174017
1234783236057960451
1234783149881774081
1234782417107509248
1234782238312673280
1234782186877878272
1234782170830573569
1234782014554943488
1234781362441330689
1234781082207342592
1234781048862642177
1234780821480931330
1234780053428461568
1234779960973438977
1234779683167854592
1234779367756193792
1234779180102975489
1234778986309394432
1234778970689875971
1234778931359895552
1234778675960262656
1234778661410177026
1234778553427922945
1234778522922758144
1234778374612176898
1234778142990118912
1234777839234355201
1234777594165202944
1234777593729167360
1234777450011406338
1234776998796570625
1234776980286996480
1234776878382272512
1234776570629382144
1234776538765234176
1234776468955287552
1234776215627747328
1234776015861362688
1234775888098660352
1234775708628594688
1234775672041754624
1234775591771086850
1234775430072279040
1234775270818746368
1234775082968416261
1234774890085015552
1234774739010363393
1234774734337867776
1234774328597676032
1234774011726454784
1234773865886289920
1234773029785350144
1234772739015266304
1234772589895176192
1234772175216939009
1234772141180162055
1234772031973007360
1234771842562510855
1234771809947521024
1234771797477908480
1234771438508429312
1234771281687478272
1234770905991143425
1234770654244855808
1234769835160145920
1234769601008930818
1234768676701773825
1234768664810991617
1234768525539053568
1234768447055290369
1234767851388579841
1234767827099406337
1234767764801441792
1234767539630198784
1234767431593316352
1234767136297492483
1234766622180679680
1234765843512295424
1234764917498097665
1234764618100334592
1234764392526491648
1234764305981153282
1234764133117108224
1234763950325145600
1234763868703948801
1234763325591969792
1234763024696795138
1234762794022658048
1234762782878334976
1234762668277477376
1234762256509849601
1234761678358708224
1234761474037383168
1234761333226246144
1234761283725090817
1234761141945012225
1234761098601156608
1234761078690721794
1234761065625530369
1234761043693522944
1234760984327327745
1234760958096105477
1234760754328408064
1234760692907102208
1234760549633863680
1234760362228142080
1234760357731819520
1234760312500490240
1234760274101653504
1234759840876171265
1234759758567133184
1234759728640798720
1234759464198266880
1234759218416230400
1234759043207639041
1234758905575526400
1234758882800668672
1234758860163997698
1234758834134102017
1234758775254519808
1234758710179831809
1234758465500872704
1234758419065790469
1234758294901788674
1234758199724646400
1234757910116392965
1234757756395061248
1234757608948539392
1234757489792626690
1234757346557120512
1234757295667580928
1234757121599844357
1234756428621139968
1234756344336592896
1234756248383389696
1234756135346982912
1234755927217262592
1234755490095280129
1234755284641484801
1234755176487161856
1234754900065734657
1234754684839133185
1234754574566744064
1234754290989793281
1234754192813764608
1234754116947267584
1234754094314786816
1234754075335561216
1234754051843162112
1234753822687404033
1234753766232031233
1234753718454755329
1234753704370286592
1234753515702149120
1234753093251878912
1234753092018675713
1234753059928125440
1234753006521942017
1234752935114006528
1234752572742918144
1234752341049516035
1234752050921115648
1234751929298931712
1234751839490519045
1234751317882679298
1234751103842963456
1234750854575673344
1234750810652921856
1234750211504910336
1234749973440421888
1234749421025406981
1234749244986228737
1234748603656278016
1234748525524738049
1234748002411143168
1234747804330971137
1234747407100936197
1234747174518509569
1234746912269570048
1234746796892721152
1234746713405083648
1234746562296918023
1234746500435062785
1234745945528598528
1234745412751446016
1234745181049626624
1234745132823588865
1234745085822107648
1234744362275364875
1234744324434382849
1234744235515138048
1234744101871988736
1234743888616841216
1234743787072770048
1234743684874240002
1234743670932459520
1234743594470313984
1234743526124113924
1234743446562365441
1234743001622220801
1234742829106237441
1234742785879748610
1234742776958459904
1234742769865891840
1234742691101106176
1234742545550381057
1234742523886735360
1234742350179700736
1234742291467833344
1234742286631735299
1234741429383106560
1234741427298590720
1234741203532492800
1234741118429843456
1234740815810977792
1234740533010092034
1234740470439391232
1234740308665143296
1234740278793297921
1234740178427817984
1234740171792375808
1234739861560733697
1234739747949551617
1234739620539183104
1234739318440198144
1234738693463855105
1234738630003843073
1234738595010928640
1234737407641124864
1234737096532877312
1234737014915969025
1234736953045766145
1234736845260574720
1234736379025903616
1234735991090483200
1234734833894658048
1234734555149586435
1234734344952074240
1234734232725065728
1234734151531737088
1234733921465774080
1234733697120841729
1234733370506141702
1234733189119254528
1234732992473554946
1234732537865478144
1234732362367414272
1234732325444956160
1234732293589217285
1234731890646667265
1234731614854356993
1234731236058255360
1234730651418611714
1234730633450029056
1234730166200537094
1234730094180081664
1234729988705935360
1234729976160751621
1234729838436589568
1234729643963551744
1234729002432114689
1234728489158352896
1234728251207143424
1234728048680984576
1234727773111037953
1234727713002414081
1234727549483266049
1234726999823917056
1234726787583741953
1234726587481939969
1234726422180237312
1234726318757044224
1234726316093689856
1234726206639136768
1234726109729738752
1234726101076922370
1234726024790847488
1234725977533698049
1234725955589099525
1234725921304842240
1234725877684019200
1234725861611450368
1234725705478438913
1234725696154558464
1234725505380823045
1234725234286174208
1234725214073839616
1234725130540064768
1234725104296263680
1234725005507932160
1234724725278027776
1234724089299963904
1234724034639589377
1234723973348364288
1234723960895541254
1234723934660108289
1234723891966304261
1234723689108774913
1234723339882467329
1234723328394514433
1234722879998218241
1234722585658695680
1234722254610628608
1234722234859692033
1234722034548199424
1234722034334281733
1234721680079118336
1234721626941464576
1234721575800315906
1234721149814214657
1234721119657132033
1234720787820576770
1234720650067095552
1234720637463203840
1234720146486439936
1234719251015118848
1234718266666475521
1234717403801628672
1234716616178487296
1234716400113025025
1234715696870895617
1234715487826825216
1234715225162645504
1234715180937945088
1234714873679970304
1234714685343248384
1234714567256760320
1234714107686854656
1234713776563183617
1234713276258422784
1234712915921469440
1234712887983251456
1234712777916178432
1234712738489782272
1234712145054588929
1234711808268697601
1234709990969049088
1234708376791195648
1234707900737753088
1234706356806078464
1234706062395281408
1234704555176275968
1234704549912498176
1234703655976218624
1234703272302272512
1234702894894583808
1234702780662734849
1234702478928515073
1234701992859176960
1234701863376891905
1234701813208768513
1234699923154755585
1234699667121807360
1234699344932032514
1234699050647261185
1234698157797388288
1234697454710403075
1234697140930252800
1234696998512521216
1234696133307437056
1234695739038748673
1234693395492282368
1234682672120659968
1234681366467371017
1234677564964130821
1234671466244788226
1234670592860622851
1234668047455010817
1234666385956950021
1234665688360349696
1234664778691313664
1234664469793406976
1234664159549083648
1234663546559926272
1234661449739292672
1234659306697396224
1234655976441176065
1234654605725851651
1234653205885280256
1234651386593398784
1234650827299704833
1234649614588030977
1234648765124009985
1234647042791743489
1234646428380729345
1234643358833946626
1234641029262925824
1234636644856320000
1234633381809467392
1234631223294799872