1261083476859785218
1261082933449940992
1261082378329632770
1261082015799091200
1261081186190974976
1261080436316438528
1261080118606336001
1261079285445677056
1261077789735817223
1261077333915680770
1261077218941427722
1261076935242928131
1261075993038553091
1261075899375648770
1261075220724498432
1261074488411795456
1261074427149717507
1261073652172435456
1261073473390206981
1261072955901120513
1261072759326736387
1261072669388259330
1261072462432870400
1261072366337130496
1261072189551529988
1261071399881498632
1261070583493689344
1261068887715647488
1261068228421451782
1261067496184066048
1261066490037579779
1261066459075284992
1261065985978744836
1261065744089038849
1261065311626952704
1261064724923506688
1261064678962352133
1261064666987532288
1261064352297357312
1261063783667109893
1261062904603979776
1261062318324158464
1261062092125241352
1261061388518207489
1261060764078661632
1261060515025092608
1261059849217028096
1261059282092675074
1261059134088261634
1261059123052982274
1261059062323720193
1261058483585236994
1261057984349831168
1261057048202092550
1261056968602652672
1261056666449203200
1261056480519782402
1261056127518851072
1261056006102167553
1261054368226390019
1261054325704531968
1261053518212988929
1261052855382933504
1261052752945430529
1261052163217907714
1261051937912479751
1261051827656720384
1261050685136781314
1261048754460917766
1261048499455606789
1261047869521440768
1261047692081410048
1261047643976990720
1261047322781286401
1261047316066295808
1261047271350829059
1261047042509602818
1261046970170388480
1261046168517316609
1261045813465276417
1261045727121137664
1261045288946499584
1261045265693360131
1261045191332581376
1261044419165388800
1261044152998989827
1261043460506877955
1261043369477918721
1261043230403166209
1261042608434024450
1261042209039831042
1261040997200519168
1261040807701819395
1261039796438392834
1261039462068428800
1261039460063629315
1261039388412252161
1261039317973192705
1261039313925681153
1261038986782560256
1261038570850091009
1261038165462339585
1261037874310516736
1261037749592866819
1261037625898606592
1261037612179087366
1261037399997657089
1261037186872479746
1261037087316250624
1261037069801009154
1261036929317044227
1261036872622628864
1261036765256835076
1261036408598417410
1261036355779538949
1261036231862992898
1261035865683492870
1261035810180272128
1261035735471308801
1261035725874757634
1261034732353130496
1261034061272887306
1261034051403726850
1261033995090956288
1261033767625527297
1261032814662897670
1261032605778051072
1261032530616205312
1261032191666147328
1261032065509797899
1261031820411514886
1261031772873273354
1261031580291731456
1261031578131709953
1261031537853771781
1261031536633303040
1261031496816766980
1261031430555131907
1261031422149697536
1261031343787511809
1261031038043795462
1261030839791562756
1261030833709776896
1261030791087140864
1261030786997776384
1261030780979089408
1261030704240111624
1261030691195813889
1261030420386328577
1261030350135988224
1261030345329213441
1261030314203365376
1261030046275420162
1261029888733130756
1261029697665863688
1261029538420666388
1261029459861405696
1261029410683129861
1261029339749134337
1261029299047608321
1261029245838602242
1261029215442534400
1261029056964890624
1261028840899477505
1261028815528177676
1261028729138089984
1261028636603318279
1261028538569932800
1261028524355465223
1261028060595400713
1261028032166404096
1261027962813665281
1261027630779858945
1261027617689526288
1261027501725421568
1261027483329101824
1261027372742164480
1261027318455324672
1261027240151744512
1261026862261829632
1261026853353074692
1261026817177260032
1261026668711469056
1261026584548556800
1261026568706670592
1261026145828560906
1261026141000871939
1261026104074215424
1261025921970122757
1261025702666743817
1261025548614152198
1261025547917897735
1261025528661913606
1261025283362164737
1261025005116313606
1261024975076630528
1261024512755326980
1261024333713072129
1261024238754058242
1261024200191610886
1261024126183051265
1261023865347563520
1261023864286371841
1261023862973624320
1261023478750367747
1261023432617209858
1261022207268065280
1261022075399147521
1261021992544882688
1261021701015515139
1261021419900715013
1261021045789728770
1261020786124611584
1261020768541917184
1261020676464553984
1261020599436152833
1261020575151075335
1261020496713351171
1261020483132231680
1261020304844955649
1261020234212835328
1261020232937865222
1261020154328158209
1261019993019473920
1261019949990064130
1261019839977717760
1261019760411717637
1261019717919260672
1261019674118144002
1261019600214507520
1261019442340913153
1261019287294181378
1261018963770818561
1261018801992282118
1261018613726797832
1261018537331757066
1261018386781417476
1261018381827833856
1261018332318269440
1261018279289765890
1261018220200411137
1261018038859640834
1261017954730328069
1261017913332568073
1261017884551249922
1261017854008328193
1261017767593025536
1261017744532742147
1261017663469387776
1261017660831207424
1261017633241079809
1261017520988917760
1261017434481397760
1261017182135365632
1261017170286465025
1261017134924206080
1261017060223655937
1261017020566507523
1261016975939121158
1261016928669270018
1261016898906578944
1261016864949485568
1261016832473018372
1261016798973112321
1261016772960026626
1261016759492059138
1261016739808231424
1261016698372722688
1261016664595890178
1261016513609334786
1261016163150069766
1261015842189389824
1261015586882162688
1261015539872391171
1261015182278643714
1261014894792622080
1261014754681856002
1261014681264758784
1261014151087960072
1261013925207949316
1261013925136527360
1261013913862275073
1261013775030853638
1261013769934733313
1261013692780593153
1261013425318223874
1261013397413511169
1261013163908071424
1261013019867389952
1261012985595727876
1261012579280977923
1261012414553710592
1261012412301324288
1261012347650539521
1261012264276103175
1261012154435751937
1261012040547807241
1261012036114362368
1261011670903685120
1261011581363785741
1261011578977214466
1261011464510455810
1261011435607461888
1261011355320098818
1261011298910863360
1261011151258877953
1261011140341051392
1261011116668354561
1261011107717808129
1261011044639617024
1261011006853087232
1261010904814170115
1261010750824427522
1261010747229962244
1261010637133688835
1261010563695509506
1261010539062407169
1261010284212355073
1261010202704347136
1261010111667015681
1261010067882737670
1261009981488447489
1261009839725084673
1261009714944638976
1261009683218825219
1261009395300868100
1261009394914873344
1261009197434572802
1261009196352516096
1261009053343453184
1261008897835442179
1261008560487612416
1261008530439573505
1261008427620487168
1261008361484673024
1261008106479407106
1261007952502231047
1261007890665668611
1261007635572297730
1261007562620710913
1261007217664327682
1261007114941730819
1261006634287009795
1261006306917396480
1261006213275422720
1261005095287881735
1261005071984349184
1261005064967241729
1261004793461571585
1261004790622011395
1261004756329340929
1261004294641180673
1261004247224717312
1261004151858892800
1261003962020499462
1261003647619600385
1261003294283051010
1261003277266751495
1261003150158422019
1261003097113051138
1261003004129546243
1261002963444805632
1261002899435458560
1261002800613425153
1261002547931856900
1261002423579090944
1261002251189051392
1261002030237331458
1261001973203173377
1261001720634671105
1261001471463735299
1261001303427350530
1261001286843056134
1261001090549583872
1261000947075092483
1261000820612628482
1261000774089392128
1261000679755218945
1261000587434475521
1261000587300278272
1261000380277800977
1261000289626337282
1261000242658521090
1261000238531317762
1261000201160069120
1261000051863814145
1260999648048799746
1260999424500740099
1260999331194253313
1260999114105540615
1260999048007495683
1260998704053604352
1260998697187528706
1260998692246622208
1260998578970992647
1260998421839785984
1260998300368543744
1260998285545943047
1260998223113719813
1260998156457857024
1260998057266745345
1260997964094418947
1260997846528151552
1260997737056817155
1260997612175581184
1260997501538250753
1260997402808418305
1260997317437636616
1260997190513840131
1260996969083875328
1260996803723505664
1260996601675382784
1260996536399470593
1260996410721402889
1260996399728115712
1260996172078026752
1260996066436145153
1260996020688891904
1260995825880178688
1260995771756875783
1260995762860838912
1260995038235983872
1260994798967652352
1260994614686887945
1260994399368032259
1260994032425107456
1260993964624224256
1260993948446797825
1260993878640992256
1260993782096543751
1260993706393509889
1260993641528647691
1260993402050695173
1260993386821169154
1260993298132541442
1260992835219869696
1260992773286658050
1260992545208905731
1260992362278518784
1260992211648425984
1260992110892929030
1260992003468394499
1260991917430579200
1260991739571179520
1260991632339599363
1260991296069685249
1260991293523734534
1260991141241110530
1260991059586318339
1260990958646300679
1260990814534209537
1260990672766734341
1260990656773787649
1260990494714343425
1260989971827232769
1260989930458820608
1260989889379815424
1260989838704156673
1260989732575686657
1260989697444151298
1260989474017816578
1260989460356968454
1260989332720103425
1260989313220849664
1260989296875626496
1260988734629187589
1260988572850630656
1260987952550862854
1260987746090450953
1260987688854982658
1260987639785816076
1260987592268488704
1260987536668794886
1260987196552724480
1260987184934539264
1260987109059551232
1260987107536965632
1260986989651939331
1260986962959314944
1260986942977687553
1260986397504212994
1260986161394257922
1260985474107219972
1260985158938828801
1260984156705689606
1260984041840541697
1260983896478490626
1260983784075296773
1260983404176257025
1260983052030873600
1260982714251071489
1260982663944560648
1260982568498999296
1260982251887775749
1260981835632381952
1260981436233981954
1260980953952006146
1260980672744894464
1260980165284442113
1260979855941865480
1260979721971675137
1260979464395243521
1260979411769266179
1260979179253891072
1260979068868030464
1260979067320332289
1260979056998301696
1260978500489658368
1260978273439408129
1260977692008161283
1260977680004141060
1260977629466935296
1260975821919080450
1260975726565756930
1260975700015747074
1260975349686509570
1260975218824294401
1260975183969599488
1260974910270251010
1260974760101584896
1260974689809313794
1260974355405815811
1260974321624850432
1260974291174162434
1260974054770696194
1260973970251186183
1260973936021508107
1260973813677858818
1260973762910064640
1260973758480887808
1260973570823540737
1260973480058765313
1260973380884447232
1260973347170668545
1260973197492617219
1260973161140625416
1260973148872364032
1260972992953278464
1260972970538926080
1260972889169432576
1260972682419544066
1260972532066324481
1260972423882645507
1260972415825244160
1260972055878565889
1260971967634649091
1260971931127382016
1260971700751142915
1260971469120643073
1260971032925614080
1260970990709899265
1260970897248321537
1260970531693703174
1260970406959370240
1260970254236372993
1260969442839801858
1260968893637636096
1260968749601107970
1260968557283770370
1260968453470670851
1260968331097640965
1260967766384918530
1260967643093315584
1260967426356846592
1260967363383570434
1260967268038647808
1260967133816766464
1260967107866570755
1260966969702060033
1260966830761545729
1260966634153525256
1260966597365284867
1260966411448594432
1260965758663684096
1260965645363163136
1260965393478422529
1260965355272339459
1260965352738963459
1260965351040315392
1260965072060456967
1260964815369121793
1260964581775728641
1260964360463187969
1260964263100850177
1260963965041065984
1260963640158621696
1260963520415490054
1260963114855608320
1260963082836127747
1260962897972396038
1260962789398626305
1260962524821929985
1260962423982489600
1260961995190394880
1260961859437334530
1260961773898944512
1260961691304689665
1260961365826711553
1260961087350091776
1260960733073997838
1260960702556262401
1260960585342214144
1260960567092797441
1260960366978306048
1260959943387222017
1260959818082377734
1260959801124757504
1260959750726062080
1260959470760407043
1260959257081655296
1260958988193148932
1260958938381590530
1260958858257797127
1260958856059990018
1260958495983251456
1260958291670249473
1260958283717906432
1260958274456899586
1260958265757794305
1260958033322160133
1260957460132659203
1260956934175444992
1260956901744967682
1260956861098049536
1260956732370620416
1260956370876223494
1260956316824145920
1260956072912830465
1260955320077205505
1260955264292978690
1260955220084998145
1260954995987546114
1260954787144781824
1260954771348959233
1260954659809890306
1260954545884200960
1260953926419038210
1260953889433624578
1260953674144153602
1260953600156631041
1260953441960108033
1260953099746844680
1260952210206330882
1260952199187828736
1260952035102425091
1260951828365299717
1260951595442978816
1260951581387821057
1260951440551555072
1260951391809556481
1260951202893873152
1260951085646217220
1260951068986441728
1260950910710276101
1260950807832342529
1260950800060354561
1260950778849755138
1260950523324370945
1260950509847842816
1260950508275003394
1260950507092242433
1260950309972643840
1260950208856416258
1260949797730648069
1260949732526096385
1260949649432686596
1260949399972261894
1260949210070999041
1260949045637513216
1260948999822950400
1260948995767103491
1260948776396689408
1260948656217305090
1260948440512638977
1260948330135289857
1260948197574402049
1260947815389372416
1260947684531331072
1260947437277130759
1260947157084971008
1260946712044109825
1260946546729705472
1260946251971022851
1260946115584765957
1260945840224509952
1260945831881998336
1260944588212224000
1260944466589954054
1260944225811783685
1260943868629000193
1260943850304155649
1260943561555611648
1260943172034637827
1260942280904658948
1260942210532589568
1260942096560787458
1260942069423620096
1260941909431930880
1260941661833760768
1260941062773911561
1260941002241703936
1260940848541335552
1260940611538034690
1260940299750330369
1260940132850569217
1260939989849985025
1260939879137120258
1260939864448606208
1260939588035633152
1260939385777926146
1260939068826947585
1260938851083747329
1260938539912609794
1260938136114225157
1260938121962754048
1260937888809676807
1260937512316329984
1260936883464310784
1260936687364059138
1260936295318261760
1260936194377920514
1260936192255614978
1260935273761787905
1260935177771106304
1260935029653266436
1260934900787511297
1260934592782950405
1260934016410083329
1260933574988976131
1260933395514683398
1260933393539149828
1260933367492567040
1260933183484256257
1260933183337459713
1260933132259192832
1260932436378058754
1260931768099549184
1260931746863841283
1260931603997396993
1260931564893908997
1260931520606334981
1260931304264097792
1260931136126988289
1260930990446268420
1260930967960780800
1260930697281155073
1260930621569773568
1260930513533112320
1260930233584111624
1260930202714075140
1260930196116590592
1260930151174434816
1260930072090832897
1260929893799354375
1260929531440840705
1260929375697920004
1260929268298608642
1260929185876336644
1260928627954221056
1260928618273730561
1260928505979662336
1260928124583202820
1260928044765593615
1260928030458802176
1260927688904183810
1260927614648111111
1260927481659318278
1260927433403805698
1260927427695407106
1260926934478843906
1260926906746040321
1260926677623934976
1260926298949468160
1260925884367659008
1260925821797011462
1260925565562912769
1260925394594803714
1260925347568156672
1260924949495271424
1260924872491847689
1260924708381319169
1260924510913597440
1260924213214564352
1260923864592207872
1260923625957281793
1260923470872887296
1260923017959559168
1260922482569199616
1260921721340727299
1260920938775736325
1260920937769127936
1260920935567126528
1260920934250057729
1260920818630000647
1260920523682385921
1260920437061685250
1260919970902482946
1260919773380083714
1260919687975768070
1260919048218578944
1260918915322044421
1260918685574795272
1260918441806106625
1260918231864422401
1260917936929284096
1260917654572994561
1260917614475456512
1260917213596434432
1260917213260849152
1260917107522514948
1260916911233171456
1260916754550796289
1260916734472736768
1260916614272356353
1260916405316263937
1260916389583478786
1260916312592785408
1260916092278628353
1260915771049418752
1260915723859361792
1260915545542725635
1260915318731542528
1260915281305706496
1260915267137347585
1260915222325362690
1260915114670161920
1260914930607362049
1260914733668077574
1260914484329304066
1260914216736874496
1260914212920057857
1260914212337057792
1260913997177597953
1260913906190635009
1260913711730081795
1260913516430667777
1260913287644033029
1260913224200962048
1260913177035931650
1260913055073959936
1260913011482603521
1260912909506482178
1260912786655371265
1260912613900328962
1260912479791652870
1260911937078034433
1260911920816717824
1260911837715070977
1260911826591768576
1260911815380402176
1260911602423017472
1260911493907972096
1260911481455026177
1260911433983889409
1260911390925209600
1260911377339817984
1260911239942856704
1260911215481585665
1260911207449591809
1260910907212861440
1260910890146238464
1260910864770707458
1260910817744125953
1260910784407900166
1260910275903066113
1260910102565064704
1260910095212392448
1260909939515707392
1260908874040782848
1260908777261412353
1260908494724698112
1260908483492233217
1260908413917245443
1260908217950969856
1260908138724802560
1260908039139442689
1260907936014118913
1260907908071596032
1260907681138835456
1260907381770379264
1260907165914746880
1260907094431141888
1260906888734089218
1260906826708799488
1260906712200077313
1260906676443656192
1260906646701846534
1260906365851242497
1260906226856099846
1260906083633201152
1260905482195283968
1260904895122739200
1260904861832544256
1260904735449780224
1260904663139995650
1260904565748236288
1260904463541436421
1260904411947323394
1260904348676247553
1260904208330522625
1260904186914508800
1260904145403490305
1260903739478679552
1260903724215668736
1260903676174053381
1260903481700945922
1260903308316811270
1260903060366217217
1260903054527942656
1260902911510446080
1260902884734119936
1260902809538609152
1260902600888782850
1260902393534910464
1260902303957213184
1260902140807086080
1260902082518925313
1260902027967807488
1260901825944969216
1260901824783167488
1260901691194556417
1260901544347799554
1260901180265443329
1260900868423065603
1260900726231924736
1260900473097371648
1260900303416758275
1260900242318385153
1260898660361043968
1260898281347059713
1260898032255672321
1260897718651805699
1260897210541191168
1260896767563960322
1260896600362278913
1260896575221612544
1260896314256220161
1260896230630096897
1260896110727610370
1260895885141082114
1260895393568546817
1260894734475841536
1260894430376181760
1260893459478650881
1260893281296232449
1260893225650397184
1260893001771110400
1260892641023217664
1260892612447350786
1260892497020149760
1260892172620095489
1260891819161849858
1260891817094066177
1260891518086373377
1260891237961400321
1260891124367056897
1260891023326273541
1260890694815756288
1260890524447395840
1260890483863236608
1260890419421941761
1260890350987739136
1260889877698228225
1260888968092102656
1260888963365179393
1260888799313367042
1260888721886457857
1260888646418419713
1260888188060565509
1260888135069728768
1260888087170818049
1260887910812913665
1260887842051493891
1260887812028739584
1260887671519481859
1260887521245958150
1260886510557167616
1260886242704711681
1260886225847832576
1260886162895523841
1260885931332194304
1260885921882419206
1260885475042250752
1260885433627656198
1260885297040162816
1260885072682590210
1260885007935180800
1260884941958717440
1260884879945981953
1260884728862912512
1260884692909293568
1260884648831397888
1260884217627660289
1260884011553087490
1260883676981854208
1260883632090202112
1260883558111096832
1260883478796808195
1260883344025366528
1260883290296389632
1260882546692444161
1260882423849639936
1260882398759333890
1260882297567535104
1260882180831674369
1260881863113129984
1260881760457547776
1260881532341927937
1260881230817644544
1260881191609217024
1260880956388491266
1260880785646682112
1260880546835677187
1260880418527678464
1260880402169966594
1260880359589322753
1260880083864215555
1260880066592018434
1260879799825788929
1260879796008935424
1260879788094271489
1260879738261905408
1260879609475850241
1260879548993994753
1260879412817518592
1260879324087037953
1260879114350854144
1260878840257265664
1260878353646616577
1260878214345510912
1260878189972332544
1260878024506933248
1260878023441608704
1260877387107110914
1260877374046064640
1260876974249181184
1260876831718363137
1260876618844823552
1260876339906740224
1260876270306353153
1260876268783845376
1260876266925813760
1260876265956884483
1260876264753098752
1260876087577513985
1260875940273553408
1260875770483916800
1260875663042580480
1260875535892262912
1260875129837572096
1260875118311616512
1260875033242742789
1260874881538932736
1260874805890424832
1260874567842750470
1260874507507560449
1260874431125127171
1260874074009583622
1260874020557389831
1260873824033275904
1260873646572265472
1260873332137889794
1260873137518006273
1260872944605114369
1260872749318393856
1260872716963459072
1260872467972751360
1260872307784003588
1260871944607424513
1260871931299061760
1260871595800788992
1260871489743659008
1260871215503290369
1260871051682209792
1260870966730768385
1260870898334289920
1260870826670411776
1260870489632882688
1260870053957906432
1260870037830803457
1260869809337704449
1260869525924438017
1260869425575669760
1260868694110081025
1260868341348122624
1260868184044965888
1260868087550787584
1260866996700397568
1260866329407639553
1260866151925547008
1260865402244083712
1260865205103480832
1260865131354959872
1260865102653292544
1260864975574368256
1260864722552799233
1260864075854118913
1260863892542062593
1260863886825226240
1260863711402737664
1260863644646223874
1260863388990803969
1260862714164936704
1260862703394000896
1260862536511086593
1260862488624668672
1260862351601029121
1260862245472534528
1260862203202285568
1260862157517922306
1260862071299805184
1260862055264980993
1260861998683885568
1260861866626224128
1260861090130468870
1260861058211815425
1260861054101356544
1260860850828718080
1260860814329774081
1260860698655166466
1260860647509831682
1260860350896971776
1260860258035138560
1260860256915259392
1260860249545859073
1260860118930870274
1260859907282255872
1260859636179230720
1260859587357442049
1260859437411192838
1260859404964040704
1260859402464243712
1260859368880422912
1260859222046236672
1260858822010290178
1260858411203190784
1260858400021245959
1260858398012129282
1260858396665757696
1260858239199174657
1260858223718010880
1260857596518567937
1260857589304307713
1260857587064541187
1260857555124920321
1260857387508019200
1260857268658192385
1260857181387325441
1260856879309361153
1260856705207894016
1260856231608147974
1260855721949888512
1260855551870865408
1260855520451268608
1260855468563496962
1260855249302061056
1260855178745524224
1260854383807520768
1260854123622211584
1260854063438147585
1260854031460818944
1260853392177577985
1260853294580346880
1260853107384365057
1260852535440670721
1260851640514510849
1260851497585315842
1260850904640753666
1260850429660934144
1260849745968467969
1260849615634608138
1260849375384875010
1260848890699558912
1260848679767830528
1260848478596534272
1260848401173880832
1260848114174492673
1260847988185980928
1260847660652793857
1260847533435375618
1260847309635665921
1260846478689472512
1260845327126597632
1260845087417937920
1260845047978786818
1260844940680138752
1260844896291782658
1260844654922268677
1260844322414628864
1260844286423302144
1260843610163023872
1260843310379405312
1260842888033959936
1260842788654104576
1260842751257649152
1260841921368535040
1260841678027571200
1260841371067392000
1260841179735896067
1260840935602208768
1260840377956937729
1260840252161302528
1260840173388083201
1260840132749426688
1260839338599989248
1260839108722806784
1260838936261341187
1260838597973983232
1260838030228828161
1260837221088792576
1260837001131065344
1260836976732901376
1260835568302211072
1260835385191645184
1260834612068200449
1260834602521899008
1260834404110422017
1260833955642855424
1260833898315030529
1260833877079269376
1260833595083685889
1260833509146533888
1260833313046102017
1260833225573892101
1260833139473231872
1260833084527783939
1260832919985311744
1260832835432329217
1260832483475587072
1260832290978004993
1260831755000524800
1260831690525683712
1260831281392336897
1260831209992716288
1260830775341125633
1260830644743086080
1260830568788484096
1260830129544146946
1260829929144451074
1260829113457180674
1260829083119820800
1260828827816734720
1260828539307335680
1260828364392337409
1260828313473429504
1260828187430465536
1260828170745503745
1260828163569070081
1260827772286574593
1260827298493849600
1260826529958854657
1260826407497805825
1260826276820135937
1260826241608843264
1260825926486634496
1260825903791329280
1260825790561890304
1260825155695267840
1260825063881916417
1260824997867782144
1260824872030257153
1260824797040250880
1260824782205005824
1260824690861527040
1260824564231266306
1260824394181627907
1260824247057780736
1260824219501330433
1260824097489068032
1260824069647355907
1260823919591927814
1260823804521177089
1260823723793317891
1260823677320466434
1260823639307571201
1260823430812913664
1260823405798084614
1260823371996114944
1260823032328749059
1260822953278803968
1260822820109590529
1260822762899361793
1260822710785060864
1260822532502040576
1260822417309667330
1260821949170753538
1260821929503621121
1260821894011465731
1260821863111983104
1260821821462585344
1260821731163484160
1260821030936948751
1260820600022618113
1260820008134938626
1260819698431729666
1260819376728571911
1260818512098066432
1260818503545782273
1260818161974284291
1260817949922856962
1260817932382281733
1260817321142206464
1260817207392641025
1260817178682630144
1260816610480308225
1260815021002678277
1260813610248482816
1260813328793980929
1260813307419770881
1260813241606967296
1260812265487507456
1260811395274280960
1260811264734957569
1260811181687742465
1260810886064812032
1260810754971832320
1260809945924210688
1260808571035541506
1260808553335525376
1260808463220912133
1260807874395148290
1260807793126322176
1260807689468248066
1260807192271360000
1260806072723476481
1260805429682221057
1260805149720743937
1260804594600468480
1260804523481796608
1260804040377630720
1260803568237522951
1260803428885938177
1260801212737359875
1260800381149380608
1260800375415767044
1260800231261773825
1260800071794294786
1260799003479781377
1260798374149750784
1260798312992645121
1260798289391357952
1260798133577138176
1260797552276000768
1260797356557074433
1260796624563048448
1260796415267274758
1260796372950884352
1260795989591379970
1260795375671218176
1260794448193048577
1260793952116125696
1260793502306390017
1260792717023629313
1260791190187802624
1260788474959073280
1260784486582714368
1260784338989391872
1260783828022505472
1260782725906214913
1260782334816800769
1260782171024916480
1260781728156745731
1260780901165916161
1260776990048567298
1260776542143201280
1260776449159593990
1260776187099582464
1260770902427365376
1260765590081372169
1260764788616916992
1260762011044020225
1260756059439935489
1260755252665626624
1260755136076550144
1260749344682246146
1260744609883467777
1260744460557856770
1260744381612654592
1260743124130955264
1260741836978692097
1260741776274599939
1260738966728261632
1260736714475212802
1260735733444358144
1260735339414642689
1260734190842249222
1260734138556059648
1260731996063629314
1260730776951414793
1260730618222194690
1260729248006000643
1260728840655187968
1260726881432866817
1260725428702064640
1260724927801569280
1260724846146789377
1260724611853025281
1260723869461164032
1260723758836387840
1260722855991488520
1260722507671273474
1260721959018643456