1111054618392440832
1111054287570898944
1111054026303590400
1111051976568115202
1111051327344394241
1111050619970879488
1111049855584079874
1111049519184203777
1111048744462618624
1111048588497440773
1111047752870432769
1111046384122236928
1111045685288280064
1111044504239386624
1111044254774816768
1111043450525442048
1111043405096935424
1111043169922232324
1111043085591429120
1111042739121127429
1111042232205959169
1111042171380162566
1111041709394284549
1111041690993917960
1111040630728339457
1111040314612035585
1111040300015935488
1111040159926140928
1111039975838138368
1111039549759733760
1111039491257651200
1111039374567841794
1111039269290864640
1111039182858792961
1111039060301283334
1111038886149586949
1111038791375036421
1111038757086654465
1111038581416570880
1111038293863477249
1111038228214231040
1111037843323932672
1111037771895001089
1111037763699138560
1111037759827951620
1111037695072051203
1111036940172689408
1111036729564241920
1111036353838485504
1111036316811255809
1111036091128266756
1111035520879071237
1111034302844813316
1111034292627492864
1111034257286356999
1111033774471557120
1111033767953604609
1111033189001252864
1111032981378998273
1111032767318540288
1111032742647660545
1111032341915467777
1111032257802833920
1111032038524706816
1111031486214475776
1111031326226956295
1111031237295173634
1111030722545045504
1111030574624448512
1111030306184876032
1111030225041797123
1111029844198985734
1111029703891173377
1111029104776749056
1111028968755470336
1111028826707030017
1111028587061305349
1111028389387747328
1111027005812813824
1111026973185323009
1111026479075418112
1111026167975477248
1111026111297789953
1111025996201906176
1111024840138461185
1111023926568718338
1111023683898875906
1111023279718854656
1111023244927217666
1111023112672473089
1111021945359921152
1111021819216216064
1111021796801871877
1111021607735181312
1111021321868197888
1111020984910442497
1111020921614200832
1111020831767973888
1111020564154585089
1111020557808664577
1111020363729854464
1111019969431650305
1111019944622415872
1111019404077215752
1111018991101845506
1111018854350815242
1111018820913848320
1111018615787147269
1111018599253266432
1111018579355414531
1111018541510258688
1111017914365329414
1111017910426845189
1111017899261657088
1111017503529025536
1111017391792812033
1111017360876584960
1111016542186156033
1111016450410639360
1111016449097768960
1111016328511606784
1111016031479386119
1111015873060487175
1111015816374431745
1111015693435260928
1111015524698337280
1111015135001362434
1111014664605978624
1111014541721255936
1111014474931159040
1111014178075086848
1111014040430669824
1111013897912360960
1111013892866666496
1111013885866237952
1111013814529679360
1111013444025753600
1111013166438408195
1111013086025183234
1111011986215784448
1111011853369573376
1111011807374819329
1111011732225433600
1111011559093010432
1111011359762927618
1111011236269957120
1111011087107977216
1111011003653898242
1111010874989383682
1111010560425054217
1111010299501572096
1111010099500322821
1111009929891061763
1111009597630889984
1111009563992641541
1111009477694799872
1111009333809217537
1111009132121858048
1111009032029044746
1111008897857437696
1111008783323533313
1111008668143837185
1111008659621011456
1111008576619900929
1111008466532007936
1111008304367570945
1111008258259632128
1111008140257038338
1111008061790060545
1111007989136281601
1111007932857176064
1111007916239265792
1111007841069027328
1111007562114183168
1111007327790993408
1111006836545781760
1111006823807700993
1111006791729598464
1111006619578650626
1111006427106209794
1111006175536001027
1111005781120466946
1111005666506870785
1111005507597275136
1111005362755387392
1111005298083463169
1111005255104450560
1111005240655052806
1111005186368118786
1111005114523897858
1111004967505182720
1111004962077765633
1111004880842473476
1111004769181712386
1111004450896908291
1111004111997190144
1111004054715621381
1111003999237480448
1111003976571469824
1111003897550786561
1111003627127300097
1111003468687437824
1111003260905771010
1111003214567165953
1111003188801474560
1111002990297735168
1111002845422280704
1111002807094689793
1111002729940467721
1111002718146056192
1111002695933063168
1111002435374510082
1111002388243066882
1111002378663284739
1111002338804813824
1111002285511979013
1111002051536924672
1111001836226523136
1111001740164456449
1111001693980971008
1111001614905720832
1111001426476568576
1111001388618792962
1111001207227760641
1111000964763406338
1111000944706285568
1111000860811771905
1111000783468650496
1111000776921567237
1111000680704196608
1111000642208911360
1111000294454894595
1111000151416557576
1111000140473688065
1110999976845422593
1110999971875164160
1110999933925183488
1110999758120849410
1110999614323376131
1110999456940478464
1110999221178646528
1110999215256322048
1110999169383219200
1110999122235064320
1110998398147149824
1110997820289531910
1110997561651929089
1110997378276958208
1110997074919723008
1110996917511774210
1110996776356593665
1110996560362512391
1110996447829331968
1110996445883183105
1110996415340335105
1110996317243932672
1110995747619696642
1110995281942925313
1110994429593178113
1110994165503012866
1110994132749697024
1110994111782416385
1110994065858924544
1110993941569171457
1110993882651770880
1110993735125516288
1110993724241260544
1110993647858790401
1110993423924973568
1110993314705297414
1110993141648318464
1110993122673258499
1110993114116825089
1110993029404479488
1110993008382611458
1110993002590359552
1110992903000727552
1110992781718241281
1110992635555180544
1110992585991041027
1110992350292123650
1110992340867522560
1110992136512503808
1110992047312392194
1110992043856351233
1110991856542908416
1110991491009269760
1110991355814256641
1110991258837794816
1110990947951755264
1110990846860517376
1110990670813114369
1110990514629869570
1110990252708188160
1110989995882569728
1110989901376442368
1110989690411339781
1110989683754967040
1110989676406628360
1110989544118194183
1110989378585800704
1110989281265360901
1110988880382185472
1110988437753155591
1110988413593899008
1110988213559193601
1110988212338651136
1110988069241569280
1110988041806667778
1110987739950956544
1110987251574603776
1110987095827460096
1110986730826547201
1110986443936223237
1110986282509963267
1110986135755460608
1110985597269753856
1110985322870001674
1110984948092203009
1110984916722950145
1110984878630363136
1110984645733163009
1110984509783244801
1110984435309125633
1110984351595020288
1110984098057764864
1110984084380098560
1110984024862965760
1110984008811364360
1110983736554938370
1110983436645343234
1110983362334916608
1110983319737561088
1110983316436643840
1110983139839692800
1110983118108925952
1110983034143154186
1110982779515359232
1110982667875639298
1110982499944017920
1110982489693143043
1110982452632272902
1110982420675870720
1110982322520817664
1110982305168928773
1110982299233984513
1110981854004420608
1110981428655853573
1110981300385509376
1110980758276112385
1110980704593235969
1110980417744707589
1110980051053494272
1110979866348998662
1110979180072714244
1110978906696441856
1110978827616956416
1110978643566739458
1110978628119085062
1110977767351439360
1110977565181788161
1110977468263997440
1110977359853817863
1110977164810297345
1110977064067321856
1110977039564263424
1110977034698805253
1110976967292137473
1110976832814366721
1110976814892093440
1110976661539962880
1110976457696821248
1110976335634227200
1110976144684318720
1110976069107179520
1110975824730165248
1110975294264037376
1110975275230220289
1110975163863044097
1110975052261064704
1110974668830396416
1110974655953801216
1110974538714632192
1110974264541409280
1110974149269295106
1110973921195671553
1110973865621102592
1110973833471766529
1110973661979250691
1110973578307166208
1110973450632548354
1110973354058698757
1110972453478633473
1110972163002167296
1110972127728074753
1110971688429277184
1110970110750220288
1110970033465901057
1110969648198098945
1110969480799244288
1110969115374694400
1110968976056770560
1110968953327763456
1110968932108853248
1110968232507260932
1110967951002341376
1110967889169956864
1110967854051049472
1110967620814147584
1110967597548429312
1110967455537684485
1110967423379886080
1110967142730600448
1110967058760650754
1110966987465912320
1110966972521635841
1110966953055784960
1110966915143528448
1110966765704671234
1110966217370533888
1110965960868007937
1110965934833963008
1110965898922344453
1110965246976557058
1110965105313939458
1110964874606268424
1110964500222611456
1110964214720577536
1110964105714810885
1110963996470009856
1110963705376837632
1110963481988218882
1110963329294577664
1110962901643350016
1110962649691508742
1110962622961250304
1110962444439117825
1110962275203117057
1110962273013633024
1110962271650545664
1110961884927328257
1110961791612436480
1110961600268324864
1110961535596355595
1110961382479024129
1110961289013153792
1110961200966365185
1110961142598455296
1110961140606140421
1110961112705572864
1110960902138986496
1110960772866338822
1110960688434954240
1110960604930560001
1110960320959430658
1110959906104975361
1110959772449325056
1110959318151688193
1110959049242275840
1110958835076878336
1110958593292013568
1110958321702453248
1110958139581566978
1110958124687654916
1110957913810657281
1110957829479895040
1110957722302861312
1110957698856742912
1110957550265081856
1110957414570954758
1110957288578314243
1110957285906567168
1110957229342146561
1110956409993289728
1110956359548321794
1110956184520015872
1110955995759550465
1110955842352939008
1110955687025229824
1110955404849221635
1110955253254500353
1110955048576667651
1110954913788502017
1110954796540928000
1110954635223814151
1110954461940383745
1110954374124224514
1110954192418627585
1110954155991027717
1110954091151273986
1110954008007581696
1110953892773273601
1110953784967090177
1110953409530732546
1110953388747960320
1110953353956245504
1110953178281971713
1110953051974782976
1110953043116376064
1110953033968562178
1110952967866408960
1110952721815953408
1110952687774982144
1110952637053177858
1110952571320127490
1110952538487078918
1110952519155572736
1110952372279394307
1110952298438713344
1110951993537953792
1110951836436049926
1110951803070398464
1110951352409210882
1110951086179999746
1110951039170170885
1110950768910188544
1110950766183886849
1110950566878998528
1110950261466558465
1110950185360867328
1110950165739905025
1110949468462026752
1110949436828598273
1110948974838669314
1110948955872022528
1110948861705682945
1110948683472928768
1110948164436152321
1110948106366013441
1110947701980577792
1110947346303586305
1110946846103486464
1110946768957726721
1110946695494418432
1110946563604529153
1110946551789170688
1110946309014515712
1110946247983226880
1110945656775020548
1110945627180056579
1110945217522401289
1110945182139191296
1110944863875407872
1110944782614970368
1110944727464062983
1110944467870248961
1110944453605445633
1110944279004921857
1110943780440547328
1110943677789208576
1110943253581447169
1110943231599169538
1110942899867451392
1110942706916835330
1110942704664543236
1110942563291271175
1110942442596036608
1110941809096691714
1110941628137648129
1110941551495127040
1110940925205901312
1110940908462239748
1110940672780091396
1110940561383587840
1110940559345102848
1110940434036080643
1110940198005886976
1110940153625919489
1110939801598001152
1110939438560002049
1110939420063080450
1110939201166561280
1110938585509883904
1110938283683524608
1110938204461518850
1110938066095616001
1110937644450660369
1110937562967953409
1110937541396627457
1110937433569402880
1110937339206008832
1110937288232579072
1110937245391994881
1110936971432640512
1110936606385545216
1110936357973774341
1110936147830673409
1110935778694037504
1110935616634716161
1110935555527921664
1110935227499769856
1110935208629542914
1110934496852000769
1110934322163470336
1110934042566893568
1110933993564844038
1110933942562111488
1110933812995862530
1110933592316805120
1110933512717299713
1110933408174219264
1110933227089346561
1110932972964855815
1110932665107181574
1110932483867058176
1110932261971640328
1110932250269544448
1110932196653699074
1110931997277515776
1110931968840089600
1110931866876628993
1110931849331830784
1110931748806975489
1110931700077551616
1110931614094290946
1110931600710225920
1110931346745102336
1110931155241656326
1110931084458496000
1110930977717739521
1110930827045670912
1110930523378065410
1110930474938101761
1110930268137930752
1110930258218360832
1110930204908838913
1110930188924346368
1110929698383495169
1110929195188846593
1110928923997687810
1110928873078902784
1110928186836217856
1110928109610639360
1110928101574406144
1110928064366694407
1110927845348593664
1110927384751075328
1110926639096045575
1110926468190818304
1110926034873012225
1110926021212205057
1110925432621289472
1110925300278484994
1110925232334929925
1110924956551073792
1110924820743622656
1110924071934533633
1110923727737442305
1110923422673104900
1110922772828643328
1110922729593716738
1110922726930305024
1110922521212272641
1110922114473910272
1110921964099645441
1110921620577751040
1110921292037918721
1110921234106195969
1110921209271734274
1110921197401849856
1110921186085605377
1110921127562539008
1110920991469907968
1110920477520871424
1110920306389118976
1110920195068055554
1110920083398901760
1110919957917941760
1110919737981186051
1110918834247090176
1110918575823429633
1110918191126102018
1110918188529844224
1110917969805275137
1110917929770672128
1110917910787170304
1110917748673134592
1110917696189812736
1110917542183424000
1110917479633698816
1110916917601189888
1110916785656811520
1110916234776850433
1110915916932530176
1110915602863009792
1110915526379876352
1110915296901107718
1110915076696039425
1110915065488855040
1110914898526199808
1110914897993523202
1110914556912644099
1110914526944337920
1110914465103515649
1110914232651001856
1110914058037788672
1110913448983097344
1110913229168017408
1110913077908828161
1110913063635566592
1110912796089298945
1110912663553560577
1110912505390485504
1110912191501385728
1110912104561889280
1110911986349551618
1110911985355501568
1110911956536438787
1110911841474097152
1110911677896278016
1110911441467527170
1110911021596770306
1110910971424301056
1110910872522838023
1110910689756045318
1110910500555157504
1110910366110883845
1110910358800216065
1110910192357724160
1110910003429494784
1110909734834581505
1110909521147412485
1110909382806654976
1110909320202461189
1110908932204187648
1110908721578807296
1110908095285379075
1110907721556115456
1110907420195340288
1110907289668595712
1110907073829789696
1110906915696099328
1110906882397478912
1110906709776703490
1110906341168742406
1110906031918497792
1110905736903737344
1110904072675184642
1110903736036216833
1110903525922521088
1110903479671943169
1110902758436159488
1110902135762370561
1110900813679992832
1110900598713581570
1110900587921592322
1110900533630586880
1110900474532773888
1110900471844220931
1110900320622784513
1110900182642814976
1110900170210844672
1110900002837155843
1110899908310114306
1110899653560668163
1110899238462992385
1110899232175722497
1110898994899832832
1110898738334232576
1110898573921710082
1110898496385748994
1110897565027966976
1110897370953330689
1110897248894926848
1110897174517374976
1110896780911222784
1110896298587246592
1110896088842731520
1110895987147620354
1110895767294750721
1110895239353589765
1110895154121097218
1110895036919623686
1110895002236997632
1110894921731330048
1110894561361047553
1110894388144594944
1110894228379455489
1110894202810970113
1110894143159627777
1110893700253696000
1110893631349669888
1110893379422961665
1110893332325167105
1110893094893961216
1110893054460874752
1110892963452854272
1110892129595912199
1110891888729575424
1110891857058430978
1110891727005601793
1110891614099202048
1110891570474217472
1110891409182212096
1110891382116417536
1110890836953350144
1110890758507319297
1110890751314018306
1110890518442065920
1110890331313225728
1110889956824834049
1110889945848336385
1110889749894647808
1110889652918108165
1110889624518492163
1110889409237401600
1110888951550758913
1110888603499069440
1110888455498813443
1110888436611932160
1110888236421971970
1110887825929617413
1110887600452263936
1110887153888911362
1110886979225436160
1110886946564435968
1110886831325921281
1110886824166285313
1110886597665406978
1110886503759208449
1110886187932229636
1110886006063009792
1110885778018758656
1110885688734564352
1110885534849777665
1110885349134348294
1110884944040157184
1110884703505141761
1110884411468320770
1110884247299076097
1110884140348555269
1110883974300254209
1110883914581708802
1110883900920864769
1110883895900364800
1110883633907281920
1110883528596750337
1110883460644831233
1110883320752148480
1110882853083119617
1110882786372665345
1110882766634315777
1110882459086921728
1110882083667394560
1110881922698432513
1110881264477896704
1110881261546102784
1110881097280311296
1110880710875889664
1110880642630385665
1110880509498982400
1110880015481298945
1110879936875761664
1110879758747947008
1110879653152071681
1110879449107611648
1110879395068215296
1110879195482210304
1110879062174642181
1110878881819578368
1110878567666237440
1110878431015768064
1110878395095793664
1110878379430039553
1110878359410696193
1110878235536048128
1110878178183180288
1110878083236679680
1110877931465854976
1110877857708994561
1110877602175221761
1110877454384680962
1110877371853426689
1110877276902707206
1110877228789829632
1110877026360152064
1110876903223771136
1110876874455031808
1110876769408688128
1110876716258476037
1110876521332441088
1110876501103251456
1110876361240051718
1110876272509489157
1110876026312245248
1110875999867232257
1110875960210087937
1110875682366779392
1110875661810520064
1110875487134535680
1110875257555038208
1110875156556201986
1110875114910961665
1110874940339830785
1110874891518205953
1110874874346721280
1110874756658667521
1110874701755281409
1110874655982870529
1110874593009508352
1110874514261463042
1110874395365515280
1110874355196669957
1110874187336478720
1110874065307357186
1110873869131440128
1110873661857247232
1110873655741956097
1110873644291555330
1110873570564018177
1110873533863862272
1110873520035282944
1110873321644675072
1110873151674695680
1110873115674988546
1110873053762912256
1110872606708822017
1110872451477590017
1110872369323798528
1110872344581541888
1110871923431485442
1110871795278716928
1110871745291042817
1110871518119104512
1110871383351967746
1110871253370302465
1110871104401354752
1110871019823214593
1110870991629107202
1110870960138321926
1110870819343867904
1110870778734620672
1110870758295769088
1110870720773582848
1110870531136540672
1110870509254856704
1110870319672315910
1110870305118085121
1110870095000190977
1110869926431129602
1110869887226994688
1110869848513482752
1110869829458845696
1110869746667474945
1110869739210002432
1110869287969980416
1110869218222850048
1110869082490966017
1110868996788756481
1110868969026736128
1110868945031102465
1110868774838812672
1110868566868484096
1110868051363356672
1110867854654664704
1110867581471211520
1110866930615894016
1110866822570696704
1110866780329820160
1110866517686669312
1110865998704455680
1110865870887288834
1110865624232796160
1110865577487273984
1110865528158068736
1110865358871842816
1110865268153241600
1110865097524736000
1110864942658478083
1110864215793983488
1110864027717197825
1110863969353383938
1110863940756692993
1110863707876278272
1110863355185713152
1110863072225357824
1110862995444432896
1110862943602782209
1110862822836183040
1110862792469430272
1110862617680269313
1110862546813284353
1110862497232363520
1110862191291437056
1110861976689885186
1110861736641466368
1110861642290606081
1110861640914923521
1110861614423654400
1110861587462742017
1110861201108418560
1110861191071571969
1110861185358929920
1110861138743517185
1110861088151797761
1110860655039598600
1110860638811840514
1110860507303628801
1110860465003888640
1110860368300007424
1110860085956362240
1110860031212154881
1110860021393489920
1110859888056565760
1110859827583033344
1110859799665745920
1110859761426276352
1110859528302673926
1110859401433354240
1110859356327825408
1110859186068439040
1110859171006763010
1110859135430602753
1110858932770226176
1110858880819609600
1110858801765335040
1110858594809974787
1110858550853681153
1110858527902453760
1110858299581390849
1110858288680366081
1110858257554436096
1110858040268521472
1110857923167744000
1110857837952073730
1110857698172649473
1110857440906698752
1110857345230352384
1110857198224269312
1110856978153263105
1110856972809711616
1110856908745912321
1110856669452558337
1110856459573755907
1110856446017785857
1110856104626528256
1110855938276241410
1110855633119727616
1110855142155436037
1110855048052047872
1110854977860321280
1110854808926412801
1110854777615855616
1110854515765530624
1110854490612269058
1110854392742379522
1110854025988194305
1110854023534571522
1110853831678717952
1110853425372237824
1110853365678919680
1110853252785098753
1110853240348921857
1110853048056844289
1110852664039010305
1110852189868752896
1110852148823277568
1110851722832945154
1110851620257124352
1110851611058991104
1110851176407404545
1110851119473938433
1110851097973919744
1110850715608444929
1110850677696274432
1110850385282039808
1110850359675797504
1110850267459788801
1110849893785108482
1110849495221366784
1110849007587348480
1110848997680472064
1110848908106915840
1110848638304075776
1110848364772540416
1110848154256269312
1110848068113625088
1110848050052980736
1110847853981765633
1110847810646261761
1110847784201146368
1110847734502821888
1110847370005229568
1110847328318119936
1110847315303165952
1110847062919266305
1110846784153309185
1110846714888491008
1110846693573099520
1110846614875394048
1110846542943006720
1110846199035318272
1110846045850869770
1110846042059296773
1110846038741536768
1110845863759360000
1110845680204107778
1110845451358662656
1110845346954006528
1110844968413945862
1110844795612729344
1110844753183236097
1110844663945142272
1110844572568047617
1110844529765216256
1110844417949224960
1110844295244931073
1110844161618518016
1110843941459578881
1110843901131280384
1110843736718757888
1110843567864463366
1110843549677961217
1110843244659834880
1110842549688811520
1110842399557935104
1110842356222300160
1110842347041050624
1110842285418315777
1110842274181730307
1110841717924741120
1110841694700929024
1110841592968024064
1110841570885099520
1110841440102477825
1110841312570413058
1110841259806076928
1110841123805843456
1110840647991414784
1110840554168991745
1110840500662272002
1110840422375526400
1110840220281376768
1110840008359981057
1110839902424498176
1110839736363569152
1110839421329387520
1110839400311730176
1110839202206359554
1110838768863457282
1110838676244828160
1110838439019188224
1110838386984656896
1110838330990739456
1110838017508495360
1110837944108109824
1110837891721322496
1110837890785964032
1110837766697435136
1110837484659707905
1110837453303238656
1110837247501352963
1110836802808700929
1110836728812748800
1110836609484771328
1110836547115466752
1110836524181004288
1110836214746304512
1110836154725732352
1110835895433875456
1110835780602261504
1110835176916111360
1110835144225632258
1110834894484185090
1110834814452682753
1110834753903697920
1110834747876483072
1110834303225790464
1110834183654555648
1110833976049102849
1110833757542645760
1110833540298670080
1110833356286115840
1110832907499814913
1110832768722919427
1110832293919236097
1110831997516214272
1110831740074057728
1110831230969368577
1110831177194262529
1110830922847395840
1110830848004231170
1110830833743654912
1110830446110298112
1110830267009286144
1110830227574476800
1110829967875719169
1110829895821811713
1110829882236432384
1110829258786643969
1110828892565241856
1110828870205407232
1110828868989005826
1110828641540341761
1110828462292512768
1110828252757676032
1110827959911440384
1110827880035090432
1110827780202291200
1110827695393386496
1110827661415337984
1110827619300401152
1110827290605355008
1110827205871980544
1110827110023815169
1110826971955716097
1110826746201493504
1110826604744396800
1110826511756603392
1110826366453329921
1110825765573136384
1110825717950930944
1110825717049290752
1110825702000156672
1110825120258576384
1110825079989063681
1110825051161575424
1110825029015621632
1110825025769271296
1110824996660826112
1110824970287022080
1110824862984093698
1110824786312286208
1110824782600253443
1110824502978666502
1110824270198947841
1110824162975723520
1110824128997740544
1110824089256714240
1110824031564058624
1110823968716537856
1110823861224960001
1110823806631923713
1110823798809526272
1110823528562114560
1110823266124472320
1110823136231153666
1110823108020236288
1110823006018912256
1110822917065998336
1110822703878074368
1110822552899862530
1110822291661832192
1110821977558786048
1110821948727136257
1110821511529750529
1110821360685715456
1110821253567389696
1110821185896529920
1110821061275381760
1110820935009853440
1110820775710330880
1110820607187402753
1110820464019025920
1110819694406234113
1110819531440697344
1110819313571778560
1110819313433350144
1110819061729017856
1110818857550258176
1110818805016657921
1110818510178058241
1110818492431953920
1110818481790963713
1110818140416552961
1110818120367816704
1110817973596499968
1110817898610810880
1110817454576541696
1110817388419825664
1110817180340367360
1110816998202707968
1110816926413000704
1110816840262004736
1110816714101530624
1110816419510452225
1110816368679632896
1110816247652995072
1110816210155986944
1110815796622692354
1110815729031540737
1110815445412659204
1110815273198800896
1110814535550750723
1110814457729638400
1110814440868466689
1110814370068684802
1110814312375947264
1110814251252441090
1110814078707134464
1110814050399727616
1110813781804941313
1110813644680560640
1110813217020960769
1110813178345205760
1110812850841374721
1110812517910102016
1110812060261208064
1110812019668725761
1110812008570601473
1110811629120380934
1110811627576791040
1110811508462833664
1110811102072524800
1110810847385976832
1110810546947936257
1110810278105620481
1110810072928710661
1110809563408859136
1110809345971888130
1110808967284957184
1110808885768712194
1110808724468322304
1110808633447727104
1110808630939582465
1110808627215040512
1110807621819351040
1110807183481102337
1110807093597167617
1110807049280065536
1110806718458548224
1110806523058577408
1110805947126112256
1110805836635488256
1110805792050036737
1110805403426869249
1110805205468266497
1110804626973093888
1110804270142668800
1110804247086579712
1110804221241249792
1110803688115838976
1110803291288621056
1110802495146733570
1110802447784689664
1110802252195942401
1110801658152407040
1110801657003196416
1110801549238915072
1110801464384020480
1110801438719000576
1110801090176565250
1110800883158319104
1110800719114891267
1110800384388419586
1110800381603401728
1110800375706198016
1110799995463036928
1110799886063226880
1110799844568940545
1110799532688883713
1110799101187317761
1110799018840477697
1110798914716864514
1110798913014063104
1110798909809545216
1110798896836546560
1110798853782077440
1110798374897360898
1110798000543203328
1110797557041643520
1110797180888121344
1110797107328245761
1110796945491193856
1110796929615695874
1110796858551689216
1110796728427532288
1110796297634762752
1110795805861052416
1110795391233085441
1110795357091438592
1110795271791890432
1110795002404372480
1110794925157818368
1110794910238736385
1110794518465601538
1110793608175804419
1110793596926595076
1110793500897865728
1110791779241115648
1110791724417384448
1110791412390526976
1110791372926259202
1110790735421493249
1110790552147107841
1110790417384116224
1110790368772190208
1110790128417554432
1110790119806636033
1110790070024523776
1110790021978771456
1110789997911789568
1110789867540238337
1110789716901879808
1110788797971734528
1110788701309812736
1110788556048556032
1110788187792777216
1110788021534756864
1110787981835751424
1110787930300301312
1110787589244620800
1110787587881517056
1110787562388553728
1110787329042587648
1110786985390678016
1110786912946716672
1110786205879361537
1110785910533181440
1110785704324464641
1110785041221599237
1110784876096225280
1110784585435107328
1110784235735076866
1110783848177111041
1110783790887198720
1110783408714776577
1110783338749530112
1110782176646365184
1110781820709199873
1110781351941144577
1110780845655236608
1110780551621947392
1110779872295747585
1110779613498798080
1110779425887526917
1110778959095050240
1110778931270041600
1110778752131305472
1110778733156274178
1110777951824551936
1110777238549606401
1110777097499353088
1110776967408902144
1110776499676893186
1110776299247656960
1110776221447737344
1110775950575321088
1110775925313097728
1110775841355714560
1110774881376002048
1110774443297697792
1110773913150255105
1110773858490109952
1110773773412769792
1110773771579940864
1110772644079693824
1110772460566339584
1110772310020145152
1110772282056732672
1110772141434253312
1110772024467746816
1110771930532069377
1110771865281282048
1110771827683540993
1110771763825254400
1110771688768237569
1110771494542548993
1110771406265036800
1110771057600970752
1110770826230595584
1110770565013491712
1110770527742976000
1110770370179678209
1110769977777364992
1110769849381335042
1110769529511129089
1110768833114058753
1110768755821424641
1110765449527128064
1110765219196760064
1110764445603639297
1110764402163118080
1110764296974172161
1110763831603679232
1110763026439987200
1110759463827447809
1110758582566469633
1110758100603150342
1110755923541323776
1110754594731237377
1110754412669083648
1110753286280359936
1110750726211424256
1110748505272995841
1110746523443310593
1110746480086798336
1110741764888059904
1110716081998565376
1110715002330247169
1110713388911546368
1110707348933353472
1110703409303375872
1110702716899213312
1110701854432903169
1110700404323557382
1110699720194867200
1110698673904582656
1110698465775046657
1110697932985118720
1110697446269698049
1110696792771969024
1110696310137602048
1110696218689101824
1110696056772268032
1110695719646756864
1110695184474476544
1110693322778181632
1110693025611575296
1110692926718386176