1105981014462136320
1105980886342881280
1105980343839019011
1105978997077356551
1105978995747799045
1105977368894717953
1105976906019758081
1105976135882559488
1105975546792546306
1105975100770304003
1105974429635489792
1105974077964124165
1105974005394300928
1105973892353572864
1105973799105822721
1105972574331289600
1105972112827793409
1105971844149055488
1105971082585145347
1105968939882954752
1105968895712743424
1105968762010910720
1105968667391655937
1105968599930421249
1105967598632615938
1105965241303818242
1105965141944877056
1105964706706145281
1105964313481760771
1105964267654791169
1105964086859304961
1105963953677574145
1105963824325316608
1105963795552317440
1105963255481204741
1105962837766275072
1105960798155870209
1105960736390594568
1105960113192480772
1105959336323543041
1105959286910476289
1105959119146676224
1105959094052114435
1105958559521652740
1105957725970796544
1105957622224748545
1105957427105751045
1105957230510256128
1105957138818576385
1105956512122445824
1105955965487194113
1105955550360207363
1105955465819770880
1105955348240842759
1105955177184612353
1105955025010995200
1105954862100025344
1105954607715487745
1105954607421943818
1105954334267846657
1105953826287378434
1105953495784587266
1105953192687357952
1105953192116920322
1105952916932833280
1105952903670439937
1105952404317585410
1105951646146793473
1105951019693944834
1105950936319647745
1105950902685446146
1105950582152540160
1105950003988758530
1105949659514712066
1105949635749785600
1105949235986526210
1105948916225396736
1105948828547588098
1105948491724046339
1105948484446883843
1105948319866601474
1105947844333240323
1105947558336233472
1105946735304761346
1105946510057979907
1105946470883172359
1105946441644679168
1105946043265572867
1105946013620162566
1105945912331902977
1105945812813729792
1105945754735132673
1105945442716696576
1105945227112710144
1105945113627422720
1105945094954328064
1105944241249898499
1105944001683824640
1105943879428292608
1105943477014183937
1105943078953762817
1105942469894643712
1105942403595337731
1105942306635567110
1105942262465343488
1105942014217068550
1105941979328843776
1105941833522270208
1105941754904281088
1105941684242866176
1105941350078472193
1105941277793812483
1105940997001883649
1105940791103508481
1105940754365640704
1105940730361593858
1105940652955758592
1105940554444083202
1105940312986398721
1105940238357139456
1105939969930088455
1105939766711853057
1105939669940867073
1105939458426327040
1105939358375444481
1105939273612709889
1105939235834601472
1105939138740736000
1105938517702729728
1105938442247118848
1105938399062618115
1105938260499595271
1105938178215735306
1105938025404686336
1105937943556997127
1105937833741701120
1105937184576679940
1105937010974433280
1105936263117504514
1105936261406212098
1105936090077282304
1105935413523476481
1105935394347065345
1105935269889564673
1105934809275224065
1105934593671217152
1105934576529096706
1105934436904906752
1105934406278176770
1105933690595627008
1105933451679748099
1105933187912531969
1105932850430427137
1105932520087056384
1105932446586077184
1105932433071968256
1105932395654643714
1105932265006211075
1105932252410798081
1105932222765453313
1105932023036870659
1105931764978069504
1105931265277157376
1105931122809204736
1105930823960809473
1105930052829675523
1105930010219737088
1105929660377034753
1105929423172321281
1105928706982375424
1105928294074064896
1105928263258509315
1105928005837312001
1105927825834545155
1105927450834468864
1105927449693556746
1105927373973848065
1105927144142716928
1105927053394751490
1105926881940045824
1105926806526406668
1105926763727777792
1105926758971441158
1105926550900355072
1105926155406848002
1105925813856292865
1105925734730735623
1105925722223362051
1105925521358106624
1105925480350269440
1105924515069153288
1105924284260761601
1105924197807730688
1105924122708795393
1105923696957493249
1105923515700731905
1105922597416517632
1105922585945088002
1105922567054020621
1105922241844383746
1105922082490200065
1105921951737020416
1105921687302868993
1105921496340418560
1105920965219885059
1105920753327898624
1105920342550372354
1105920086446084097
1105919980929986560
1105919772833861632
1105919506164187138
1105918548923375618
1105918488537907200
1105918199261028353
1105917385234616321
1105917105726201860
1105916945050800128
1105916374256365570
1105915964393250819
1105915632229470208
1105915281401090049
1105915089293590529
1105914995630583808
1105914957001121792
1105914822229520384
1105914182350880772
1105914162356588544
1105913588512886785
1105913558192275456
1105913308660535296
1105912251410718721
1105912195634921472
1105911963719254017
1105911493395128321
1105910781172957189
1105910705197383683
1105910660016283649
1105910617641226240
1105910241634312192
1105909418770812929
1105908911511650304
1105908706238259200
1105908019475476481
1105907678814060544
1105907630004940800
1105907503714521088
1105907501814431744
1105907314513637381
1105907302392041472
1105907237963382785
1105907164449828865
1105907088931409921
1105907041657331712
1105906683593797639
1105906331456864257
1105905918707933185
1105905570513674242
1105905465865715713
1105905296013230080
1105904505617612800
1105904150628519936
1105903741004382209
1105903565355315200
1105902943302230017
1105902881692176390
1105902810804170752
1105902573150715904
1105902487645679616
1105902008345808897
1105901597807296512
1105901549153333248
1105901078594420740
1105900520902934529
1105900122238521344
1105899815802728449
1105899027160334337
1105898875938840577
1105898736658665473
1105898622263181312
1105898440280735746
1105898416067014656
1105898323330957314
1105897423598223361
1105896351408312321
1105895201602707456
1105895110741540865
1105895011667902465
1105894629537443846
1105894384959135748
1105894235750969344
1105893468331802624
1105892634680274944
1105892529067773953
1105892325132328960
1105892253132832769
1105891375307018241
1105890218505318401
1105889256453611520
1105889223587102725
1105889193019011073
1105889002509516800
1105888967914934272
1105888712607653888
1105888310772289537
1105888219537854470
1105887925592559625
1105887587145842693
1105887069312860161
1105887016770830339
1105886905525325832
1105886728269807616
1105886257593438208
1105885913710768128
1105885650644017153
1105885411438718977
1105885123654881282
1105885121561935873
1105884360899788801
1105884194457223170
1105882036001275908
1105880409559179264
1105880246136508419
1105880221411172353
1105879577153466368
1105879572082581504
1105879485222739970
1105879399910510592
1105879200446234626
1105879145828048896
1105879139284852738
1105879063321817090
1105878689617797120
1105877968704991234
1105877949708947456
1105876640515674112
1105876356624080896
1105875684411539457
1105875554740391939
1105875277572263941
1105875116045549570
1105874987032985603
1105874847832436741
1105874437532987393
1105874258423672833
1105873176146382850
1105871863320928262
1105871849651609601
1105871846594019330
1105871680516308992
1105870610096418817
1105870212774141954
1105869295521841153
1105868511925153794
1105868194789638145
1105867116199247872
1105866192160460801
1105866175978921984
1105866118479138816
1105866114733690887
1105864993449361408
1105864792793931776
1105864453487280129
1105864102063325184
1105863714039873536
1105863640882860033
1105863568099037184
1105863344525885440
1105863048303181826
1105863037729366016
1105862940069109760
1105862924202098688
1105862789791404032
1105862757939904514
1105862608685596672
1105862566813810689
1105862196347707395
1105861964113330177
1105861691601047552
1105861462134870016
1105860965927739398
1105860346420625408
1105859751013949442
1105859560756178945
1105859557836972033
1105859463230226432
1105859275509940226
1105859049780899841
1105858850274578433
1105858809485033472
1105858537559900161
1105858530622488579
1105858448481239040
1105857920552579074
1105857849010339840
1105857455605583874
1105857072208457728
1105856992600604672
1105856876326068224
1105856362750377984
1105855875955208192
1105855417891123200
1105855263964348418
1105855237917679616
1105855031046275073
1105854268832137217
1105854267112472576
1105854174238072832
1105854130202050560
1105853757273923584
1105853330742493184
1105853108842909697
1105853063628247045
1105852477105205248
1105852090260307969
1105850800050524161
1105850590704427008
1105849787629428736
1105849414076321792
1105848700948135936
1105848669109145606
1105848531762507777
1105847902931439616
1105847242873884672
1105846752635248651
1105846669650870272
1105845912654405632
1105845432998158341
1105845123819040769
1105845070056570880
1105845041392689158
1105844783086485505
1105844746705088512
1105844071703236608
1105844026639552513
1105843345954349057
1105842482674323456
1105842144365998080
1105841808846843904
1105841587228168195
1105839557839409153
1105839224996155392
1105839139352645632
1105838975762288640
1105838040789012481
1105837824811651073
1105837561686228992
1105837184387555330
1105837160400371712
1105837102607011842
1105836943705862145
1105836542956892166
1105836140635013120
1105835724149084161
1105835368899923973
1105835135818182656
1105835021645029376
1105834922877640704
1105834871300198400
1105833762028511233
1105832780301246465
1105832171212861441
1105830944051814400
1105830113017544704
1105830044209999873
1105830018830295041
1105829955240255488
1105829800583852033
1105829703884124162
1105829461990219776
1105829285342994433
1105828850238402560
1105828417348517894
1105828027580194818
1105827865088675840
1105827311457366016
1105827218339622919
1105826642184884226
1105826209370382342
1105826176004689920
1105825789134680064
1105825751499264002
1105824373972316161
1105823742477910018
1105823260485341184
1105823258077728768
1105822873757929472
1105822871157391370
1105822719113916418
1105822495947583488
1105822089917927429
1105822029557760001
1105821714636832768
1105821663424380930
1105821597431152642
1105821575402672128
1105821428430065666
1105820778547810304
1105820688487731200
1105820646863499265
1105820441850114052
1105820048277598208
1105819893855911936
1105819827514560512
1105819765770207233
1105819744047902720
1105819708169879553
1105819334830641152
1105819006982914048
1105818960770011137
1105818597778247680
1105818216956350464
1105817860654448640
1105817684606894080
1105817332058861568
1105817172444676096
1105816765941104640
1105816589172129793
1105816164033351680
1105815984521310209
1105815972697518080
1105815782469046272
1105814887861837825
1105814813295431680
1105814212822159360
1105814096178540545
1105813220407853056
1105812960662949890
1105812948910522369
1105811875210686464
1105811167526768641
1105809865778384897
1105809772497039360
1105809485480804352
1105809122526679041
1105808787376652288
1105808114882887681
1105807991717146624
1105807903112466434
1105807777807646720
1105807738339237888
1105807647964647425
1105807567828193281
1105807478183333888
1105807380581892096
1105807299975806976
1105807287686434816
1105807200231063552
1105807194686148608
1105807079346855936
1105807004612902912
1105806927563579392
1105806744037531648
1105806550118092801
1105806549249937408
1105806324980428800
1105806289261731840
1105806254159654913
1105806148270080000
1105806056872177664
1105805894481252352
1105805864567562241
1105805643687120902
1105805547696254976
1105805319261876224
1105805097685188609
1105804620511756288
1105804614035783680
1105804239887060998
1105803661337415680
1105803653447909376
1105803357028057089
1105803294075691008
1105803167667798024
1105802442686545920
1105801541582241792
1105801065633669120
1105800106962550786
1105799834295066624
1105798795084918789
1105798573688541185
1105798566960861186
1105797742977302528
1105797514458877959
1105797281960345601
1105797207666671616
1105797167476822018
1105797158522011648
1105796924689522688
1105796814102511616
1105796516248252417
1105796322660106240
1105795827212144642
1105795490963165190
1105795348809900032
1105795243822190592
1105795219533037572
1105794748227510273
1105793716034437120
1105793061685211136
1105792981934723072
1105792803664289792
1105792669564002305
1105792564043702273
1105792451443412992
1105791148646375424
1105790839773642752
1105790658789367808
1105790377192239106
1105790094827507712
1105790030776356864
1105789932092747777
1105789670640807937
1105789582438793218
1105789567377002496
1105789463479898114
1105789365060583426
1105789244856025088
1105788565416497153
1105787887239475205
1105787843555807232
1105787742619926528
1105787698860560386
1105787414025519104
1105787299663613952
1105787286233513986
1105787079651459072
1105786994695770113
1105786910851719170
1105786847131811840
1105786589962223617
1105786294754598912
1105785671992655872
1105785649796386817
1105785622940262400
1105785504119836673
1105785408376524801
1105785334518960130
1105784851972739073
1105784796410798080
1105784634284167170
1105784057642799104
1105784026198102016
1105783647838310402
1105783524425121795
1105783276256538624
1105783014892728320
1105782975738851329
1105782877831213057
1105782597727199232
1105782574700552192
1105782294621626369
1105782248656252928
1105781755796176897
1105781636669558784
1105781606235729921
1105781249011040256
1105781128118579206
1105781018324291584
1105780935222534144
1105780799486464000
1105780742607515649
1105779508362334208
1105778574726959106
1105778436826693632
1105778124980146177
1105778119879860224
1105777917827735552
1105777902979899392
1105777881626656775
1105777831865389057
1105777645642547200
1105777295430701056
1105777071270309888
1105776909391147009
1105776782714773505
1105776570084536320
1105776556016877568
1105776544692211712
1105776471363207168
1105776329989992449
1105776243813814272
1105776137492418560
1105776098363801601
1105776059268689920
1105776001408294915
1105775879563681792
1105775794167648256
1105775663741583360
1105775559718535168
1105775409625481280
1105775367032373249
1105775123028684801
1105775078992683009
1105774919827275776
1105774849681690625
1105774739086299136
1105774653426098177
1105774563177172992
1105774493027495936
1105774419123863553
1105774247367069696
1105774023823241216
1105773872719122432
1105773763113746432
1105773643336949760
1105773607484121088
1105773305259270145
1105773295452991489
1105773246102810625
1105773167212142592
1105773133561249793
1105773108433162240
1105772939759308800
1105772855533420544
1105772708191789057
1105772608753225728
1105772346399514626
1105772249003503617
1105772190526525442
1105771752120946688
1105771741949952000
1105771444691234816
1105771412642562049
1105771283747405826
1105770920742961152
1105770739821699073
1105770734591315969
1105770492814913536
1105770470345981953
1105770362942488577
1105770134910746624
1105769854110519296
1105769689035214848
1105769669812764672
1105769528724783104
1105769516020236288
1105769416493580288
1105769321794539520
1105769273400664064
1105769158602575873
1105767765112057858
1105767623277584384
1105767503639261184
1105767389642346496
1105767377185239040
1105767273334272000
1105767255323885570
1105767185522274304
1105767069440720897
1105766961789706240
1105766831288188928
1105766817287585794
1105766703273832453
1105766570574385152
1105766528086089728
1105766516048515072
1105766445022093312
1105766435626934273
1105766338675568641
1105766200838144001
1105766028326420480
1105765979051700224
1105765919236583424
1105765898474921984
1105765775665696769
1105765620870717440
1105765491707121665
1105765318708916224
1105765236152434694
1105765182322675714
1105765128715358208
1105765125481476096
1105765086919081984
1105763760613089280
1105763655885430784
1105763405368053760
1105763194327306240
1105763053382053889
1105762987409793024
1105762842773467136
1105762801010860032
1105762723198058496
1105762476220653570
1105762372394893313
1105761623443165185
1105761495877668865
1105760794933899266
1105760557037207553
1105760542843695104
1105759589885247489
1105759576824209408
1105759031241641984
1105756184957644801
1105755599864848385
1105755537793314816
1105755432780513281
1105754957586804736
1105754798245203974
1105754616300556288
1105754358124343296
1105754231624085504
1105754140687417344
1105753711991799808
1105753536506286080
1105753071123075072
1105752552610631680
1105752396767133696
1105751467799900160
1105751379048648705
1105751256973357056
1105751068510695424
1105750636019232768
1105750268518506496
1105749595261464577
1105749595261411328
1105749460846555136
1105749235637596160
1105749022772547584
1105748108254818304
1105747396775084032
1105747375040221184
1105747137617375232
1105746749837201409
1105746569733816320
1105746478172119040
1105746432546484225
1105746402028732417
1105746224181850112
1105745641471393793
1105745376135520256
1105745254093864961
1105744993313005568
1105744807564115968
1105744653540909056
1105744545222938625
1105744058830520321
1105743935819968512
1105743679778623488
1105743608668450818
1105743542650093568
1105743295739817984
1105743105276477445
1105742836413186048
1105741369836998657
1105741346600558592
1105741250714570753
1105740807963856896
1105740600815570944
1105740567907045376
1105740195956252674
1105740030868377602
1105739898752040960
1105739555032969221
1105738744508891137
1105738597641175040
1105738571024084992
1105738490304741376
1105738448646955008
1105738427906117635
1105738166240231424
1105738118861385729
1105738005124444161
1105737760109924357
1105737479775285248
1105737181933551616
1105737009698652160
1105736948302401536
1105736463189245952
1105736281903063040
1105736264576393216
1105736052973686784
1105736035441487872
1105735921272569856
1105735702476742659
1105735674785947648
1105735517528879106
1105735500105695232
1105735290440830976
1105734867789246464
1105734828576649216
1105734378720768000
1105734247309066240
1105734240451379200
1105734039858753537
1105734001443115008
1105733925656248321
1105733794424852481
1105733677298995205
1105733285718736898
1105732784679776256
1105732743625916416
1105732731068129281
1105732641003851777
1105732538709000192
1105732241173463041
1105732086508519426
1105731587474378757
1105731494885163008
1105731472101724160
1105730698927898624
1105730543122071554
1105730521215180800
1105729438896017408
1105729331907776512
1105729309455597568
1105728863366250498
1105728768138723328
1105728278827016192
1105728242361794560
1105727777553203205
1105727720032518144
1105727542957359106
1105727357493698560
1105726063617949696
1105725618761678848
1105725486909571073
1105725409604370433
1105725283154518017
1105723729781444609
1105723689872642048
1105723502542422016
1105723204935577601
1105723057992282113
1105722963377221633
1105722499428429824
1105721721309548544
1105720103075827712
1105720034192777216
1105720010100531200
1105719253498560518
1105719244568825857
1105718957393219585
1105718922576306177
1105718507822559232
1105717649428893696
1105716931213094912
1105716746584055808
1105716394006626304
1105716201181925377
1105715664826834944
1105715641766633472
1105715006472105985
1105714697125416960
1105713905211506688
1105713734310334465
1105713586368888832
1105713403123908608
1105713286962733057
1105713284005662721
1105712945504366593
1105712752583196672
1105712581103288321
1105711672939958272
1105711002455293952
1105710385691324422
1105709867258560512
1105708744472694784
1105708167386877952
1105706731122786305
1105706497416355841
1105705978404626432
1105705628243320833
1105704434506612736
1105702923596640257
1105702625260027904
1105702322422849536
1105701482479919104
1105700357810864128
1105698970934919168
1105698822716428294
1105698074943467520
1105697885910269954
1105695269788766208
1105681871004991489
1105674961132367874
1105674713098010624
1105674503810625541
1105673890972487685
1105673404500332544
1105672554470146048
1105668531004280843
1105664151156940800
1105657300801474561
1105656469280747521
1105647870517149697
1105647778133405702
1105647689918791686
1105646573877448704
1105645288134529025
1105644897267261441
1105641137837142016
1105639037954609153
1105638358796124166
1105635811503075328
1105634564947484674
1105634143130603520
1105633895935037440
1105633617823309824
1105632041759059969
1105630287218831361
1105628201068449793
1105627554889846784
1105627496060514306
1105626446859513857
1105625255312310273
1105624650426523649
1105624235467247617
1105623922718982144
1105623862841167872
1105623830435893248
1105623728170373120
1105623342864830465
1105623265677062144
1105623010831142914
1105622801111752705
1105622512728244225
1105622410437578757
1105622328938020870
1105622063618945024
1105621658700668928
1105621566698807299
1105621389522948103
1105620579195994113
1105619562790338560
1105619492875456512