1244775365882642437
1244774802478575618
1244774733725544448
1244773745673322496
1244773667520892929
1244773536100745216
1244773477707587586
1244773385193865222
1244772885362769922
1244772847752486917
1244772191335518215
1244772043486347265
1244771959067611136
1244771873944207361
1244771756117823490
1244771643228147714
1244771389573398530
1244771313220231173
1244771276729667585
1244771195997900800
1244769777442336768
1244769515340267523
1244769477008465925
1244769344070057985
1244768954154975239
1244768780737302528
1244768492764770306
1244768342268948480
1244768097183174657
1244767837769682944
1244767815741198341
1244767750532354048
1244767338328739840
1244766561283473408
1244766487744741384
1244766353699078144
1244765712977141760
1244765536568979457
1244764610357493760
1244764512231870469
1244764405910380545
1244764240713527303
1244764214213980163
1244763845496901634
1244763810524692481
1244763786914996230
1244763261867786245
1244763172063662081
1244762766960930823
1244762663487406085
1244762564514504713
1244762557862338563
1244762312155844610
1244762157499265024
1244761788740034560
1244761644598730753
1244761442068414464
1244761311592013832
1244760886973288453
1244760816387338242
1244760795755528192
1244760786704183298
1244760252974850053
1244759807032266752
1244759605193949189
1244759599032532998
1244759530359177219
1244759189341249537
1244758963402485762
1244758909866455042
1244758306188660739
1244758226316537859
1244758120469053452
1244758044497661952
1244757228516671488
1244757193456594951
1244756584292651008
1244756559953121281
1244756286576738309
1244756220348633090
1244756151109124098
1244755921030598658
1244755614338895875
1244755557464117251
1244755474051891200
1244755260121534470
1244755077140828162
1244754528861335552
1244754344731389955
1244754150971387904
1244753836859961345
1244753676964691976
1244752871037587457
1244752571748823041
1244752482665992192
1244752004129398791
1244751780472336391
1244751632501559297
1244751551006216194
1244751429790826498
1244751424707334147
1244751363147542528
1244751189834715137
1244751123455582216
1244750333122875392
1244749943757299713
1244749455842312194
1244749304738328583
1244748556562509825
1244748503617765378
1244748419010301953
1244747483802144768
1244747438017187840
1244747378307010560
1244747159154671629
1244746966300528644
1244746700742430720
1244746552406573056
1244746538099904514
1244746363792957443
1244746263276462081
1244746261342945280
1244746203654430721
1244745929061793798
1244745313501446144
1244745028725063682
1244744924798607366
1244744906054172674
1244744735304093696
1244744598292922368
1244744374115880960
1244744104128458754
1244743920610955271
1244743646236364802
1244743637503795203
1244743488803164161
1244743458696441859
1244743361598312451
1244743166009511936
1244743024569200640
1244742926003036160
1244742737494147073
1244742630740819973
1244742553368477697
1244742233959682048
1244742195954974721
1244742135573819394
1244742020247236609
1244741976412631040
1244741928677187584
1244741908938833922
1244741831549730818
1244741758422048771
1244741698686791681
1244741666147373056
1244741621280911360
1244741605539688449
1244741530067271680
1244741470101389312
1244741400052346880
1244741236533219331
1244741231168704512
1244741221907664903
1244741164554752001
1244741035290497024
1244741030743867394
1244740879513944064
1244740772592836610
1244740636416319492
1244740541822185479
1244740481042407425
1244740460838617089
1244740324418826240
1244740253342146560
1244740164859170817
1244740138179182593
1244740016775081986
1244739877704536067
1244739760578613259
1244739754580680705
1244739613509459971
1244739546123771904
1244739532207149059
1244739448715251717
1244739439357804544
1244739354494472192
1244739324429701121
1244739214924808193
1244739108532105216
1244738975874637824
1244738878826840067
1244738829417930754
1244738785377689602
1244738747679346688
1244738683661627394
1244738355839066112
1244738233969324033
1244738117782953986
1244738025193648134
1244737922450022401
1244737823929970692
1244737756628164608
1244737708821549065
1244737650843664384
1244737482148675592
1244737442437115905
1244737276309012480
1244737257191464966
1244737179181625344
1244737098638405632
1244736932455878660
1244736918052626433
1244736817489993729
1244736716197572614
1244736594575331329
1244736540590460929
1244736435544088579
1244736211438260224
1244736198272323585
1244736161010024450
1244735928146501637
1244735835100119046
1244735715977682945
1244735524176347136
1244735394010337280
1244735332031123458
1244735243535495168
1244735133028093953
1244735101809889287
1244735052954697734
1244734984256192518
1244734981097893890
1244734967021780993
1244734748322398208
1244734674792046592
1244734260944216080
1244734187220938757
1244734110393925636
1244734089388843008
1244734051723984898
1244733988217946113
1244733912439574534
1244733893858770949
1244733781082345473
1244733750786867201
1244733678774882305
1244733613293424645
1244733441662431237
1244733381147058178
1244732951839072264
1244732851679047682
1244732695948779521
1244732590243880965
1244732185132892162
1244732140580986882
1244732089746042880
1244731734085828614
1244731663315337217
1244731504435003392
1244731344833449984
1244731132203147264
1244731080021880832
1244731020731088896
1244730922861236224
1244730882621165571
1244730763934908418
1244730642199457794
1244730582791335946
1244730310140612616
1244730274069561344
1244730101750804481
1244729834426830849
1244729680793686018
1244729647499182081
1244729320863653890
1244729320699916288
1244729099442102273
1244729038201073664
1244729032006041602
1244729019624493056
1244728587913216005
1244728457558405121
1244728434556895234
1244728322640285698
1244728188523208707
1244728064929644548
1244727813367910400
1244727769252139009
1244727530319380480
1244727397083217923
1244727269882580995
1244727144502235141
1244727117184720901
1244726993498890240
1244726899638763527
1244726807728881671
1244726799621328903
1244726586114486280
1244726578766057482
1244726475905007616
1244726300423655425
1244726269293539333
1244726001839603712
1244725982499680259
1244725972622024704
1244725229886341122
1244725150324600840
1244725120276537349
1244725005918838787
1244724968413331456
1244724846103351307
1244724698522542087
1244724516221321216
1244724377352048646
1244724044538220545
1244723677066866694
1244723603352039427
1244723482161827847
1244723413974908929
1244723176665481234
1244723174496927749
1244723153823244289
1244722942203830272
1244722812637634560
1244722801237508101
1244722464049020933
1244722371849678848
1244722291205963777
1244722257672404992
1244721675972861953
1244721569987022855
1244721542577172483
1244721477766823937
1244721350834630660
1244721188347273216
1244721157271674880
1244720994687815682
1244720861795553281
1244720786163843072
1244720773358587916
1244720641028378627
1244720630781620224
1244720624590872576
1244720543879893000
1244720529484939264
1244720321099374592
1244720259166330880
1244719937752576001
1244719915157860354
1244719886452035588
1244719788749926401
1244719517676249090
1244719470364540928
1244719352609456129
1244719253586092033
1244719108320571395
1244719041123627008
1244719009297285125
1244718224916316160
1244718197233811461
1244717984121266178
1244717922645393409
1244717813127839745
1244717711646654468
1244717411481329665
1244716695975006210
1244716547563814913
1244716513912926213
1244716342793641984
1244716254767861761
1244716021254164480
1244715980342902787
1244715940996100096
1244715909132029952
1244715907483684865
1244715899757756418
1244715898516189186
1244715858305433601
1244715856153755649
1244715820850319367
1244715765930098693
1244715758875217920
1244715716588249088
1244715683683934213
1244715567262642177
1244715525172875266
1244715457338388481
1244715439994871808
1244715381597577220
1244715344322859008
1244715315453399041
1244715257681059841
1244715205386547211
1244715026323300352
1244714902448738304
1244714898602549248
1244714504522522626
1244714451133173760
1244713660318171136
1244713599928602624
1244713506366263297
1244713388254662657
1244713073048510465
1244713070569627649
1244712797235224582
1244712791270764550
1244712788573986816
1244712686933377029
1244712620516683778
1244712484436611074
1244712482960297985
1244712432670593025
1244712098384527360
1244712033662259208
1244711980394561539
1244711964577841154
1244711905501077507
1244711129907068929
1244710805557391360
1244710657708220416
1244710362135646213
1244709900254613504
1244709518522621954
1244709453821288448
1244709294639063040
1244709268235878403
1244709113688395776
1244709099377504262
1244709002820366337
1244708574049288197
1244708354695614465
1244708331228467206
1244708304716259328
1244708076525158410
1244707851878256643
1244707802314166273
1244707748249579520
1244707467315089409
1244707427351760897
1244707394967478276
1244707362734329864
1244707318975135749
1244707083611787267
1244707030860005382
1244707012082008064
1244706996005285890
1244706994541531137
1244706913050296326
1244706774759940097
1244706672939077634
1244706088764792832
1244706071102570499
1244706050974105603
1244705995797991424
1244705960532283395
1244705932669526016
1244705526157660160
1244705305965072392
1244705280459444231
1244705198326648836
1244705165208363009
1244704979681792000
1244704573522087937
1244704539158118406
1244704534217228292
1244704371197325313
1244704191609810944
1244703931265167362
1244703409942429698
1244703402254372867
1244703252601540608
1244703060204630016
1244703040457904128
1244702849042350082
1244702697615482889
1244702685116448768
1244702067459047425
1244701663635673091
1244701652109733896
1244701417258049536
1244701365240201216
1244701353550778370
1244701353081004033
1244701311972577280
1244701224055844865
1244701200055926784
1244701102764892160
1244701081805996035
1244701059773345793
1244700957599989761
1244700905813020673
1244700847877087232
1244700844035133440
1244700830063886338
1244700797994229760
1244700627013439494
1244700570990055424
1244700568993632259
1244700409823985665
1244700170761232384
1244700081611329542
1244700004540973061
1244699909581942788
1244699845861859336
1244699819765116928
1244699680598081542
1244699676516982784
1244699655612567553
1244699493221752837
1244699385872691201
1244699381745532930
1244698925933699077
1244698685977563136
1244698684148809730
1244698615001513984
1244698602762637314
1244698181931274240
1244697955178815488
1244697852602916866
1244697741877555204
1244697619957497856
1244697565985153025
1244697562457784324
1244697490256990208
1244696601450381312
1244696590708887552
1244696455622819844
1244695951530512387
1244695914964492288
1244695845511016448
1244695784727199744
1244695464949227520
1244695388726136835
1244695275526070275
1244695096483856384
1244694616525414405
1244694386107125762
1244694294033825797
1244694244444573696
1244694129671639041
1244693752742055937
1244693688502099968
1244693601092808705
1244693488194772994
1244693353595310080
1244692980302315522
1244692828195819528
1244692427509825541
1244692284928638976
1244692000307372032
1244691859017957378
1244691592146976769
1244691541354074114
1244691220791771136
1244691174327189510
1244691153112440836
1244690974678437891
1244690863118258176
1244690760265498632
1244690657110831105
1244690457927593984
1244690434481422336
1244690379942899713
1244690130050469889
1244690027273224193
1244689737056694274
1244689569536184320
1244689468659052548
1244689018454978565
1244688850691207170
1244688713189294080
1244688494246625281
1244688473073823748
1244688198636363778
1244688082915524609
1244687922307219464
1244687815163641864
1244687564403064833
1244687283556700163
1244687280037597185
1244687202149437441
1244686465151504385
1244685624797511680
1244685498834194432
1244685310388297729
1244685301206978560
1244684930245971971
1244684456172105729
1244684393781825536
1244684237049073665
1244684148767416320
1244684144610816002
1244684097479495688
1244683816419110916
1244683750304370694
1244683669379395584
1244683367636926465
1244683343876235264
1244683264087994370
1244683199541915649
1244683028129087490
1244682921795035139
1244682872688119810
1244682820439678978
1244682677866946560
1244682437231284227
1244682392134127618
1244682197535162369
1244682137959309314
1244682112621518855
1244682058628239360
1244681869251272706
1244681557715058689
1244681556486209536
1244681312792969216
1244681195029438466
1244680849578131456
1244680785497600013
1244680745492393991
1244680416445059073
1244680413504843777
1244680301898534914
1244680291895201793
1244679949820321792
1244679770941644800
1244679683796545538
1244679614343057409
1244679573947781120
1244679499767320577
1244679152437006337
1244679148775395330
1244679074607439873
1244678532153868289
1244678315933392897
1244678019731656705
1244677763916795906
1244677659277373441
1244677630428770304
1244677458823004160
1244677350484250629
1244677330561388544
1244677062159470593
1244676913987280897
1244676551049871362
1244676122685693953
1244676036366864390
1244675876211568641
1244675795466895362
1244675787401371648
1244675762067664896
1244675607587323905
1244675604471001095
1244675576713162765
1244675314321629186
1244675070569709568
1244674926830854147
1244674509015109632
1244674047566364672
1244674009003888643
1244673936597663749
1244673920302800897
1244673659828142083
1244673466634125318
1244673340612247555
1244673207451385861
1244673092171042818
1244672979176472577
1244672939439591430
1244672902286454785
1244672724531908609
1244672376614391810
1244672079653416960
1244672030798155776
1244672017607122944
1244671741026328576
1244671509999898625
1244671489615507459
1244671309235335169
1244671241048461313
1244671104003846149
1244670851150237698
1244670761345978368
1244670568751865863
1244670192690569228
1244670092937506816
1244669792310755334
1244669753421180928
1244669677294534657
1244669401418342401
1244669275580792838
1244668802886963201
1244667776180064257
1244667210418749441
1244667035877023748
1244665699982770176
1244665490695479300
1244665385615536130
1244665312475328512
1244665029863133185
1244664846597132291
1244664760433618944
1244664568045068290
1244664419763859456
1244664324926377985
1244664140100231176
1244663981597483008
1244663774025580544
1244663643419152386
1244663542009278465
1244663523583627265
1244663360307769345
1244663312262062085
1244663029297483779
1244662744730779648
1244662719107731457
1244662523359567872
1244661982348877826
1244661871325609987
1244661702328811520
1244661678685532160
1244661349042569216
1244660788306067456
1244660778311041026
1244660627190284289
1244660019024535558
1244659840334680066
1244659836433960962
1244659530228736003
1244659450809585667
1244658818455404546
1244658805620772864
1244658762255908864
1244658759772844037
1244658727292108800
1244658457292218374
1244658333484830720
1244658270939369472
1244658141666697219
1244658086163480579
1244658020375764993
1244657890310402051
1244657597896183809
1244657525594763265
1244657086216261635
1244656944046112768
1244656815956275202
1244656619683807239
1244656098411495424
1244656079503527944
1244656039875817473
1244655533744889856
1244655308946976771
1244655133088235520
1244654630593867777
1244654499903479809
1244654373340360704
1244654161242669056
1244654058008457219
1244653986642362371
1244653909706244096
1244653901959385090
1244653415998926858
1244653342132965378
1244653277691744259
1244653115816755200
1244652640778309638
1244652615344033793
1244652613334962177
1244652610482835457
1244652445990617089
1244652193971666956
1244651750382075904
1244651076122533889
1244650752620011521
1244650751684730886
1244650464555253763
1244650437925625868
1244650420137594880
1244650364038787079
1244650067576918018
1244649891097391105
1244649844028968961
1244649577715765248
1244649560632446980
1244649266276118529
1244649240149753859
1244649079977717760
1244649045664108544
1244649039058083844
1244648867997585409
1244648723742969856
1244648485489606662
1244648476283109376
1244648398063644672
1244648272452554755
1244648135407931401
1244647729147633665
1244647620380889091
1244647446455648256
1244647445474283521
1244647293086658560
1244647168843137035
1244647013662298113
1244646557863088129
1244646451726123018
1244646044576571392
1244645887453921282
1244645854281154565
1244645815924281345
1244645739327893505
1244645717102047236
1244645544003338241
1244645449958596608
1244645434892726275
1244644967043260417
1244644801212973065
1244644717603762187
1244644688612687872
1244644665086935051
1244644650520117248
1244644081797599232
1244643338130784258
1244643132127444992
1244642082003746819
1244641831381581826
1244641584420921344
1244641443232317440
1244641300399493122
1244641228425244674
1244641203045482497
1244640594175102979
1244640430190403587
1244640414453370880
1244640160798703618
1244639369379659776
1244639327306551302
1244639034174996487
1244638683174756352
1244638568372469761
1244638463598739456
1244638171842961410
1244638127160950784
1244638064082911232
1244637784066981888
1244637336429887489
1244637239117742080
1244637137254916097
1244637056590118913
1244637034184146945
1244636731955130376
1244636003953971201
1244635946487885825
1244635801444638723
1244635425345605632
1244635346928836611
1244635317522530305
1244635072977928194
1244634630092918785
1244634375419027458
1244634307194486785
1244633993317933056
1244633840649408521
1244633703151779840
1244633551338983424
1244633433336356864
1244633284820246529
1244633082956840962
1244632868023865347
1244632800533323777
1244632760507084803
1244632560476524545
1244632503685730312
1244632286320091137
1244632284206182403
1244632283673493510
1244632246646161408
1244632239381655552
1244632232167460864
1244632212038914048
1244632149678006273
1244632139288772608
1244632132233965568
1244632025946116097
1244631930424954886
1244631832517390336
1244631805346660357
1244631648853000193
1244631199861157888
1244631128088236033
1244631008160464897
1244630858369204224
1244630857782001664
1244630822877085697
1244630644048760832
1244630323968835585
1244630013040869377
1244629960209424384
1244629897680769024
1244629751190388741
1244629724401369088
1244629632294494208
1244629385946202112
1244629341998325760
1244629139132502017
1244628898106822662
1244627859550785537
1244627709160050692
1244627675693690881
1244627387905695744
1244627244108185601
1244626962792026112
1244626538835914754
1244626468921057282
1244626254315294720
1244626249613443072
1244626133917761536
1244626098954043393
1244626081665232896
1244625669348372482
1244625497385992195
1244625187989061632
1244625082028363778
1244624975149006849
1244624917343219712
1244624732957429768
1244624709695746048
1244624569576697857
1244623861976612864
1244623820658561025
1244623631654641669
1244623456932712449
1244623105089306625
1244622751769538560
1244622651785719809
1244622319588384772
1244622226395201538
1244621929715306497
1244621794096619529
1244621763130142721
1244621510083559424
1244621241690083328
1244620948172689408
1244620897501274113
1244620785668497409
1244620681217822721
1244620494260838400
1244620191335579649
1244620122318405634
1244620061916225536
1244619256429531141
1244618944687869954
1244618921338159105
1244618920222482432
1244618793957183488
1244618497705066498
1244618494563368961
1244618490650165249
1244618183719505921
1244618076202700800
1244617729694457856
1244617725600772097
1244617511729061899
1244617303389544448
1244617236888895494
1244617141317439494
1244617140516401152
1244617118370476035
1244617109944127490
1244617069938819073
1244616760759812096
1244616401848946693
1244616320613834753
1244616172420640768
1244615635688206336
1244615323556417538
1244615211270713351
1244614774303973377
1244614715260747777
1244614636021915649
1244614576081113088
1244614456430247936
1244613926022758401
1244613330058305541
1244613295774076928
1244613290057248768
1244613145919881224
1244613107424661506
1244612811969396736
1244612659472936960
1244612563255656448
1244612354559692800
1244612170480041984
1244612026569285635
1244611677972303877
1244611430814490625
1244611406416183296
1244611248920104961
1244611246307135489
1244611231106961409
1244611061166284816
1244610853590175746
1244610700665933825
1244610645296807936
1244610492125020160
1244610446579109890
1244610417521016833
1244610388152516611
1244610321941217281
1244610263610949632
1244610229771386882
1244610082811326470
1244610069506990083
1244609974183002113
1244609576504373248
1244609448221564928
1244609303539040257
1244609033560039424
1244608912013344773
1244608762054402048
1244608636984401920
1244608559570190336
1244608545221488640
1244608404666138627
1244608355735408642
1244608255546011648
1244608212118253568
1244608178777661445
1244608081645973507
1244607989648109570
1244607738526777345
1244607707048443906
1244607656318337025
1244607655609618432
1244607508389527552
1244606975993884672
1244606960646918144
1244606896448983040
1244606791503273984
1244606683118047244
1244606640797745152
1244606601920741377
1244606458207121409
1244606385804980224
1244606377705844737
1244606264644120577
1244606204258762753
1244606123195469825
1244605766981636098
1244605471203512322
1244605453461577728
1244605078612463616
1244605044768608263
1244604541598916610
1244604454550343681
1244604439668948992
1244604375860985856
1244604322207408129
1244603999283806209
1244603871948873728
1244603743016009728
1244603599294005249
1244603180652138497
1244603176516534272
1244603106949836800
1244603005321838597
1244602793836646400
1244602357150887943
1244602055223844865
1244601933358411778
1244601840697778179
1244601659608707073
1244601558186287105
1244601514506752001
1244601429194612737
1244601377181106176
1244600988390039553
1244600943867543552
1244600821528113152
1244600389497995265
1244600303443419137
1244600224452087809
1244600138498260992
1244599894213615617
1244599567276027905
1244599485990395905
1244599474430844928
1244599413508575233
1244599179118292993
1244599118456147968
1244598899266007041
1244598895675613184
1244598894081658880
1244598418896494597
1244598229796339717
1244598176650231809
1244598049290289152
1244597849779773441
1244597570887876608
1244596947962466304
1244596807486881795
1244596736162701312
1244596094144823302
1244595822798548995
1244595562479071233
1244595537191604224
1244595264561831936
1244595215538835461
1244595118662918146
1244594954929868801
1244594760217755648
1244594712452968448
1244594681306112002
1244594576469438468
1244594463676289024
1244593882802917377
1244593752448081920
1244593581018566656
1244593414102028288
1244593096794537985
1244592332164513792
1244591950654836736
1244591509590159361
1244591387376603136
1244590992935829505
1244590753227182080
1244590338016251904
1244590146047131648
1244590110747828224
1244589960637939712
1244589288861335552
1244589282918105088
1244589255491555329
1244588932462866433
1244588904302489601
1244588713604272129
1244588596390244356
1244588065689079808
1244587919207170048
1244587528625192962
1244587348748390400
1244587135954452487
1244587050915037185
1244586823030054912
1244586211588673537
1244585845702737922
1244585783836774402
1244585711149494272
1244584264135512064
1244584137148772352
1244582836511916033
1244582746518937600
1244582601458888706
1244582462354841600
1244582349779714048
1244582156321652736
1244581723788247041
1244581711679238146
1244581081824796673
1244580836705435649
1244580787741220864
1244580110264602624
1244580050961338369
1244580036583309312
1244579965544198149
1244579853673865216
1244579828134707200
1244579806638989313
1244579628800512000
1244579327435517952
1244579259206729729
1244579168614039552
1244579015387688961
1244578864279572480
1244578776060694528
1244578467317981184
1244578290687410176
1244578070926970882
1244577899442733056
1244577708291563520
1244577624833363969
1244577384516509698
1244577345148719105
1244577290429890563
1244577285866430464
1244577126654885888
1244577069499125761
1244576907456393217
1244576484674744321
1244575949934526464
1244575701136703490
1244575555850207232
1244575532647415808
1244575343509491714
1244575102131417089
1244574953904705537
1244574890910457856
1244574804793065473
1244574625448759296
1244574615755685888
1244574131309416448
1244574066276798464
1244573912467476487
1244573810692628490
1244573625648381953
1244573545780387841
1244573374195683328
1244573244591616002
1244573153495592960
1244573123418226688
1244573005579194368
1244572970485514242
1244572963409625090
1244572777895657472
1244572551486963713
1244572464258191360
1244572364358238208
1244572351230074880
1244572048002813952
1244571995762823169
1244571935377424386
1244571651410452480
1244571426247585793
1244571250703437827
1244571239785603072
1244571184798347266
1244570859035152389
1244570839040884736
1244570300337053696
1244570166777778178
1244570133894500352
1244570055423262720
1244569796580179968
1244569700228612099
1244569691772858370
1244569581869576192
1244569341175181312
1244569293683142657
1244569071439491073
1244568899993174023
1244568862546374656
1244568508467490817
1244568496878518275
1244568246185009152
1244568131818983424
1244568028165128192
1244567876343861248
1244567692197212163
1244567666460942337
1244567543240626178
1244566988711768064
1244566916192260096
1244566895694618625
1244566857757196288
1244566753176420352
1244566560200589317
1244566438192599041
1244566429631987712
1244566399885946880
1244566012613275649
1244565876088754181
1244565473863315456
1244565388899336193
1244565359883141120
1244565332297211905
1244565157294018560
1244565029296496640
1244564683056730112
1244564664299765760
1244564597933314048
1244564528517410822
1244564360464347146
1244564106448900096
1244563906640691201
1244563854874591235
1244563434202693632
1244563418176241666
1244563228102975488
1244563178207563777
1244563173304344576
1244562823528755201
1244562737016995840
1244562550295011328
1244562548575346689
1244562423576698881
1244562398834548738
1244562300822081537
1244562201530322945
1244561869777534976
1244561743097061376
1244561719814434817
1244561701531508742
1244561513295286272
1244561430466252805
1244561416180379648
1244561414284509184
1244561215654899713
1244561207765413890
1244561155340873729
1244561060859969536
1244561032145702912
1244561015720808448
1244560985559629824
1244560938809901062
1244560921760018432
1244560919763566592
1244560918123610112
1244560915548291074
1244560912192802816
1244560466246017025
1244560310633144322
1244560198112555008
1244560175815700480
1244559982789525506
1244559879253172224
1244559266775740416
1244559109262905344
1244559017546002433
1244558754500280320
1244558619485646848
1244558311426588672
1244558107189161984
1244558087480135680
1244557557521416194
1244557308618772481
1244557173948133376
1244557080708743168
1244556864152535040
1244556855864700935
1244556753649504256
1244556570610016256
1244556390653464577
1244556344306413568
1244556090198626304
1244556074897858560
1244556033990823938
1244556007315030021
1244555439913816064
1244555195138412544
1244555100686823424
1244554735274819585
1244554247070527488
1244554143194324992
1244553826105004034
1244553717782904832
1244553640091713536
1244553588409581568
1244553557245865985
1244553519446855680
1244553333312049152
1244553301791780864
1244553109432684544
1244553043829497856
1244552975969812485
1244552485144080384
1244552161029128197
1244551941109284864
1244551669016387584
1244551649085005825
1244551025714962434
1244550945863860224
1244550748345700352
1244550591558418432
1244550218043006976
1244550201861386240
1244550194177478656
1244549942540152837
1244549836092866561
1244549833299505153
1244549806284066817
1244549537055809536
1244549523415937025
1244548732852543490
1244548705333776385
1244548116797362176
1244547740165685249
1244547018271461376
1244546988928049152
1244546897743949824
1244545427577409538
1244544956955574272
1244544872096374785
1244544864685088769
1244544101472784391
1244543994857693184
1244543800850120705
1244543721682673666
1244543710806802437
1244543652216614912
1244543268051976196
1244543257670975488
1244543175940878336
1244543150586302469
1244542930402054145
1244542861485490177
1244542231849177089
1244540684083871745
1244540621412618240
1244540602328514560
1244540597345583104
1244540569113821184
1244540485718487040
1244540391988301825
1244540321582718976
1244540317069647872
1244539920405991425
1244539913669939201
1244539790072197121
1244539671260127232
1244539533460410369
1244537888894857216
1244537545821753344
1244536953560870912
1244536748778098688
1244535398581313537
1244535388070428674
1244535045676728321
1244534584861167616
1244534317117845507
1244534178059890688
1244532502070517760
1244532342154235904
1244532189062205442
1244531518069932033
1244530809362669581
1244530031843368960
1244529362931761152
1244528867965956096
1244528747904143360
1244528581008596992
1244528551468171266
1244527834426679296
1244527696283140096
1244527221236215808
1244527025051914241
1244525235422081024
1244525229721948160
1244525066785873920
1244524322032701440
1244524289669378048
1244524123918917634
1244523933656907776
1244522830672379904
1244522810934013952
1244522516711907328
1244522430560960514
1244522320737304576
1244521930612510723
1244521731848577025
1244521449903345665
1244521165965705216
1244521010965237760
1244520448605458432
1244520276769021952
1244520158745505792
1244520125220470784
1244520066588332032
1244519926855073792
1244519771519045632
1244519315287744514
1244518880220975104
1244518877947666434
1244518876077056000
1244518317886443525
1244518140219965442
1244516958067982336
1244516905664360449
1244515924566212610
1244514701729501187
1244514701318467584
1244514699082940416
1244514697271009280
1244514695211597824
1244514452403298304
1244514368508899328
1244514277685428229
1244514237856309248
1244513947354628098
1244513632781819905
1244513315155595265
1244513175212621831
1244513127141703681
1244512947235360768
1244512527976927232
1244512339833036800
1244511713409617927
1244511442012983301
1244509705210298370
1244509661396598785
1244509353899589632
1244509312250187782
1244509151469985793
1244508898335301640
1244508732626788352
1244508568646279169
1244508566800797698
1244508563835404293
1244508561968857090
1244508365688053761
1244508048636379137
1244507919330217989
1244507551179452416
1244506922893684736
1244506885354635264
1244506812965158912
1244506465349636097
1244505724878835712
1244504793336418310
1244503911660236800
1244503561737732096
1244503356015611904
1244502977806729220
1244502677062639622
1244502418601246720
1244502365476134912
1244501735923757057
1244501311783133185
1244500397798100992
1244497321414537217
1244496208405684226
1244496096900141063
1244495802845859845
1244495730754162688
1244495559546847232
1244495218105372674
1244495090669715456
1244494675173617665
1244494361418661888
1244494015262789633
1244490838098526209
1244490127751229448
1244488876070244352
1244488601326497792
1244487843537457154
1244487343748395008
1244487229189304320
1244486922073972737
1244486652308922369
1244486107447918602
1244486063378309120
1244484859965341696
1244484414886666242
1244483864569004033
1244483499610038272
1244483408312459265
1244482114579582976
1244481650165264384
1244481458498146305
1244481441565728768
1244481320715255808
1244480997267210240
1244480631121293313
1244479563083677697
1244478973075001345
1244478657537638402
1244475722019803136
1244473112055422976
1244470361275629574
1244459538847281154
1244458683326779392
1244458277607440384
1244451156891439105
1244447781797990405
1244444432654630913
1244431621379497984
1244430654911250433
1244429075319533574
1244427785541758978
1244425695742373888
1244425647419797504
1244425136981377024
1244425047080677377
1244424483080978444
1244423994692055044
1244423560002764800
1244422898284212225
1244421869954048001
1244421539950473216
1244421132184420352
1244421055789387777
1244420284150669312
1244420097445433346
1244419903408439297
1244419749737566208
1244419267363319809
1244419259641597964
1244419201848299520
1244418605971841030
1244418462224703488
1244418257651720193
1244418017829818373
1244417926385582081
1244417794969665541
1244417533396074496
1244417430505619462
1244417246082011138
1244416997087154177
1244416833735856132
1244416617200717826
1244416443753603074
1244416356931588104
1244416208813907968
1244416204560912389
1244416126928510978
1244415651399303175
1244415528032251905
1244415423208136705
1244415271189786629
1244415251543703553
1244415249450774530
1244415241703714816
1244414941123227650
1244414855840501761
1244414713175384068
1244414402129993728
1244414227047157760