1235354333761454080
1235353928818098177
1235353537112133633
1235353498558115840
1235353329452101634
1235352870423318529
1235352561676423168
1235352476464926721
1235352211699437568
1235351961077153793
1235351940642545673
1235351688401342465
1235351572151967746
1235351544532529152
1235350880158994433
1235350644560670720
1235349635830558721
1235349404581801986
1235349198591193094
1235349161651965956
1235348326440148992
1235348145229438979
1235347975448268801
1235347910868570120
1235347670836883460
1235347425746878465
1235347276857577473
1235347190022885377
1235346580737331200
1235346506431033348
1235346159901831169
1235346077047541764
1235345876618555392
1235345415320539138
1235345219853352961
1235344618134343680
1235344387049168904
1235344113391857665
1235343394890821638
1235342828944986112
1235342441454153731
1235342352287518721
1235341990306426880
1235341127601049601
1235341111373242368
1235340922210091012
1235339771750346752
1235339153904218122
1235339101227954180
1235338060277178368
1235338012420169728
1235337519597785089
1235336964121022464
1235336958139867136
1235336279723773957
1235336137461370882
1235335343370629120
1235335291256348674
1235335167537008641
1235334329120821248
1235334013822349312
1235333954871447552
1235332957600206861
1235332790561972224
1235332014305398785
1235331912652263424
1235331743277817856
1235331607780904961
1235330277616029696
1235330154752290824
1235329887034101760
1235329614630838272
1235329300003467265
1235328033101361152
1235328017628622849
1235327955464867840
1235327733846114305
1235327338428207104
1235327291913359360
1235326910105817089
1235326733592776704
1235326346450153473
1235326303404011521
1235326286798753792
1235326148084731906
1235326045550764032
1235325947911471106
1235325652917768197
1235324595445665792
1235324523601448961
1235324512641732608
1235324426369069058
1235324175604158464
1235324142662152194
1235324016413593605
1235323848360419329
1235323823484006401
1235323821965684738
1235323371006676998
1235323272662855684
1235323026478071809
1235322998397317122
1235322815533940737
1235322759359737857
1235322731924721666
1235322201529868294
1235322086299766785
1235321834209521665
1235321663916564481
1235321326510002179
1235320713504059395
1235320697976696833
1235320267993423875
1235319844582699011
1235319518370689025
1235319115486765058
1235319073610883073
1235318777123876865
1235318297245159430
1235317716824838144
1235317676395892740
1235317444346097664
1235317341409497090
1235317097548451841
1235317088924954625
1235316898893619200
1235316842622857227
1235316465785589763
1235316409229553671
1235316310139187202
1235316285602439172
1235316235946119169
1235315281679077378
1235315016825475072
1235314970562306049
1235314777288822789
1235314410190704645
1235314331992154115
1235314087032168450
1235313947366092802
1235313509157810176
1235313464081600513
1235313452207525895
1235312984500719623
1235312858617044994
1235312793462747139
1235312196613214213
1235312169748750339
1235311934834200576
1235311931789135878
1235311895554543617
1235311775907794944
1235311699923787776
1235311658039488514
1235311644756054016
1235311481455087616
1235311369915977730
1235311181646180352
1235311148926464001
1235311043045449728
1235310875717795842
1235310759716048897
1235310748018016261
1235310738698383361
1235310555143049216
1235310495466426368
1235310276943196160
1235310175860535296
1235310138522730496
1235310018813190144
1235309834263810052
1235309675597443073
1235309613769199619
1235309385041268741
1235309258352275456
1235309222117748738
1235309026709327873
1235308950314196992
1235308875714367488
1235308819401633806
1235308751307055107
1235308497664913411
1235308330756771841
1235308126670331915
1235307827960467458
1235307646560980993
1235307572816732161
1235307508346036225
1235307267219746816
1235307030698692609
1235307016807211014
1235306570852032513
1235306396662542337
1235305942851424256
1235305863629467648
1235305835263389697
1235305756028801029
1235305750970478594
1235305557189365760
1235305371230711810
1235305334283083777
1235305259939123207
1235305204494585860
1235304857432657921
1235304750859653123
1235304583754371078
1235304500900122631
1235304456914440193
1235304373913374721
1235304339687837701
1235304321979473922
1235304205910409216
1235304126638174209
1235304104496373762
1235303588219543556
1235303450948374529
1235303152662056962
1235302977008734210
1235302858196750336
1235302783353606146
1235302702671900674
1235302691628294144
1235302677296406533
1235302417903779842
1235302330742034434
1235302087614959617
1235301959055347713
1235301767551889415
1235301633699074053
1235301367356497924
1235301147063222273
1235301072547336205
1235300749929779200
1235300642324914182
1235300548339027969
1235300380902387714
1235300335620677632
1235300162064519170
1235300128522752000
1235299838759141376
1235299772661104642
1235299622823833601
1235299574841036806
1235299036338556930
1235298866221772802
1235298727558107137
1235298688144232448
1235298610125950976
1235298028313104387
1235297397602947072
1235297397221269505
1235297304304906241
1235297163837665281
1235297002210185217
1235296986682798081
1235296762409234432
1235296564295454720
1235296331524169729
1235295749396717571
1235295746452328451
1235295372861485057
1235295213582680065
1235295137334546436
1235294823873220608
1235294740234543104
1235294359647670272
1235293852313047044
1235293749422575619
1235293505414737924
1235293462733389824
1235293383683444737
1235293273721368576
1235293255903961091
1235293203433172992
1235292865930104838
1235292758639857664
1235292727262269442
1235292653698404353
1235292613235945473
1235292444373200897
1235292265909755909
1235292207093108738
1235292111437778946
1235291976821506048
1235291937999065088
1235291920710193153
1235291568938065921
1235291353065676803
1235291213584048128
1235290964715098113
1235290922709143556
1235290865825914882
1235290801124540416
1235290755217883142
1235290715921489923
1235290609621110792
1235290331328937986
1235290330527944704
1235289896916570120
1235289830512263168
1235289639247908877
1235289424201764864
1235289213186252802
1235289163055931395
1235288829717860353
1235288701321850887
1235288411377983491
1235288246864752641
1235287837945344000
1235287196661362688
1235287164864385026
1235287077442510848
1235286916444164098
1235286719769042944
1235286598054563842
1235286146155937794
1235285979524730881
1235285895143710723
1235285769876639744
1235285559607726081
1235285466544582662
1235285372692815874
1235285126109712389
1235285064663150597
1235284984958717953
1235284912380555265
1235284878637305856
1235284594326466560
1235284441574060033
1235283872964841480
1235283132955402241
1235282852964716544
1235282397488467972
1235281873770774533
1235281650000572417
1235281606379741184
1235281599291420672
1235281335230648320
1235281328192606216
1235281224173834240
1235281197481238528
1235280902835580930
1235280899962474499
1235280823101816838
1235280430301155334
1235279855941451776
1235279615607873537
1235279139575418883
1235279052807852043
1235278913913475072
1235278882883997696
1235278502330585088
1235278480457248768
1235278460957970433
1235278378619604992
1235278374332964873
1235278189309693952
1235278116978864128
1235277804431970304
1235277435723223040
1235277276314468357
1235277040242307076
1235276917336666119
1235276882079371266
1235276866568753154
1235276687425884161
1235276637408763904
1235276609374105607
1235276439865393152
1235276405853827079
1235276403328897025
1235276363256430597
1235276342377230336
1235276242770944000
1235275947978436625
1235275801270145037
1235275772149092353
1235275680704876550
1235275642905726977
1235275485006958594
1235275479147520003
1235275461636354050
1235275441977557003
1235275405172539399
1235275266198564867
1235275238964854784
1235275201228804096
1235274691318870017
1235274596993183744
1235274493637144578
1235274271737417729
1235274095266324480
1235274068875673600
1235274008372879362
1235273774834077697
1235273774595010561
1235273439247847425
1235273270628360192
1235273229742346247
1235273146720227335
1235273121793482754
1235273084619411456
1235273046346387456
1235272951307669504
1235272762068996096
1235272639435993089
1235272509928484866
1235272413438455814
1235271836650426373
1235271556114284547
1235271549571170304
1235271444596174849
1235271269937008641
1235270929023983618
1235270840176037889
1235270659149791234
1235270491683917824
1235270394606768130
1235270335932641280
1235270173667577857
1235270140016635905
1235269975172055042
1235269929517166594
1235269614835306497
1235269349314875393
1235269277739077635
1235269163377184769
1235269148034379778
1235269032506470401
1235268938860244994
1235268578175311873
1235268393701343232
1235268353348030464
1235268350785314816
1235268286146916357
1235268248310030337
1235268090801332224
1235267819031449614
1235267759828856838
1235267722126258179
1235267689939120129
1235267476277035015
1235267439044235270
1235267201629908993
1235267006867398660
1235266915972665344
1235266914701713408
1235266776499449858
1235266617199689731
1235266524383973376
1235266492113072128
1235266125925056513
1235266003145281536
1235265816461029376
1235265649485762560
1235265537476685824
1235265331444187136
1235265095267168256
1235265054737649666
1235264953793335300
1235264629821108229
1235264605011750913
1235264552998182913
1235264528578940928
1235264353907150848
1235264087598272520
1235264085559832576
1235263698362667010
1235263557996105732
1235263494603370498
1235263445597073409
1235263373970944001
1235263186951188488
1235263068554305537
1235262930930864129
1235262924962312200
1235262806318108674
1235262479971815425
1235262295195996162
1235262109988065280
1235261914810380291
1235261478267211777
1235261376790220800
1235261074800291840
1235260711833677825
1235260701226209282
1235260560868024322
1235260127730634754
1235260114375933954
1235259914404220928
1235259865381117952
1235259356322529280
1235259324018065408
1235259278254125058
1235259248046727168
1235259205155770369
1235259078068314112
1235259024116977666
1235258861700947969
1235258707501625349
1235258575389327360
1235258536302710785
1235258502823792642
1235257844578086913
1235257669633572865
1235257431107809280
1235257022859407361
1235256966097842177
1235256743602638849
1235256607057104898
1235256446914351104
1235256193028886528
1235256136179372032
1235256007338725376
1235255841458094082
1235255665066676224
1235255656942374915
1235255645579943938
1235255471747063813
1235255096574906369
1235255054308868096
1235254665274675203
1235254365461663754
1235254275376369664
1235254117569835008
1235254032031154181
1235253854381326336
1235253572385660930
1235253568954916864
1235253510075305985
1235253257267826688
1235252882980642816
1235252788336222208
1235252605003141120
1235252397959794692
1235252371028094977
1235252345321279488
1235252234839040001
1235252128026890242
1235252031042064391
1235252026998747138
1235251234354925568
1235251204822831104
1235251066230337536
1235251015282315264
1235250888299732993
1235250697395941376
1235250285024600064
1235249944572944384
1235249792227454978
1235249654482087936
1235249473414221824
1235249414689689605
1235249405298724865
1235249310608084992
1235249190256758785
1235249145897791489
1235248804246540289
1235248711585931265
1235248683530227713
1235248487580590080
1235248436301221888
1235248355103723520
1235248322908246016
1235248220806221827
1235248144981598213
1235248093861490688
1235247959635308544
1235247913619554305
1235247716344705024
1235247513764061186
1235247460416737282
1235247032769617920
1235246878658375680
1235246620641570819
1235246476240003073
1235246386662248454
1235246167459581952
1235245656903737344
1235245544513167360
1235245426418339845
1235245416595296261
1235245309611081730
1235245295476314112
1235245144523198465
1235245084733583365
1235244996418142208
1235244987404750854
1235244928168493058
1235244580624269312
1235244522558369792
1235244138569715712
1235244103023177728
1235244024723894276
1235244003970486272
1235243961574445056
1235243899108675584
1235243730841538564
1235243688923668483
1235243551065288710
1235243451651960840
1235242892039421953
1235242877606912002
1235242696840753153
1235242575382142976
1235242431509037056
1235242239284203526
1235242093267881984
1235242049844244480
1235241795006722056
1235241691113811970
1235241543453290497
1235241511970885632
1235241319116820480
1235241301236502528
1235241061871648769
1235240477416394753
1235240290052640769
1235240080270405639
1235239870169255941
1235239858760749058
1235239542095056896
1235239392962371586
1235239372145950721
1235239352902414337
1235239241036292096
1235239143799742465
1235239034873688064
1235238997376610305
1235238996890001411
1235238977382346752
1235238893122969600
1235238775292399616
1235238754736103425
1235238567514902531
1235238548065996800
1235238385800957953
1235238353890668545
1235238117088645127
1235237890445250560
1235237298544967681
1235237225509552128
1235237175932973056
1235237152595865605
1235237134514221059
1235237019758014467
1235236565716283392
1235236434895876101
1235236092393197576
1235236061384716295
1235236022616809475
1235235947077390336
1235235944980271107
1235235866571952129
1235235666683887616
1235235438488584194
1235234784265342982
1235234712983089153
1235234618737123328
1235234197461250049
1235234173151055873
1235234092867866626
1235233942967635968
1235233754387566592
1235233699752480769
1235233629397233673
1235233521956016136
1235233471985045505
1235233434810945539
1235233338165784576
1235233165373034499
1235232979615698945
1235232702896447490
1235232593190227970
1235232515159449601
1235231679507243008
1235231455246200832
1235231441736392706
1235231095060172807
1235230981839343616
1235230224767488008
1235229626714206208
1235229586377641985
1235229575040430080
1235229541783789569
1235229314377019392
1235229162643824640
1235229088421470208
1235229075045830659
1235229037536083968
1235228585977417728
1235228508399558656
1235228396029972480
1235228251620073472
1235228122544582658
1235227984652455936
1235227307029286915
1235226988320878592
1235226988111187970
1235226945702502400
1235226379010142210
1235226267252817920
1235226245908090880
1235226219152642048
1235225903237648385
1235225812296708101
1235225796765265921
1235225726963634176
1235225025629868034
1235224262350340098
1235224210991124483
1235223980317036547
1235223905230606336
1235223503059722242
1235223351213293572
1235223307030597632
1235222908034846722
1235222887860142081
1235222703684100098
1235222586914725890
1235222226196205575
1235222166670630912
1235221875153915906
1235221400690008064
1235221110175731712
1235220767102709761
1235220652577230849
1235220337417211905
1235219049963016193
1235218751915687938
1235218681082327041
1235218672211423232
1235218139488624640
1235217854779273218
1235217840187363328
1235217570468450304
1235217556585304065
1235217306160160768
1235217204121161729
1235216611944075267
1235216545493798916
1235216531522453504
1235216483116027908
1235216468184363008
1235216306145759232
1235216251686965248
1235216250172846080
1235216089849745408
1235216024397656064
1235215577033117702
1235215353174687744
1235215351606063104
1235215130486542337
1235214944888594435
1235214340409741313
1235214273984499712
1235214184872390657
1235214039032221697
1235214031574700032
1235213939186774016
1235213887429107716
1235213774552002561
1235213688010936322
1235213505097347073
1235213475900772354
1235213448352600066
1235213429071384583
1235213305830141955
1235213288847413254
1235213201014427649
1235213157427286017
1235213101588504577
1235213016133775365
1235212810583519234
1235212733160841218
1235212414288830465
1235212271913185280
1235212248555155456
1235212082011869184
1235211958099611649
1235211951892058119
1235211772270870528
1235211524752502786
1235211505345400832
1235211410566721542
1235211400236195840
1235211179603226625
1235210704657027077
1235210692493443072
1235210628467486721
1235210388884643840
1235210265534357505
1235210001154822144
1235209633008152578
1235209173538922498
1235209118060670976
1235209060221366272
1235208989559992320
1235208797578235904
1235208788308873217
1235208572574797824
1235208426130755584
1235208410892775424
1235208364465979394
1235208357310607362
1235207849040629765
1235207807638687746
1235207493346889728
1235207455761731584
1235207404050157570
1235207149640392705
1235207100453851137
1235206845867974656
1235206689323970560
1235206365179715584
1235206257310666753
1235206031350919168
1235205986144653314
1235205653527920642
1235205569952313348
1235205406231842816
1235205123531517952
1235204989250940930
1235204988667858946
1235204959551082496
1235204882132619268
1235204803007041537
1235204700888276993
1235204565764583426
1235204418515218433
1235204378929311744
1235204312722178048
1235203884685066241
1235203856264564741
1235203728736690177
1235203700811091969
1235203489401393152
1235203488524754945
1235202785198649346
1235202784456331265
1235202741716373504
1235201917179092992
1235201696877379584
1235201409907294208
1235201192264900608
1235201175911354368
1235200950920499200
1235200928040603649
1235200796242964481
1235200358009495552
1235200100571312134
1235199663155879938
1235199163937239042
1235198961356615683
1235198835087101952
1235198796138713089
1235198494652198912
1235198150492786688
1235198078669463553
1235197190680825856
1235197137404801029
1235196976494505990
1235196916528549888
1235196790812684288
1235196394396405760
1235196046629888000
1235195713694445568
1235195530327842817
1235195254854356992
1235195056916770816
1235195038910607363
1235194977220780033
1235194598680649728
1235194096483958784
1235194085801160704
1235193933195603969
1235193739972423680
1235193645139189760
1235193575111000064
1235192651433021441
1235192564329914369
1235192056638771201
1235191899679576064
1235191650546266113
1235191066644680705
1235190533976403968
1235190104530051077
1235189883985186816
1235189558624620546
1235189475409645571
1235189252041904128
1235189039554322433
1235188826974367746
1235188265701040128
1235187323689717761
1235186992381661184
1235186705206071298
1235186669671927810
1235186551623217154
1235186445108813824
1235186431515119622
1235186116141207552
1235185948083748867
1235185842395795461
1235185024493916160
1235184969779236864
1235184657781710848
1235184489858502657
1235183989306118157
1235183871580344321
1235183825728266242
1235183465064280070
1235182952318894081
1235182919058153473
1235182806860476422
1235182790225821697
1235182598261026816
1235182552480206848
1235182441977044993
1235182381985824769
1235181813846462466
1235181789305614337
1235181789188100098
1235181388321693698
1235181316339007495
1235180596948865024
1235180333244575744
1235180172263002113
1235180171705102336
1235179900774035459
1235179480861347840
1235179214099419136
1235178899316895744
1235178577823399936
1235177964012277760
1235177841400188929
1235177813176733696
1235177717131358211
1235177452537860096
1235177375840825345
1235177356995760128
1235177197754888195
1235177176749748224
1235177155107184641
1235177116033069058
1235176916761665536
1235176641875365889
1235176585881366528
1235176585348739072
1235176475399245825
1235175645941989376
1235175396796178432
1235175391188471808
1235175323261599745
1235175321302953984
1235174710394212353
1235174329379426305
1235174251734478848
1235174024243818496
1235173298083901440
1235173212759240704
1235173207247855616
1235173182375514112
1235173101207457793
1235172922018451458
1235172492144242688
1235172396778352640
1235171440414121986
1235171429609598977
1235171247723630592
1235171149111332865
1235171144652795904
1235170926746054657
1235170880948449280
1235170836925026306
1235170609635696640
1235170338184589313
1235170231309529090
1235170191983681539
1235170182215217153
1235170073737912321
1235170056071454720
1235169851917905925
1235169648490033152
1235169584577163265
1235169175569494018
1235169123329548291
1235168847382089736
1235168755719819264
1235168547338440706
1235168359794315264
1235168330186731521
1235168174250905600
1235168011029487616
1235167977315631110
1235167735505616898
1235167368097169408
1235167164497354755
1235167146533154816
1235166605434408961
1235166410239811584
1235166308536324096
1235166238931922946
1235165994726961152
1235165958848876544
1235165087402516480
1235164506164203522
1235164062356561920
1235163989748965379
1235163884354514946
1235163687763181568
1235163662157000705
1235163547358941185
1235163484964483078
1235163471970537474
1235163446410448901
1235163212330475521
1235163204701114368
1235163158521749505
1235162974177947648
1235162810621005826
1235162693721632768
1235162597919465472
1235162252220694529
1235161900717158402
1235161157666828289
1235160857090367488
1235160844692058112
1235160422040428544
1235160388980936711
1235160318474629121
1235160316574494721
1235160261209870336
1235159963783266306
1235159837706776576
1235159621238689792
1235159516897042438
1235159450765398019
1235159427872935936
1235159393412341760
1235159369316257796
1235159124377317376
1235158856017289216
1235158845770653697
1235158684629639169
1235158660965376000
1235158642019704832
1235158609383870465
1235158504467464196
1235158432816263168
1235158334413692929
1235157472266027008
1235157429110943744
1235157417559838721
1235156900649619456
1235156876112941056
1235156821947580417
1235156796064575488
1235156776598884353
1235156773457350656
1235156685720825856
1235156379977080833
1235156347345305600
1235156232836706305
1235155820737966082
1235155687690457088
1235155642962321409
1235155613291773952
1235155527748943881
1235155496937697280
1235155411990466560
1235155195740508167
1235155191822983168
1235155087447773184
1235155026429063169
1235154981394755585
1235154901984047105
1235154762603130881
1235154535393505282
1235154184468598784
1235154119519866880
1235153915362107392
1235153821283778560
1235153720708648960
1235153355216998405
1235153173284823047
1235153067890397185
1235153032821837825
1235152954484760576
1235152901577814016
1235152593510420480
1235152523150884864
1235152235081981953
1235152160574386176
1235152159584514057
1235152009281581057
1235152005016014854
1235151915807387648
1235151878989787137
1235151829677330432
1235151808793739264
1235151676350312448
1235151491561926656
1235151454748499968
1235151393247367169
1235150925435719680
1235150383124754435
1235150286227939329
1235150082229624832
1235150049887256576
1235149989543899138
1235149883948093440
1235149810862346241
1235149732881846273
1235149684836118528
1235149544947699713
1235149515637874689
1235149383072714753
1235148739897110528
1235148208449482752
1235147466074394624
1235147364907782144
1235147087374929920
1235147005707636736
1235146887977717760
1235146569646628864
1235145416179580935
1235145132166598656
1235145032765759494
1235144977229000704
1235144846756794368
1235144690338615298
1235144681719304192
1235144646562648069
1235144481827180545
1235144262242750466
1235144137755811840
1235144073033535491
1235143930460721152
1235143920679604224
1235143569289158657
1235143484526428165
1235143437030232066
1235143263734112257
1235143072272592896
1235143036499300352
1235142477721587712
1235142402542891008
1235142020743782401
1235141451518009345
1235141330193481730
1235141212354551808
1235140435691147265
1235140357601529856
1235140316077973509
1235140203427377153
1235140073093574656
1235139922329325568
1235139835234521089
1235139578853498881
1235139485840613377
1235139255170666496
1235139189831802881
1235139031312281601
1235138311057965057
1235138135752921088
1235138093818273792
1235138037509697536
1235137511502098432
1235137147734290432
1235137022253297665
1235136957111578784
1235136761816379392
1235136715389636608
1235136687115849728
1235136565166436354
1235136493137596416
1235136482731577344
1235136442776670209
1235136322915971072
1235135888407113728
1235135770337382400
1235135582919159809
1235135178227568640
1235135146002698242
1235134850501402625
1235134640278704128
1235134602186043394
1235134299818602496
1235134207917199360
1235134037272023040
1235133944967901184
1235133928794656769
1235132925634646017
1235132880415752192
1235132718415056896
1235132581160669185
1235132556615524354
1235132548499505156
1235131964526600192
1235131622271397888
1235131521524207618
1235131485264502785
1235131401059676160
1235131281119289344
1235131245111185413
1235131091176038403
1235130955750412289
1235130851538632704
1235130725634125824
1235130380639965185
1235130318509703168
1235130279540510720
1235129792258805761
1235129689150279680
1235129683487928320
1235129605490700295
1235129501421645824
1235129327706046464
1235129241227808768
1235129055999070209
1235128826075676672
1235128727501238272
1235128639244701696
1235128464925224961
1235128305898094592
1235128274428276744
1235128237921046528
1235127855555784705
1235127756633104386
1235127422489677824
1235127065147514880
1235126764013314048
1235126644089774080
1235126608173948928
1235126519388831745
1235126325817507840
1235126105436311552
1235125555940511745
1235125524894306305
1235125216998719488
1235124949821644800
1235124942271926273
1235124225909952513
1235124063133208576
1235123794370588674
1235123197151830016
1235123037533589504
1235122831324835841
1235122825494552576
1235122408580714498
1235122331380404224
1235122092489576448
1235121858229370880
1235121755657842688
1235121309157183488
1235121147768782848
1235120774312128512
1235120709652881408
1235120686756052992
1235120455616327680
1235120148606078977
1235119887397208064
1235119839204659200
1235119822339362819
1235119819151695872
1235119626733965312
1235119564393873408
1235119532231888896
1235119266959151104
1235118798115500034
1235118776972177408
1235118730738143232
1235118568330506241
1235118228285743105
1235117803662954496
1235117598196424704
1235117466964987905
1235117392155443203
1235117223225839616
1235117041205383169
1235117035941699585
1235116887899439107
1235116839040176128
1235116831804772353
1235116830697467904
1235116459233128448
1235115860148117504
1235115812798844928
1235115596359946240
1235115275692830720
1235115245561094145
1235115094914162689
1235115004220698625
1235114891062714368
1235114734648733697
1235114627505127425
1235114620425089024
1235114595326373888
1235114130694004737
1235113840016322560
1235113486541361152
1235113323659554816
1235113307142606848
1235113292667981824
1235113117761163264
1235112941042552832
1235112760968720384
1235112556609654785
1235111983705452546
1235111607723839494
1235111563599597568
1235111247504236544
1235110957128372224
1235110730518663168
1235110605394046976
1235110335297859584
1235109478501994496
1235109351469309953
1235109226772455424
1235109036967817217
1235108803386814464
1235108673426423808
1235108334849503233
1235108302083653637
1235108298505867264
1235108160945262593
1235108146583973888
1235108046436593664
1235107750486523904
1235107636644724736
1235107626729402368
1235107620270125056
1235107394956468230
1235107365201907712
1235107362924568579
1235107349846622209
1235106935474515970
1235106785578475520
1235106679332540416
1235106673972219904
1235106601041670144
1235106199395135490
1235106100413755392
1235106028745703424
1235105676017274880
1235105657801633792
1235105416842895360
1235105334684823552
1235104951887638529
1235104918228230144
1235104834019188738
1235104698375360513
1235104412374142976
1235104161135579136
1235103943799091201
1235103718242045952
1235103511903449088
1235103316390092800
1235103151541219328
1235103063527976962
1235102985547481088
1235102971970473984
1235102650003148801
1235102460202471424
1235102280883376128
1235101337848860672
1235101247180398594
1235100592407797760
1235100582710403072
1235100515773579264
1235100357916643328
1235100233563926529
1235100148553768960
1235100116987465728
1235099482863177729
1235099458259603456
1235099316244471808
1235099258019143686
1235099232878489600
1235099036492926976
1235098941386964992
1235098928632098821
1235098895396384768
1235098815205535744
1235098683600801793
1235098585005359104
1235098461415944192
1235097635171618817
1235097281767944195
1235097034136289280
1235096957057560576
1235096562646175744
1235096270001360896
1235096131098427392
1235095162646216704
1235094395830931457
1235094271952330752
1235093966149869569
1235093571289501697
1235093462157942784
1235093216854069249
1235092845364523010
1235092124208517121
1235091466944466944
1235091398178689025
1235091000806084608
1235090972804960256
1235090570684571648
1235090288898527234
1235090277053976578
1235090001680949248
1235089845904502785
1235088287829651456
1235088266933616640
1235087664077996033
1235087517793349633
1235087509748473857
1235087039847993345
1235086870490447873
1235086575857364992
1235086318243209217
1235086248269598720
1235086246017294336
1235085895260397570
1235085266605367296
1235085150406324224
1235085147038298114
1235084668564717570
1235084447042551808
1235084321926443009
1235084105005412353
1235083827879411712
1235083802365419521
1235083768622391296
1235083546802479111
1235083466233896961
1235083114998681605
1235082691264909312
1235081498274852866
1235081051648618501
1235080841786621953
1235080785465507840
1235080311651753984
1235080273227894784
1235079847501758465
1235079008460496896
1235077724537892867
1235077572897062914
1235077383704793088
1235077232889958400
1235076999401504781
1235075670759206914
1235075379595014145
1235074855831101441
1235074603493416962
1235073923726770183
1235070718007578624
1235070597886951424
1235070413706653696
1235069684019417088
1235069529992163328
1235069499465961472
1235069323946758144
1235069101497667584
1235065279157350400
1235065072067760128
1235062153498877952
1235061966764470273
1235061757393219584
1235061061142773760
1235058424632602626
1235053915906772992
1235051927953707009
1235045618856280064
1235037336057942016
1235034611295584257
1235032499421671427
1235031483007422465
1235030144965730305
1235024574984499200
1235022154422345728
1235010143139573762
1235007267751116800
1235006682272542725
1235006040833478658
1235003870444769280
1235002687806152705
1235001553976791040
1234995840470544384
1234994206893957120
1234993965344018432
1234992136501653504