1245863498795470848
1245863441039912962
1245863040538431488
1245862755157958657
1245862235487916033
1245861843937013761
1245861698008834049
1245861577288368128
1245861294781030400
1245861008603672577
1245860933315903488
1245860690675388423
1245860415940132866
1245860321987715072
1245860124620500999
1245859898685980673
1245859822177644544
1245859794176503809
1245859770147328002
1245859525179002882
1245859489061822465
1245859463812100096
1245859436033277952
1245859141710573568
1245859019593355265
1245858768958541827
1245858127452311552
1245857978353250307
1245857975094280192
1245857811189268490
1245857605311795202
1245857560554438657
1245857559833018369
1245857475623940096
1245857462588035074
1245857267179642880
1245856398212124684
1245855786581950465
1245855608235937793
1245855222708072448
1245854744859389954
1245854359331561472
1245854008079560705
1245853583502802945
1245853350995693568
1245852285479067648
1245852201462845440
1245851958637932547
1245851493590278144
1245850703437930498
1245850293180469251
1245850204017963015
1245849689125261312
1245849238900289541
1245849110399377408
1245847548427935746
1245847438260305921
1245847278851629062
1245847261273260033
1245847234220097542
1245846708451446784
1245845940264677377
1245845726866833409
1245845632893333506
1245845024002244611
1245843825639251968
1245843285652000768
1245843280698527744
1245842999407529984
1245842308009996288
1245842133422149632
1245842064098635776
1245842020238794754
1245841984474025989
1245841058623348744
1245840852053897217
1245840618519244802
1245840336246767617
1245840226616041472
1245840009044819968
1245839763283771393
1245837029839167489
1245836455018192899
1245836106760884225
1245835710495518720
1245835420199350282
1245834956997304322
1245834883919904768
1245834836389969920
1245834721075986433
1245834591731986432
1245834572606119940
1245834570374627329
1245834448383475712
1245834263615815682
1245834176051449856
1245834100998574081
1245833975567978500
1245833874258776068
1245833792817778693
1245833711943405568
1245833668137869319
1245833575590584320
1245833405524250624
1245833164695666689
1245833035011907584
1245832941688799232
1245832097442320399
1245831956329308163
1245831824242139136
1245831751911583745
1245831748434432001
1245831699742593025
1245831318648377345
1245830558766100480
1245830255258087425
1245830103730446337
1245830047534964736
1245829540183711745
1245829440120201217
1245829021260185603
1245828844344483841
1245828467305795584
1245828397139443712
1245827946344058880
1245826897122070529
1245826734336937984
1245826700224667648
1245826204877406208
1245826047964151820
1245825942255214594
1245825834239307778
1245825751653462019
1245825735195058179
1245825637580931073
1245825516508233732
1245825451118952448
1245825313642360832
1245825160092897281
1245825053721231360
1245825034230382595
1245824907738378245
1245824763571900417
1245824358603460609
1245823006607314945
1245822691338096641
1245822636149612545
1245822634425794563
1245822394889113600
1245822285275168768
1245822260662935552
1245822252140158976
1245822074054160385
1245821962276016128
1245821945729486849
1245821944097841153
1245821938674647042
1245821911134638081
1245821802196217858
1245821723754315779
1245821655861133313
1245821539003650048
1245821291615191043
1245821271239045121
1245821264196808704
1245821165119176706
1245821147469447168
1245821116150689794
1245820774017048581
1245820717133856769
1245820716366381056
1245820639694422016
1245820560468324352
1245820422765121536
1245820397913812994
1245820297347022849
1245820247569043456
1245820199355506688
1245820115993706498
1245820098222460928
1245819957956489222
1245819874590539776
1245819476697890816
1245819106055553029
1245819060216041476
1245818753440505859
1245818716018876416
1245818228045221888
1245818185619734528
1245818135149711361
1245817912524509189
1245817910754508801
1245817486400000001
1245817033641648128
1245816762484109312
1245816643412000770
1245816411315933184
1245816164573462528
1245815909941420033
1245815863695073281
1245815736192372738
1245815535562043405
1245815437344022530
1245815032774045704
1245814746311471114
1245814649456640001
1245814424889409538
1245814356279001088
1245814101479174144
1245813995661078569
1245813848348725248
1245813340779220992
1245813290858680321
1245813025057189903
1245812970439036928
1245812790159388676
1245811851923009537
1245811820251754498
1245811775360073728
1245811691914506251
1245811543612293121
1245811513971089409
1245811504873701377
1245810901594312704
1245810706127228932
1245810646177984517
1245810620320145410
1245810619443564545
1245810436429230084
1245810324164554754
1245810316174340098
1245810265511337984
1245810093209407488
1245810028617052163
1245809817870118913
1245809719106850816
1245809632448315393
1245809485702201345
1245809398250962946
1245809155585310721
1245809106184802313
1245809051465809920
1245809000534421504
1245808937544429571
1245808865213628417
1245808830438690817
1245808783277928448
1245808599135334404
1245808496710430722
1245808457141403649
1245808298143682560
1245808288844873728
1245808128786128896
1245808118828761089
1245808082552270852
1245808035844567040
1245807920530546689
1245807645434445824
1245807631442337793
1245807466115448834
1245807162200375297
1245807073927073792
1245806818510725121
1245806705419534336
1245806601451208706
1245806561458561027
1245806551073296384
1245806524666187777
1245806497914904576
1245806410446839808
1245806378045919232
1245806318927085569
1245806183228870664
1245806181903486976
1245806159765942272
1245805956363141125
1245805729816158209
1245805514962894855
1245805354300121088
1245805313149853700
1245805199370969091
1245805181545189379
1245805160347115521
1245805025106034688
1245804822562996224
1245804668573356032
1245804615490248704
1245804582208446466
1245804470153478145
1245804431418982401
1245804351664410625
1245804160726990848
1245804058700582914
1245803954585382918
1245803392062173186
1245803381697978368
1245803131029671938
1245803114491457537
1245802884177985537
1245802838153986049
1245802815018205184
1245802628434538496
1245802551389405186
1245802481076056066
1245802425413447683
1245802339484737538
1245802250217406465
1245802123146772483
1245802104750592001
1245802037377470466
1245801947061501954
1245801863406137344
1245801807097597960
1245801714277548032
1245801500414222338
1245801457489784833
1245801352288239616
1245801252560257027
1245801235023892485
1245801233258098688
1245801212278177798
1245801099535224833
1245800847520473091
1245800574173548545
1245800443181236226
1245800145909960704
1245800125722755073
1245800079606329345
1245800074397077504
1245800001370021893
1245799815226818560
1245799770251317248
1245799747987914753
1245799706409742338
1245799694758023169
1245799635416907777
1245799619377934338
1245799497487331331
1245799480584216579
1245799440088104961
1245799287059091460
1245799189348573187
1245799032817094658
1245799027708440579
1245799017596026881
1245798939988840451
1245798779065978883
1245798772921241601
1245798751635156992
1245798680172679170
1245798544478474240
1245798518666809344
1245798366593929218
1245797994479472646
1245797932122718210
1245797877269528576
1245797597253718016
1245797425891233792
1245797330760187906
1245797327983579138
1245797262376271872
1245796755171655683
1245796572664864768
1245796296734257152
1245796290899968002
1245796011504734208
1245795860501409796
1245795581768974344
1245795523346534401
1245795474231234561
1245795457890205698
1245795434599198727
1245795389195812866
1245795302306713605
1245795130935857152
1245794680547221505
1245794439475404801
1245794331262320646
1245794292284764161
1245794187632615426
1245793873751834626
1245793770102231041
1245793562018623493
1245793522462097410
1245793392543629313
1245792707697664001
1245792676001099776
1245792263495655429
1245792192989454337
1245792068347342849
1245792003499180033
1245791994917588995
1245791962101420039
1245791767582183425
1245791701291225093
1245791661789241345
1245791584584687616
1245791579127697408
1245791522215342083
1245791486123347975
1245791219768270851
1245791080219660289
1245790967338274818
1245790954293993473
1245790869178982400
1245790566270537728
1245790549401100291
1245790232462659586
1245789979529404417
1245789840014262272
1245789624821256192
1245789561634066436
1245789513147875331
1245789314035994624
1245789131873099783
1245789120930156544
1245789120737292292
1245789015200026624
1245788951958487040
1245788928780705793
1245788759980900362
1245788535963160576
1245788428983099392
1245788202302144512
1245787888723406850
1245787453593735172
1245787293945868290
1245787285934813185
1245787214803619840
1245787134356869120
1245787071911993350
1245787069110276104
1245786994141265921
1245786901484896260
1245786818643197954
1245786606856003590
1245786549641449473
1245786457681399809
1245786372004352004
1245786294145482752
1245786238755405830
1245786038762647552
1245785871162527744
1245785580996354048
1245785352742281220
1245785247603658759
1245785059346481153
1245785036726644736
1245785017579692037
1245784648497672192
1245784633230462978
1245784601513078787
1245784532214833152
1245784483070193675
1245784341059457025
1245784133969874945
1245784022481014787
1245783975873990656
1245783568908984321
1245783450562502664
1245783399350050817
1245783347072241669
1245783292357611531
1245783263114821638
1245783136648167425
1245782957585051648
1245782668232601604
1245782609025732608
1245782576821911552
1245782503799087110
1245782203285614594
1245782079918542850
1245782014407716864
1245781806873546760
1245781572109901826
1245781463452332034
1245781416023113733
1245781359379046400
1245781258652835841
1245780966557339656
1245780744745689094
1245780578936512514
1245780367551934465
1245780226333868033
1245779819536748545
1245779617396424704
1245779359388106753
1245778778342797331
1245778245867323392
1245778101306560516
1245777912042831874
1245777631942975488
1245777299858956290
1245776933524246531
1245776905284079617
1245776723863580673
1245776537351344129
1245776382128463873
1245776369600126976
1245776225152520194
1245775682187206668
1245775523692888065
1245775350401044483
1245775267454431232
1245775158037618689
1245774921642491905
1245774489062912000
1245773731017957376
1245773212631384070
1245773156125720577
1245773037154295815
1245772998424084486
1245772989209214977
1245772954664931331
1245772858833461250
1245772613391089669
1245772556042461184
1245772465789419522
1245772388102438912
1245772381966217217
1245772237329883136
1245772203221803009
1245772102600450050
1245771988737671179
1245771545752014848
1245771471546396673
1245771403011514370
1245771328277405696
1245771208857092097
1245771002568757248
1245770979592339457
1245770691871473664
1245770664637849600
1245770403756244992
1245770233157226496
1245770058950942721
1245770023421063168
1245769789764702208
1245769644255911937
1245769589453139969
1245769572302630913
1245769492296339456
1245769478274797569
1245769463552790529
1245769440152760327
1245769345743101952
1245769277556379658
1245769163706118144
1245769151718871042
1245769039093403650
1245768912614105088
1245768856674750465
1245768752798617600
1245768619088384010
1245768573844443149
1245768559738920965
1245768512745943041
1245768503417856000
1245768414603489281
1245768337830719489
1245768294629543937
1245768112705863681
1245767991087661057
1245767788389638151
1245767787303272449
1245767774510682115
1245767728780042241
1245767661369294851
1245767626095198210
1245767524815437824
1245767477134528512
1245767358163148800
1245766832000303105
1245766824517566467
1245766730674249729
1245766489686278145
1245766256504057857
1245766230528720897
1245766154360160256
1245766099465056256
1245765968590032898
1245765906971705345
1245765883982733344
1245765516356194305
1245765319534116869
1245765171538165766
1245765083298508801
1245765073068535808
1245765063673290756
1245765040487256064
1245764986863042568
1245764842042032133
1245764790104084483
1245764598424317952
1245764535136419843
1245764180206063621
1245764033304649728
1245763941390786565
1245763903457579008
1245763086692364289
1245762994883174400
1245762958074019840
1245762769464549377
1245762643576709122
1245762519915888640
1245761837871894529
1245761823804198914
1245761656023638016
1245761407293022208
1245761027708522496
1245760490778824704
1245760388798377985
1245760366795272195
1245759893333856257
1245759619978452999
1245759465535700994
1245759406328950784
1245759250141450245
1245759213814628358
1245759015407230978
1245758752416030720
1245758693221838848
1245758323456180225
1245758123551449089
1245757817660805120
1245757664925229062
1245757314294075393
1245757198560628739
1245757157376737281
1245756992167256065
1245756795517308928
1245756786092769290
1245756687958581248
1245756519968317440
1245755834812039169
1245755803858067467
1245755762497986560
1245755621682659330
1245755445995806725
1245755276806029313
1245755021469376515
1245754371234816000
1245754276615524352
1245754017608880128
1245753742810628096
1245753612648828930
1245753523788185601
1245753126952591366
1245752279648677890
1245752087293673472
1245752070965268484
1245751239515742208
1245750891052924932
1245750802855202817
1245750770387103751
1245750283608764416
1245750114066587649
1245749915634016257
1245749218167476225
1245748717292064770
1245748298541142016
1245747983108448258
1245747944822800384
1245747684314501122
1245747613854584835
1245747601091280896
1245747340272701442
1245747101880979457
1245747061280124928
1245746747642646529
1245746650213232642
1245746527047467009
1245746393853157384
1245746282502782981
1245746067506974723
1245745859209412608
1245745788392738816
1245745485148798979
1245745461882994701
1245745406438506502
1245745034651197441
1245745027873210368
1245744978321702915
1245744773786370050
1245744064064114689
1245743953284128768
1245743816688250880
1245743710664523776
1245743036426080258
1245742748889743360
1245742738936598533
1245742400389230593
1245742221787312131
1245742089905885184
1245741614175305728
1245741535120916480
1245741487310209027
1245741474358218753
1245741448479244288
1245741440833073158
1245741403407355904
1245741393659789318
1245740709392629763
1245740526604881925
1245740485983027201
1245740079794003968
1245739782308876288
1245739402103578625
1245738866184720387
1245738630502547460
1245738447869968385
1245737896998510593
1245737511193894912
1245737189972930560
1245737095190249473
1245737031382241280
1245736199429521410
1245736093225553922
1245735250984144896
1245734768580472833
1245734271530209283
1245733974980386820
1245733858106097666
1245733506229178368
1245733212711792640
1245732535323295744
1245732014868836352
1245731644075659267
1245731637897375751
1245731435379593216
1245731303632375809
1245731255951466497
1245731246027743245
1245731162850541568
1245731127509372931
1245731113768812545
1245730762055352320
1245730705235116037
1245729655950323712
1245729523649466369
1245729507983622145
1245729251149701120
1245729169809555457
1245729066508001280
1245728988414259207
1245728438050267137
1245728180004143105
1245727952190521345
1245727527156531201
1245726795032334336
1245726511849779207
1245725579632050176
1245725576880668674
1245724764427243521
1245724675394670594
1245724268794712064
1245724061768077323
1245724018029756421
1245723931308367872
1245723872575528965
1245723851046166530
1245723466587934724
1245723120650125312
1245722626250682368
1245722400144216066
1245722382272208897
1245722351398006792
1245722323640094723
1245721918206066689
1245721813902135297
1245721748508639233
1245721284547358720
1245721270219669505
1245721006133649408
1245720924894253056
1245720703799824384
1245720353919438849
1245720097223782402
1245719974888591362
1245719752632385537
1245719715265359872
1245719444078419969
1245719214880669698
1245719068419788800
1245718789414694913
1245718594949992448
1245718451982925824
1245718183128039432
1245717654427574272
1245717574756765701
1245717362013323266
1245717266479616001
1245717157046030336
1245717114373181440
1245716757337329664
1245716707425030149
1245715264580341762
1245715198390013955
1245715036611510272
1245714508347293697
1245714095497715714
1245714023196372994
1245713577186598916
1245713306242953218
1245713249926033412
1245713027783102464
1245712970975510529
1245712902155382785
1245712817258483712
1245712739252801536
1245712702821011456
1245712659674271745
1245712495362355201
1245711096243261440
1245711038454120448
1245710959555084289
1245710731674353665
1245710664234160131
1245710662074073090
1245710336696692736
1245709977647448064
1245709908009463809
1245709794561986561
1245709383604088832
1245709207799808000
1245709192649940992
1245708914534027264
1245708408369668098
1245708268951011334
1245708129016393730
1245708030831783936
1245707934941790214
1245707833859022853
1245707696210395136
1245707579554181122
1245707096819208196
1245706684695285760
1245706141088256000
1245705728024862721
1245705474038812673
1245705411031859205
1245705226398715906
1245705171402919938
1245704593906040835
1245704405111930882
1245704318952628227
1245704132088016897
1245703705724420096
1245702960857993216
1245702758855999488
1245702690535084034
1245702308387786752
1245701978560385025
1245701853159084032
1245701723475390467
1245701505459671040
1245701482420342786
1245700995352604673
1245700979548438530
1245700850812665856
1245700713788903425
1245700381180649472
1245699820976816130
1245699784566079490
1245699643742334976
1245699448031842304
1245699344780713984
1245699060654321664
1245698969382064129
1245698961610018816
1245698895839191041
1245698885688926208
1245698839052517378
1245698272804720642
1245698242207236096
1245698168777510912
1245698075223605249
1245697708242939906
1245697623396364289
1245697290507104256
1245697110156226563
1245696997744615427
1245696897500745734
1245696558089338882
1245696254035795968
1245696234234482689
1245696198159339521
1245696010132881409
1245695230516568108
1245695224409661440
1245694789724647431
1245694721852346368
1245694561000861697
1245694483162894336
1245694379383304192
1245694009449877504
1245693949278334978
1245693518355419137
1245693481995186176
1245693433819410435
1245693305083572229
1245693117447254018
1245693087516700672
1245692711841280001
1245692565652942848
1245692498661584897
1245692402817474561
1245692265739227137
1245692063343169539
1245691884011433985
1245691470100803586
1245691405357514760
1245691381185683456
1245691322205429760
1245691109453574146
1245690849251467264
1245690746373582848
1245690639251058689
1245690450469584896
1245690410749644803
1245690229694087168
1245690222865715201
1245689991780540423
1245689909093990401
1245689852189958144
1245689773701898240
1245689568034271234
1245689498681384962
1245689398697525248
1245689348382744576
1245688957184217088
1245688612978597889
1245688366722662401
1245688355863629826
1245688246522318849
1245688209075552257
1245688206055571456
1245688188171177985
1245688002497482752
1245687822541041666
1245687396995391489
1245687340166717440
1245687187636727811
1245686983944527872
1245686864335515648
1245686809834774529
1245686583455514624
1245686545375531010
1245686395273973760
1245686274649964546
1245686205284564993
1245686028444282881
1245685827692302336
1245685420991619074
1245685363248685099
1245685015863857153
1245684861203070976
1245684540858925057
1245684457883009024
1245684433870639104
1245684311447220224
1245683974040674304
1245683850983989250
1245683725796605952
1245683633165340672
1245683527871614977
1245683040975826944
1245682921207410688
1245682871676866560
1245682801011286016
1245682757927403521
1245682721575370752
1245681745061707781
1245681664262647809
1245681585543950346
1245681579512512512
1245681518216990720
1245681323282509824
1245681129425981442
1245681048861560832
1245681008315375616
1245680993866067968
1245680792694595589
1245680583335915520
1245680542403768322
1245680327735066624
1245680109425754112
1245680093520936960
1245679692264411136
1245679586823802880
1245679215414071301
1245678916330807298
1245678603708379137
1245678014026874880
1245677779745636352
1245677769469636608
1245677574660993024
1245677161173979136
1245677108317347843
1245676995255635968
1245676829068996608
1245676750299955201
1245676730733469696
1245676554362875904
1245676536973459466
1245676478991421442
1245676457088692224
1245676443125919744
1245676413602201604
1245676375597633537
1245676299043168256
1245676174719750144
1245675701216346117
1245675659244036098
1245675638805147654
1245675438984302592
1245675370940108801
1245674915744952322
1245674840356503553
1245674789546668033
1245674456175050753
1245674323538477057
1245674262373044225
1245674240394829824
1245674212511055872
1245673987100852224
1245673697937063937
1245673485290082306
1245673306881220608
1245673274203389952
1245673109300092929
1245672927527387136
1245672868173746177
1245672858900213760
1245672758853468161
1245672680910737408
1245672629517901824
1245672472508334080
1245672385845571585
1245672379830976512
1245672345852874757
1245671883858751488
1245671865516949504
1245671453799874561
1245671346257920001
1245671190603214850
1245670941537042433
1245670826235527169
1245670748980740097
1245670690826706944
1245670518415638528
1245670480599801857
1245670135450472451
1245669886665375746
1245669495621980162
1245669464886185984
1245669367284666371
1245669319062806528
1245669005819555841
1245668868921622529
1245668553493282816
1245667710836637696
1245667510713753600
1245667092445245440
1245667055233310721
1245666862286897152
1245666854292590593
1245666489530757120
1245666377895116800
1245666362585804802
1245665903452225538
1245665764906057728
1245665727262199809
1245665700196298754
1245665692143190016
1245665619514732550
1245665605375741952
1245665425255522305
1245665391462043648
1245664972639817728
1245664746877136897
1245664568971595777
1245664351165526017
1245664271083679744
1245664259331276801
1245664051960729600
1245663973732728832
1245663860423614465
1245663376933519361
1245663152441905160
1245662668603744257
1245662289887404032
1245662262632886272
1245662150095495168
1245661878380048384
1245661768560644097
1245661735526285317
1245661634519093248
1245661543930515458
1245661325860184064
1245661056178851843
1245660847709376514
1245660804445138947
1245660626459832320
1245660549238546434
1245660270640295938
1245660062724411392
1245659865252421634
1245659358056173569
1245658651060129792
1245658605224787969
1245658472198180866
1245658326404227073
1245657919762259968
1245657764136804354
1245657532510568448
1245657443188609025
1245657237151838215
1245657165391511552
1245657027155644417
1245656862457921537
1245656509226176516
1245656234566365190
1245656135689887746
1245656014474493959
1245655966101594116
1245655913999904770
1245655451854749702
1245655415037128705
1245655221805535233
1245655021338775557
1245654805558595585
1245654675656814600
1245654635899052033
1245654439936942083
1245653805628178434
1245653417294323712
1245652929710718978
1245652710541504513
1245651975150006272
1245651923040010243
1245651762599493633
1245650901685006337
1245650369134223360
1245649879017242624
1245649668614139912
1245649563068665857
1245649236215005191
1245648711117504515
1245648457060122625
1245648382263058433
1245648261483859970
1245647951550021634
1245647686549700608
1245647671978672128
1245647258005024776
1245647159967375361
1245647080044941313
1245646955935481857
1245646711352995842
1245646398260830208
1245646361166376960
1245646307491901440
1245646278907723776
1245646242303991811
1245646075945312260
1245645624839524353
1245645488314933248
1245645086802640897
1245645026257854465
1245644941394448390
1245644363067097089
1245644214802628610
1245644079330783239
1245643850418286595
1245642592672350209
1245642490515869696
1245642476557238273
1245642422429745154
1245642261125193734
1245642170750525440
1245641874603307014
1245641100179603456
1245641013160366081
1245640894474158086
1245640872407871491
1245640857971113984
1245640807115141120
1245640622372818946
1245640521411727362
1245640060889776130
1245639958825562112
1245639401239003138
1245639334713159693
1245639081188413440
1245638573530861570
1245638519357235200
1245638322879205376
1245637917025775618
1245637678860623874
1245637227905875972
1245636942537969664
1245636815165353984
1245636555500171267
1245636443852034048
1245636198376165376
1245636143384682497
1245635975461527554
1245635842120380417
1245635608048877574
1245634098023911427
1245634074732986370
1245633760273416193
1245633659165487105
1245633327266066433
1245633118431670273
1245632582890340353
1245632267810004992
1245631532997337088
1245631048169340930
1245630995706941442
1245630565891497991
1245630311217520648
1245630123404963842
1245630098197241857
1245630062096814083
1245629995243823109
1245629655412957184
1245629608549994496
1245628899326738432
1245628667343958017
1245628632271216640
1245628309733433344
1245628084201459712
1245628073808019460
1245627974168109057
1245627713286598657
1245627586278879232
1245627416120188929
1245627166676533250
1245627150239027203
1245627114033840128
1245627079657324544
1245627040109170688
1245626985444868096
1245626874752983042
1245626833560731648
1245626774383251457
1245626671761260546
1245626618598445056
1245626601888296962
1245626024349466626
1245625951993487360
1245625814885920769
1245625518294052864
1245625060112478209
1245625053464506371
1245624760827908098
1245624742448488448
1245624642632437761
1245624025725820928
1245623592114511872
1245623539853451264
1245623426678525960
1245623115322814464
1245623087355146240
1245622948423036933
1245622507362639872
1245621772797394947
1245621373298335750
1245621308802531329
1245621222857031681
1245621190040813571
1245621180586848256
1245621169656487936
1245621156868063235
1245621145262407680
1245621133711294464
1245620998709231617
1245620915938844674
1245620860322320390
1245620717145604097
1245620354032132096
1245619984824328192
1245619746671718401
1245619615322923008
1245619606758154241
1245619380408291331
1245619338326884353
1245618908276518914
1245618866912251904
1245618780383805441
1245618517635784705
1245617266856587265
1245616552876978186
1245616426288726017
1245616335238750209
1245616298710585345
1245616161544228865
1245615847751577602
1245615828663300096
1245615329436250113
1245614980134604800
1245614455129432067
1245613800444706816
1245613416993050626
1245612921477935108
1245612335688863747
1245611800546004994
1245611116023017472
1245611083655598082
1245610903728345089
1245610821687771141
1245610729345957890
1245610322724925440
1245610169922273282
1245610130818785280
1245610126251143171
1245609746922536968
1245609686700683266
1245609592827961346
1245609351135416337
1245609278364209155
1245609233610989571
1245609209955151873
1245609181291266050
1245608932749393922
1245608863174250497
1245608857109315584
1245608838692134917
1245608446084317186
1245608137404469248
1245608137047937024
1245607935029342211
1245607924560310272
1245607761863258112
1245607335705186304
1245607285004455939
1245607257426915329
1245606928249544705
1245606853502889984
1245606721411674114
1245606518382153733
1245606279822757889
1245606156925452295
1245605797809123330
1245605627876892675
1245605437921054721
1245605279388991489
1245604320252289025
1245604223347077125
1245604170473680897
1245604079331471362
1245604053028966400
1245603945113776128
1245603225983545344
1245602681252544519
1245602124169265152
1245601882623496193
1245600641172434953
1245600258534432768
1245600233100161024
1245599983576829952
1245599331391950848
1245598533777895426
1245598430732234754
1245598084651872257
1245596851278974976
1245596793968025600
1245596278999756801
1245596224037605376
1245594765451616258
1245594553635102722
1245594130786344960
1245593359969730560
1245592862055530496
1245592818665418755
1245592601341747202
1245592354892828672
1245592195240873991
1245591960280129537
1245591896744792065
1245591236884312068
1245589763559542784
1245589730525196288
1245589697142775808
1245587384382541828
1245587347887910913
1245586976092246016
1245586824115830784
1245586426437070852
1245586363224715272
1245585664080396291
1245584220832980993
1245583660268437510
1245583656929726464
1245583557617012739
1245583364070858752
1245582950441209856
1245581241627246593
1245580892812144644
1245580767213699073
1245579363124260865
1245579055597936640
1245576819731861504
1245575674649145349
1245574179744673792
1245574044767797254
1245573898151718913
1245573645386125313
1245569786030854146
1245569268487303169
1245568778252849154
1245563972524351489
1245563961908629505
1245563317260890114
1245561976874565632
1245561963943538688
1245561428096045056
1245559291047747584
1245556199040471044
1245556161836802051
1245554233719562240
1245553637918683136
1245553488601513984
1245543144344649728
1245541594410909702
1245536594280488960
1245536162304966657
1245533459134722050
1245533357729034241
1245526873263820802
1245525203100356608
1245524671531044865
1245514833442807808
1245512907779170309
1245511232184029184
1245510189354225670
1245505864976543744
1245505239630917633
1245503982845530113
1245503292605706240
1245502792246210560
1245502632824844294
1245501519325286403
1245501459673812996
1245501386151911425