1242964233920352258
1242964060741734402
1242963968995602432
1242963960229515266
1242963655861264384
1242963486352834560
1242963317796286465
1242962943660232705
1242962889708896256
1242962683172990979
1242962522271031303
1242962484400717824
1242962044313272320
1242961741438267394
1242961483715280906
1242961169318580226
1242960969380347905
1242960558640582656
1242960074408112128
1242960025414402049
1242959828634480640
1242959675085205505
1242959177300893696
1242959049378988038
1242959002641862663
1242958815630364678
1242958621673209856
1242958418450792449
1242958279430623234
1242957795890270208
1242957633792835584
1242957554180915200
1242957363235168260
1242957348387332098
1242957153536786436
1242957138755977216
1242957128681295872
1242956742188847106
1242956731740717060
1242956474634186753
1242956418396946437
1242956337274855424
1242956188007968768
1242955903479025664
1242955297091657728
1242955040584871937
1242954933097377798
1242954605476134918
1242954460248367104
1242954037085044737
1242953783115689984
1242953775201038338
1242953758113517568
1242953613317677058
1242953599409422338
1242952967541731331
1242952822464880641
1242952810985127938
1242952608186318848
1242951893715992576
1242951697825009665
1242951564605652992
1242951506787209216
1242951291367763970
1242950578726199305
1242950444315533312
1242950309175013376
1242950009919803392
1242949797449011201
1242949407911354369
1242949202654695425
1242949133159333888
1242949074430681090
1242948749153972230
1242948669487398912
1242948148684783620
1242948075028713473
1242947792525541377
1242947668294406144
1242946952662319107
1242946909813313537
1242946729445597185
1242946664844931074
1242946652371128320
1242946197368770560
1242946127864963072
1242946100635537411
1242945994062475264
1242945602914312198
1242945459775209472
1242945402216865794
1242945320532795393
1242945314392354823
1242945101632016389
1242945081675579393
1242944748660367360
1242944634533355523
1242943674604027904
1242943163913953282
1242943108079325184
1242943011878768642
1242942957793300482
1242942703337431040
1242942412063981568
1242942396918304786
1242942377930752001
1242942208791150593
1242942157884882948
1242941985079656449
1242941701276262400
1242941649732411393
1242941316511797250
1242941178091384838
1242941053168214016
1242940899967016964
1242940898079576066
1242940853229883392
1242940800272564225
1242940538103439365
1242940381198680066
1242940325460467712
1242940257223483392
1242940138705113088
1242939827412180993
1242938921429991425
1242938311225810944
1242938181940580360
1242937831846301698
1242937825273806849
1242937567261200385
1242937421194506240
1242937378383200256
1242937223525412866
1242937006738608128
1242936953848377344
1242936942821552131
1242936932059013120
1242936621638520839
1242936555095941124
1242936168574005256
1242935817653411840
1242935795255738371
1242935728457342981
1242935509703417856
1242935431647412227
1242935086854688768
1242934980914929665
1242934668288278529
1242934543226753024
1242934489636012035
1242933985837277185
1242933819449184262
1242933674724798467
1242933397749727235
1242933267499831299
1242933159450247168
1242933117595398144
1242933085353791488
1242933014541340672
1242932976314441735
1242932867270938625
1242932833527705600
1242932828293206016
1242932754137964545
1242932712882819074
1242932507596722176
1242932463837556743
1242932297378213895
1242932136367271936
1242932006356422656
1242931873111773184
1242931752986914816
1242931442595790848
1242931440737714183
1242931325453176834
1242930994371612676
1242930653705854977
1242930627361550336
1242930613633650689
1242930398147084293
1242930307365568514
1242929958969802752
1242929949360693250
1242929515124404225
1242929446597939207
1242929374216753156
1242929327739723776
1242929061309173762
1242928974101123074
1242928601995108352
1242928578477600775
1242928551223058433
1242928303046103052
1242928300210769922
1242927873914175489
1242927707534606341
1242927683467726848
1242927321721552896
1242927058143129604
1242926991281729539
1242926833370370054
1242926065170997248
1242925824854163458
1242925577423781889
1242925219486019584
1242925218991165440
1242924941802168321
1242924794099707908
1242924612331220992
1242924607310573570
1242924581679247360
1242924536313647111
1242924418915016708
1242924388191801349
1242924278913421313
1242924191306915849
1242923892781527041
1242923861567516675
1242923541802205188
1242923516086956033
1242923170258128898
1242923052381409286
1242923032546590726
1242922803839619072
1242922749670174721
1242922452239466496
1242922164132741123
1242922051670859777
1242921482805809152
1242921319898869760
1242921194812329984
1242921158330265602
1242920659505856515
1242920584838811649
1242920557374509062
1242920503477665797
1242920498423574529
1242920120374026240
1242919849250172930
1242919499671711747
1242919390812811271
1242919116534620160
1242918568410386432
1242918537158680577
1242918313140813825
1242918268190498816
1242918012954587137
1242917987696377856
1242917965399494661
1242917728400351232
1242917515174559744
1242917425907216384
1242917324094611463
1242917171883376642
1242917147975864321
1242916967071301633
1242916666004181000
1242916552862846976
1242916367977807872
1242916292438437896
1242916289989021696
1242916270103826434
1242916239552512006
1242916191397654528
1242916142978674691
1242916117158473732
1242916069464997889
1242915975508475904
1242915934077161477
1242915656829480961
1242915477518790657
1242915315887022083
1242915075691810816
1242914959031492608
1242914945920110592
1242914927171510272
1242914807088582656
1242914480058753024
1242914459045281792
1242914295492620289
1242914033713512449
1242913855195529216
1242913850271371271
1242913760907530244
1242913598055251969
1242913440114540555
1242913352172658689
1242913213223665664
1242913136723836928
1242912979852627969
1242912893995307010
1242912764147970055
1242912445812707333
1242912315911163904
1242912286873976840
1242912243152453633
1242912114802638852
1242912000986025984
1242911944874622976
1242911939141001216
1242911478430208000
1242911370577940480
1242911203791421448
1242911081653288963
1242910967253676035
1242910789599744000
1242910674570883072
1242910592865722368
1242910427060854785
1242910051125342209
1242909948004249603
1242909891355910147
1242909730554687488
1242909729447346178
1242909635570524165
1242909436441739272
1242909382230278148
1242909362407997440
1242909168773840899
1242909085877534722
1242909024116453377
1242908915031060482
1242908768955924485
1242908759258791936
1242908624801988610
1242908587753644036
1242908583840419843
1242908470053142530
1242908356358156289
1242908322648469512
1242908305309282305
1242908212950695939
1242908136710770688
1242907801128755202
1242907628159860736
1242907472920281090
1242907200969797633
1242907054148329486
1242906863085195266
1242906801823256579
1242906544343322624
1242906479289602049
1242906319566372871
1242906175454228481
1242906121029005312
1242905749292036096
1242905640626008075
1242905565090758656
1242905182624796673
1242905109308325888
1242904970862739458
1242904846472224770
1242904807607844864
1242904633451991042
1242904459417616385
1242903790975627265
1242903753138765827
1242903655046615041
1242903420899594241
1242903376683315200
1242902925267144708
1242902889305124866
1242902601789816835
1242902480746405890
1242902342871273472
1242902219625836546
1242902175543689216
1242902133026013188
1242902103040892928
1242901984522514436
1242901913055703040
1242901894575673347
1242901825478709249
1242901731983458306
1242901722961457153
1242901597740584968
1242901473165545474
1242901453108379660
1242901372355465217
1242901289287245825
1242901248300527617
1242900691301076993
1242900417908035584
1242900112168321024
1242900005079461889
1242899913324867586
1242899740955684864
1242899418858356745
1242899199496241154
1242899188922363913
1242898956520173569
1242898652085043207
1242898337772298248
1242898320022032384
1242897815577268225
1242897785575407617
1242897737252777985
1242897355889872896
1242897212415377408
1242896914783383553
1242896493889101826
1242896485169143813
1242895950911287299
1242895777132929025
1242895619733237761
1242895424349929474
1242894973189660674
1242894920681168901
1242894769325555712
1242894470561046528
1242894380895277057
1242894130079989771
1242894058231599105
1242894018134118401
1242893717121519616
1242893701933944832
1242893667393830912
1242893392922775552
1242893289675788290
1242893220440350722
1242893097857683458
1242893077389418499
1242893047374979073
1242892949404483584
1242892936897069060
1242892807364280322
1242892751814959105
1242892481982799872
1242892393139093505
1242892323903733761
1242892315817058307
1242892076804648961
1242891942792507393
1242891541112332288
1242890915787821056
1242890140466524161
1242889518090518528
1242889453925957632
1242889303463690242
1242889027239514115
1242888970431795200
1242888928581111809
1242888796603121664
1242888792626913281
1242888695960698881
1242888649471143938
1242888550204542976
1242888515928698882
1242888372282101761
1242888313444450304
1242888201951416324
1242888092610179073
1242888000603934720
1242887995314896899
1242887984451551233
1242887898275483649
1242887895188410373
1242887857188069382
1242887807787556868
1242887797679296518
1242887780667199489
1242887775294291968
1242887687868239873
1242887613045968896
1242887535564656640
1242887469936324613
1242887410947706880
1242887192051175424
1242887185768087552
1242887027202260992
1242886752647471109
1242886733945024514
1242886700348723200
1242886613237149697
1242886524859035649
1242886457095868419
1242886343073685510
1242886291567652865
1242886287054589955
1242886131785641984
1242886118179291136
1242886111950708737
1242886075216953344
1242885955272531968
1242885941628243968
1242885878709661696
1242885813945458694
1242885800997670913
1242885687168372736
1242885639441395713
1242885602858668034
1242885551709184000
1242885504657436677
1242885374545932288
1242885347933118467
1242885060052881413
1242885039752458242
1242884994764288005
1242884553812987908
1242884489556176896
1242884417611333632
1242884165982277632
1242883961132593155
1242883757339750402
1242883689073258503
1242883553131626496
1242883470529048576
1242883236897882118
1242883124620431360
1242883088973168645
1242882983092260866
1242882755609989122
1242882657685590016
1242882525749542913
1242882475556253700
1242882359818694656
1242882294320369666
1242882285617270785
1242882282832134155
1242882017756405762
1242881659386593283
1242881598225342465
1242881440028778498
1242881294943555584
1242881170393743360
1242880953414045696
1242880877975220226
1242880608524816387
1242880601767755776
1242880527041990661
1242880341515395073
1242880195092250625
1242880077655871488
1242880046060232707
1242880038380371969
1242880011268427776
1242879686813913088
1242879635362381826
1242879549106540546
1242879454210338817
1242879310614147077
1242879246395154432
1242878917502996480
1242878750150275072
1242878635935178755
1242878571946835969
1242878330631786496
1242878203028520965
1242877983712567297
1242877932038688769
1242877884143984641
1242877771115790337
1242877638852653056
1242877613078720512
1242877465959313408
1242877446506065921
1242877251005419525
1242877090942332929
1242877012555051012
1242877003591749633
1242876566318841859
1242876412736016384
1242876255101476866
1242876113778610177
1242876019209637890
1242875796223647744
1242875787109335046
1242875720570986498
1242875448117334018
1242875213190234112
1242875115060310018
1242874806774706176
1242874788542103554
1242874752181600256
1242874530403663885
1242874426728886274
1242874158972899337
1242874020527321089
1242872945850146816
1242872879815024645
1242872865181106178
1242872837674807297
1242872115658993667
1242871413406601217
1242871406129483777
1242871380510679047
1242871310356746241
1242870844470296582
1242870619932446721
1242870355401867264
1242870290000027648
1242870083308998656
1242870051465834499
1242869938899038208
1242869904472236032
1242869848616644616
1242869390909063168
1242869381652234240
1242869303868784646
1242869294238707713
1242869002482966529
1242868920123564033
1242868857200615427
1242868839823654912
1242868701361209345
1242868658927538177
1242868324641497090
1242868201043755009
1242868185617043456
1242868140641583109
1242867897246068736
1242867849263267841
1242867830820913152
1242867598016032769
1242867513668624384
1242867495939309569
1242867481728909314
1242867440817766403
1242867415974916097
1242867340712316932
1242867065385619456
1242866926973521920
1242866811877699587
1242866558013243393
1242866271903002629
1242866185865252866
1242866051035148291
1242866044760449025
1242865778401181698
1242865758499229697
1242865544312872960
1242865101193052160
1242864995928547328
1242864813514031104
1242864763132133376
1242864472055853056
1242864449503068160
1242864361103859715
1242864258855120896
1242864013744246786
1242863965786570752
1242863943305048065
1242863854146785285
1242863791752253441
1242863747426914304
1242863574311219206
1242863477313675265
1242863371982000128
1242863331783905280
1242863184186413058
1242863172979228676
1242862902509539332
1242862724121591809
1242862356595605509
1242862311565594624
1242862272508280833
1242862223233404928
1242862175716286467
1242862058401673216
1242861637591339008
1242861569526181888
1242861472054681600
1242861431982350337
1242861346905042947
1242860414678990854
1242860050420506627
1242860040786247683
1242859763760840704
1242859724384632837
1242859713030696963
1242859238298353665
1242859205813587975
1242859083578978306
1242859024711892995
1242858931384471552
1242858830800785411
1242858757044011013
1242858652576473088
1242858633161039872
1242858576244355081
1242858552198381571
1242858532917125121
1242858513233334275
1242858389094502400
1242858367539961858
1242858087444353028
1242858050249244672
1242857997774323713
1242857871739621380
1242857616038076425
1242857577450557442
1242857358386171905
1242857326014386176
1242857297849745411
1242857225657425922
1242856995146866688
1242856838468599813
1242856681912090624
1242856647606906881
1242856308694532097
1242855798021242881
1242855787594166274
1242855430935756800
1242855275775897602
1242855248307326976
1242855246021484548
1242855057743380481
1242854902101168128
1242854796907945984
1242854370368258048
1242854047549399041
1242853693785063425
1242853419657965582
1242853225008713740
1242852969571368962
1242852896623988736
1242852789275033600
1242852611247591424
1242852555643924483
1242852553391583233
1242851943590092800
1242851594246459393
1242851532355272704
1242851522553266177
1242851490886299648
1242851486964633600
1242851464751374336
1242851446770610176
1242851224396992514
1242850864987090944
1242850807365713922
1242850666525143041
1242850415013761026
1242850126407831554
1242849984531357696
1242849904151715840
1242849859234906118
1242849723742072833
1242849383349174272
1242849344476401670
1242849047045644291
1242848937654071296
1242848911150153728
1242848558799294469
1242848442260619268
1242847948456841217
1242847771692093440
1242847312810041344
1242847266324369409
1242846518551478278
1242846413664530437
1242846384203628544
1242846292075786240
1242846226963410945
1242846152111906819
1242845996192759814
1242845871395479552
1242845793007984646
1242845517295517698
1242845267793231873
1242845218019385344
1242845118295617537
1242845059059535872
1242844796076675073
1242844668343332864
1242844617067892737
1242844585023483904
1242844536864419846
1242844250036936717
1242843458454401024
1242842646546186240
1242842598236192768
1242841417011081217
1242841340691521537
1242840908330151941
1242840902999121921
1242840813278769153
1242840687453888514
1242840343286091778
1242840164810067969
1242839808793350155
1242839706397802499
1242839698306781186
1242839143601897473
1242839136760934403
1242839131744501768
1242839129399996416
1242838950483501056
1242838902735613954
1242838795453677574
1242838792588931072
1242838743117180931
1242838438476500999
1242838182623940613
1242837959394631680
1242837894710034433
1242837867719786498
1242837328256794626
1242837322510544899
1242837157682839553
1242836388892028928
1242836063430873090
1242835991590776834
1242835404325347328
1242835297936777218
1242835220035973120
1242834934387167232
1242834756737191936
1242834658435489794
1242834605192945664
1242833863187062784
1242833596697714694
1242833447674093568
1242832900782993411
1242832687674601472
1242831895802626049
1242831870737428481
1242831802018017280
1242831365197959169
1242831287334907907
1242831286697426946
1242831099727876098
1242831093935603715
1242831031893458945
1242830718306312192
1242830660261339137
1242830653110063105
1242830619299774464
1242830413959217154
1242830379670700038
1242830166856028167
1242830160656818182
1242830055212023808
1242829903952740354
1242829884558315521
1242829862588596224
1242829766027366400
1242829713841836032
1242829706673733634
1242829693595856896
1242829496778207233
1242829483838787585
1242829333670092803
1242829327659655169
1242829295388626946
1242829245451325440
1242829023652257792
1242828554880061442
1242828531824037892
1242828355415748608
1242827671089938434
1242826846389051392
1242826490993147904
1242826418658082817
1242826378711531520
1242826285442838528
1242826139724365825
1242826125648236544
1242825742108499968
1242825695564304384
1242825457294286849
1242825376453275653
1242825365128650752
1242825341648977921
1242825175529410562
1242825160098484224
1242825082961084418
1242825023662043137
1242824740177432578
1242824688591605760
1242824556139761664
1242824479761465345
1242824418264584193
1242824385603534851
1242824136294125569
1242824058036727809
1242823793426542594
1242823791933304836
1242823676279521285
1242823612136071170
1242823469957558277
1242823217435287554
1242823080726204417
1242822173695361025
1242822070859370497
1242822058649796610
1242821967213989890
1242821914793521153
1242821842265653255
1242821807599738881
1242821738263707648
1242821644017639424
1242821522139631617
1242821297710784515
1242821007540355072
1242820919531384838
1242820801608462337
1242820765717794817
1242820692791484417
1242820656531681280
1242820619965796352
1242820594103717889
1242820476898082819
1242820469503545344
1242820453103734785
1242820416533643268
1242820352989958144
1242820333381603328
1242820233947160583
1242820169862467590
1242819965159444480
1242819935392411648
1242819726922985478
1242819651731685376
1242819453399728131
1242819222897602560
1242819003741077505
1242818979254743042
1242818946459480067
1242818860442701825
1242818769090760704
1242818334619467777
1242818105635635200
1242818099184877568
1242817990225285120
1242817603774619655
1242817579418365952
1242817383959535616
1242817360660234240
1242817340397453314
1242817242976395264
1242817222613008389
1242816946846027781
1242816939908530176
1242816930307878912
1242816477834723329
1242816362394923009
1242816326550392834
1242816151014518784
1242815962807664647
1242815925772070912
1242815918679429122
1242815813507260423
1242815710063181834
1242815707177459715
1242815536557408256
1242815469993766919
1242815268738543619
1242815252821049344
1242815193618485251
1242815147980308480
1242815122990673922
1242815056531853312
1242814851522736128
1242814605459587072
1242814604436217857
1242814473137786881
1242814416200044544
1242814404086898693
1242814349170925568
1242814277226037248
1242814216677085186
1242814136049901575
1242813956743446531
1242813882755842048
1242813596431720454
1242813513300611073
1242813064262582273
1242812929537462276
1242812928891510784
1242812867407159297
1242812859836481536
1242812778798362624
1242812532454232066
1242812290661048320
1242811817744883713
1242811795905163266
1242811768478580736
1242811748765388800
1242811713243750402
1242811674870059010
1242811631048032257
1242811607014682625
1242811310481592320
1242811227052613635
1242811101055778816
1242811065223622657
1242811058185809920
1242810916086874114
1242810838815256576
1242810687832952833
1242810598888542215
1242810576469921794
1242810555800444929
1242810464700162053
1242810440540917761
1242810332076277760
1242810276560490498
1242810253638537216
1242810144859336704
1242810105873211392
1242810028299554816
1242809747352551425
1242809582130548737
1242809539654795266
1242809438781747205
1242809437254975490
1242808316583194624
1242808060554416128
1242807911367270400
1242807580147232768
1242807553974775809
1242807514439340032
1242807431232663553
1242807284012589058
1242807126415872001
1242806980860936192
1242806954491248645
1242806860383649792
1242806813613076481
1242806786928885760
1242806741655527431
1242806629755650048
1242806352101195776
1242806326989914112
1242805858284773376
1242805846796636160
1242805784356032520
1242805628374048768
1242805602033831937
1242805085106843648
1242804824565039105
1242804746823573506
1242804596030025734
1242804431579643905
1242804354517807106
1242804257906200577
1242804187743879168
1242804012279357453
1242803770905550849
1242803653511196672
1242803625799360512
1242803435227004928
1242803344734859264
1242803314460426240
1242802997845020672
1242802796627398658
1242802723197681667
1242802496390803456
1242802149593092096
1242801943015305218
1242801753952788487
1242801740937912322
1242801149079621632
1242801110244614146
1242801023065997312
1242800785626468352
1242800409376415745
1242800400446693376
1242800303742898176
1242800017716531200
1242799957586989056
1242799344883040262
1242798807437529088
1242798728685158409
1242798546295930882
1242798544886644736
1242798538276458496
1242798264329609216
1242797779015081984
1242797726015934464
1242797705707106304
1242797552120053764
1242797343583416322
1242797190575271944
1242797157700124679
1242797138163175428
1242797014863294464
1242796969946419200
1242796912010461184
1242796566525730817
1242796479493931008
1242796320190083072
1242796219237351424
1242796063800659968
1242795986143019008
1242795976617754624
1242795723483160576
1242795622119419904
1242795456318640128
1242795309778063360
1242795206082166784
1242795149501046784
1242795143276740609
1242795062611804161
1242794642292330498
1242794572843028482
1242794281032658944
1242794281024323586
1242794093434097667
1242793869470830592
1242793850906779651
1242793727577526272
1242793554193395714
1242793399364792321
1242793214542852096
1242793192065503234
1242792894551011329
1242792826506797056
1242792524114247681
1242792467784708098
1242792434767204358
1242792336305926153
1242792265048883208
1242792229711818752
1242792161151762432
1242792158337413121
1242792101794009088
1242791622619865089
1242791259418308608
1242791242192355332
1242790934565322755
1242790884262977541
1242790827195334657
1242790708249088001
1242790576136900608
1242790096195260416
1242789823976538112
1242789259075039238
1242789041076154376
1242789039733964811
1242788896699711489
1242788761316065284
1242788753904672768
1242788718659895302
1242788620890669056
1242788511524290561
1242788191255572480
1242787825126453250
1242787633694216192
1242787562156175360
1242787556472823809
1242787531567050753
1242787368274452481
1242786908633210882
1242786415571845125
1242786261250777088
1242786164752273409
1242786046322135042
1242785858358476808
1242785670344646657
1242785581572198402
1242785490090287105
1242785397257785345
1242785244220141568
1242785223554797568
1242785110530949121
1242784968721530880
1242784751699681281
1242784684356100097
1242784036659085313
1242783811273883648
1242783343109906433
1242782580325396485
1242782284916424704
1242782282974461952
1242782198257913857
1242782009455452162
1242781992913166337
1242781933878337536
1242781864928124928
1242781723026481153
1242781313406586880
1242781312186028034
1242780795691053057
1242780728867336192
1242780609602375680
1242780456325693440
1242780178561921024
1242779702147854336
1242779460514054144
1242779439865397251
1242779369573138433
1242779312954249217
1242778965766520832
1242778841233469441
1242778652464623618
1242778467739078657
1242778116327641088
1242777795014598657
1242777770511544320
1242777707546624000
1242777697794904064
1242777525215834112
1242777515321688065
1242777514600251392
1242777292914528257
1242776977158942720
1242776573314547713
1242776151686369280
1242776041598398464
1242775954604392450
1242775460741816320
1242775186589483008
1242775170672181248
1242775050362765313
1242774792878665728
1242774605103841286
1242773933075714050
1242773734177607680
1242773531542401024
1242773477444247552
1242773438923788288
1242773374876684289
1242773247072108545
1242773216365551616
1242773111243751424
1242773059049861120
1242772859832934400
1242772754715246595
1242772421595336704
1242772191973986304
1242772059291357184
1242771965859020800
1242771911324643328
1242771894438428673
1242771571653185536
1242771354841161733
1242770935578595328
1242770824219762690
1242770784222928898
1242770602450182150
1242770599111528450
1242770492378972160
1242770203345334273
1242769894363586560
1242769814311112711
1242769113413488642
1242769018215444482
1242769016705482753
1242768502618050565
1242768120797966336
1242768053361725441
1242767758397497346
1242767713354895360
1242767535113670656
1242767401671888897
1242766929187745792
1242766844915781633
1242766576757157890
1242766330325065728
1242766237991669761
1242766170547240960
1242765937545220096
1242765326128996355
1242765161984860162
1242765086500020230
1242765070888730627
1242765065289424896
1242765012604780547
1242764844488671235
1242764821713629185
1242764758237003777
1242764677433700352
1242764580817960960
1242764386223165440
1242763964725035008
1242763894566932481
1242763858567143428
1242763637237919744
1242763559517511680
1242763510976786432
1242763507340316672
1242763227303378944
1242763169216544769
1242763123901313030
1242762847958040577
1242762659625422848
1242762615425847297
1242762266669387776
1242761894970249216
1242761828838580227
1242761762761564160
1242761556128976898
1242761446171316224
1242761310229729280
1242761245142536192
1242760891780812801
1242760645025632257
1242760244817731586
1242760045307351044
1242759937434030080
1242759648765259776
1242759396578463744
1242759272192258049
1242758725670240257
1242757317252317184
1242757077052907520
1242756764224847877
1242756493595807744
1242756364050595842
1242755856560721921
1242754940050628608
1242754029026971649
1242753932314714113
1242753577355038720
1242753402616066048
1242753216292536320
1242752579521720320
1242752495803346944
1242751878464757760
1242751650311426052
1242751551829086208
1242751452445016069
1242751433126141952
1242751379183153152
1242751357284749312
1242751336715882498
1242750925464309761
1242750872133697537
1242750718769082368
1242750484382978049
1242750461477883904
1242750314350026757
1242750047911055366
1242749550059638785
1242749539137851393
1242749310288216066
1242749040804200448
1242748959484977152
1242748854614851584
1242748413629943808
1242748072855298049
1242747978596716544
1242747930328608768
1242747875987206144
1242747523296571398
1242747458578526208
1242747167690891269
1242747156500488192
1242747138238488576
1242746765817905154
1242746191152066562
1242745625973841920
1242745562392379392
1242745491215040512
1242745168920547328
1242744427245862912
1242744213239926784
1242743715715825665
1242743283497021440
1242742849025835009
1242742719769968640
1242742566514307074
1242742100288065536
1242741868376592384
1242741409888772098
1242741396093706245
1242741277302706177
1242741087829217280
1242741059073048576
1242741054736150528
1242740667048222720
1242740394129068032
1242740201425784832
1242740035285385216
1242739607915167744
1242739497881808896
1242739442936315904
1242739260362559489
1242739240758370317
1242739059983814657
1242738966832517121
1242738849043922945
1242738631015571456
1242738353839263745
1242738328660779008
1242738089396776962
1242738058006605825
1242737868184989708
1242737550411927554
1242737225453928448
1242736945672970241
1242736428452282369
1242736202547159042
1242736063187234816
1242735972002955266
1242735558331445250
1242735383072452608
1242735345168461825
1242735118327984128
1242734857786200064
1242734557780197377
1242734444609449984
1242734333124894720
1242734151326973952
1242733846786949125
1242733790159609860
1242733769808846853
1242733588950417409
1242733371555528704
1242733197970083841
1242733139778326529
1242733101555613701
1242732626013835265
1242732563069878274
1242732536146604032
1242732303631212544
1242732211629154305
1242732187369291777
1242732067554758656
1242732013066616834
1242731938378547200
1242731794585341952
1242731766693101568
1242731747500085254
1242731599105609730
1242731505971007488
1242731460815093760
1242731420314939398
1242731339629170688
1242730952742383616
1242730741231955968
1242730416689352706
1242729910822752256
1242729759781593089
1242728965229481984
1242728887097987073
1242728829359140865
1242728738179231749
1242728527570579456
1242728406665629697
1242728319059197957
1242728137814876160
1242727995334369280
1242727930670825473
1242727929802563586
1242727666614243330
1242727386736734208
1242727188903997440
1242727063611719680
1242726679522545665
1242726580776046594
1242726288101724160
1242725966440468480
1242725717303005184
1242725422602891266
1242725279732305921
1242725016472616960
1242725006292942848
1242724661852549121
1242724593846095873
1242724450178666497
1242724284176400384
1242724281378881537
1242723971134640128
1242723955817013248
1242723768230961152
1242723628036370434
1242723227673165824
1242723063487254529
1242723059422957568
1242722658451628032
1242722401307095044
1242722366008037377
1242722088370266112
1242721798397087744
1242721541001003009
1242721533115731969
1242721341171695617
1242721233453670400
1242721032219262978
1242721027827924992
1242720892297392128
1242720849666420737
1242720526184955904
1242720418873708545
1242719991587356672
1242719957202415616
1242719907432804352
1242719743779405824
1242719690851524608
1242719395991957505
1242719272553627649
1242719056559398913
1242719023546142720
1242718982890827782
1242718860945625088
1242718343876018176
1242717842690187264
1242717770481111041
1242717610917220354
1242717179436564480
1242716534805532678
1242715769496092672
1242715169299537922
1242714912276860929
1242714378941747200
1242714376878149632
1242714230807236608
1242713702937354242
1242713288091238401
1242712834477379585
1242712338068836352
1242712329495732224
1242712241612390402
1242710435515768832
1242710070061871104
1242710031826669568
1242709375698993153
1242709041199173633
1242708545344331778
1242708426511339520
1242708202803924992
1242708185338740736
1242707996242837506
1242707839229059072
1242707609725083649
1242707115187277825
1242707009113333760
1242706921334943744
1242706685678030849
1242706654849912832
1242706603180208128
1242706524847386624
1242706351303921667
1242706299638472705
1242705768937381888
1242705766190067718
1242705707096576000
1242705702616956935
1242705669372948480
1242704225202823168
1242703889746583552
1242703856393498625
1242703081197965312
1242703037367570432
1242702575843135488
1242702331034157056
1242702322968510465
1242702274473922562
1242702119070728192
1242701692430438405
1242701482652241920
1242701128430739458
1242700846883844098
1242700817527984128
1242700765543763968
1242700668898619394
1242700495271137280
1242700414455341056
1242700283572105216
1242700099337289729
1242699369364717568
1242699271587221506
1242698534396268551
1242698519749840898
1242697407080562689
1242696676357410817
1242695884804145152
1242695424839946242
1242695068424769536
1242694655474577408
1242694113318887424
1242693988303372299
1242693962596519936
1242693587999035394
1242693578389884929
1242691536493690885
1242691504939905024
1242691501605269506
1242691487953018881
1242691412552028160
1242691160994467842
1242687194189434885
1242686476716048384
1242686248982056962
1242685172488843266
1242684751502290944
1242684165721595913
1242682876698734592
1242682584036933632
1242682244868837379
1242681028927467520
1242680378831273985
1242680071476912128
1242679751959023619
1242678946749169666
1242678132496359424
1242678108181991424
1242677822281441280
1242677202182909952
1242676522063888385
1242675672155402240
1242675625007222784
1242674903054090240
1242674123081420800
1242673901877915648
1242673240683827200
1242671439259598849
1242671060836892673
1242669523255386117
1242669298864267270
1242667888512729089
1242666906164879367
1242666819640582146
1242665635278184449
1242664747599892481
1242663735912804352
1242663284291055617
1242661357759139846
1242660363214237698
1242659214947950593
1242658777448529920
1242658068229431296
1242655819851796481
1242655453601038337
1242652038116278272
1242649869757677568
1242645963241652227
1242644898865721345
1242643459066023943
1242641351327571968
1242640203988316163
1242639482932920326
1242636720086175751
1242632976342671363
1242632500654026757
1242631928160927745
1242631813950050304
1242631513113538565
1242631072883638272
1242630982211194881
1242630537564520450
1242630456744579072
1242629269550960645
1242628752934232064
1242628420913242118
1242628142633816064
1242620324916707328
1242615673488060416
1242613549345787904
1242613451534581761
1242612942404751366
1242609576316411908
1242607920115847171
1242605848112889856
1242605567530676224
1242605313645314049
1242604556493750279
1242603308382138369
1242602719657025537
1242602438638612480
1242602388940361741
1242602173168582657
1242602154927575043