{
  "project_info": {
    "project_number": "851950872410",
    "project_id": "myapplication-57699",
    "storage_bucket": "myapplication-57699.appspot.com"
  },
  "client": [
    {
      "client_info": {
        "mobilesdk_app_id": "1:851950872410:android:9e62183d0e1eccc056b563",
        "android_client_info": {
          "package_name": "com.taywin.myapplication"
        }
      },
      "oauth_client": [
        {
          "client_id": "851950872410-g9842334vsbqettin8r7jqji0jg6d765.apps.googleusercontent.com",
          "client_type": 1,
          "android_info": {
            "package_name": "com.taywin.myapplication",
            "certificate_hash": "6c56c284097937d6eb93f74280856a73e230ff03"
          }
        },
        {
          "client_id": "851950872410-d727tb5vg7v2ue2qetb83sd4ssp30vtr.apps.googleusercontent.com",
          "client_type": 3
        }
      ],
      "api_key": [
        {
          "current_key": "AIzaSyC0oEJLb7DFFPSpRNG5wrG-ZT1P8JpPD6I"
        }
      ],
      "services": {
        "appinvite_service": {
          "other_platform_oauth_client": [
            {
              "client_id": "851950872410-d727tb5vg7v2ue2qetb83sd4ssp30vtr.apps.googleusercontent.com",
              "client_type": 3
            }
          ]
        }
      }
    }
  ],
  "configuration_version": "1"
}