source;target;kind
10B-001-05: Lorentzsluizen kamer 1 (1931, 2051);Hoogwater keren;has_aspect
10B-001-05: Lorentzsluizen kamer 1 (1931, 2051);Scheiden zout-zout water;has_aspect
10B-001-05: Lorentzsluizen kamer 1 (1931, 2051);Tweezijdig kerend;has_aspect
10B-001-05: Lorentzsluizen kamer 1 (1931, 2051);Dubbel kerend;has_aspect
10B-001-05: Lorentzsluizen kamer 1 (1931, 2051);Vierkantkerende puntdeuren;has_aspect
10B-001-05: Lorentzsluizen kamer 1 (1931, 2051);Omloopriolen;has_aspect
10B-001-05: Lorentzsluizen kamer 1 (1931, 2051);Elektromechanisch bewegingswerk puntdeur;has_aspect
10B-001-05: Lorentzsluizen kamer 1 (1931, 2051);CEMT Va;has_aspect
10B-001-05: Lorentzsluizen kamer 1 (1931, 2051);Elektrohydraulisch bewegingswerk omloopriool;has_aspect
10B-001-05: Lorentzsluizen kamer 1 (1931, 2051);Vloeddeuren;has_aspect
10B-001-05: Lorentzsluizen kamer 1 (1931, 2051);Kolkbreedte tussen 10m en 20m;has_aspect
10B-001-06: Lorentzsluizen kamer 2 (1931, 2051);Hoogwater keren;has_aspect
10B-001-06: Lorentzsluizen kamer 2 (1931, 2051);Scheiden zout-zout water;has_aspect
10B-001-06: Lorentzsluizen kamer 2 (1931, 2051);Tweezijdig kerend;has_aspect
10B-001-06: Lorentzsluizen kamer 2 (1931, 2051);Dubbel kerend;has_aspect
10B-001-06: Lorentzsluizen kamer 2 (1931, 2051);Vierkantkerende puntdeuren;has_aspect
10B-001-06: Lorentzsluizen kamer 2 (1931, 2051);Deurschuiven;has_aspect
10B-001-06: Lorentzsluizen kamer 2 (1931, 2051);Elektrohydraulisch bewegingswerk deurschuiven;has_aspect
10B-001-06: Lorentzsluizen kamer 2 (1931, 2051);Elektrohydraulisch bewegingswerk puntdeur;has_aspect
10B-001-06: Lorentzsluizen kamer 2 (1931, 2051);CEMT II;has_aspect
10B-001-06: Lorentzsluizen kamer 2 (1931, 2051);Vloeddeuren;has_aspect
10B-001-06: Lorentzsluizen kamer 2 (1931, 2051);Kolkbreedte kleiner dan 10m;has_aspect
07F-125-01: Groevesluis-Noord (1960, 2069);Hoogwater keren;has_aspect
07F-125-01: Groevesluis-Noord (1960, 2069);Spuimogelijkheid door kolk;has_aspect
07F-125-01: Groevesluis-Noord (1960, 2069);Eenzijdig kerend;has_aspect
07F-125-01: Groevesluis-Noord (1960, 2069);Enkel kerend;has_aspect
07F-125-01: Groevesluis-Noord (1960, 2069);Vierkantkerende puntdeuren;has_aspect
07F-125-01: Groevesluis-Noord (1960, 2069);Deurschuiven;has_aspect
07F-125-01: Groevesluis-Noord (1960, 2069);Elektrohydraulisch bewegingswerk deurschuiven;has_aspect
07F-125-01: Groevesluis-Noord (1960, 2069);Elektrohydraulisch bewegingswerk puntdeur;has_aspect
07F-125-01: Groevesluis-Noord (1960, 2069);CEMT II;has_aspect
07F-125-01: Groevesluis-Noord (1960, 2069);Kolkbreedte kleiner dan 10m;has_aspect
07F-125-01: Groevesluis-Noord (1960, 2069);Verval kleiner dan 3m;has_aspect
07F-124-01: Groevesluis-Zuid (1963, 2072);Hoogwater keren;has_aspect
07F-124-01: Groevesluis-Zuid (1963, 2072);Spuimogelijkheid door kolk;has_aspect
07F-124-01: Groevesluis-Zuid (1963, 2072);Eenzijdig kerend;has_aspect
07F-124-01: Groevesluis-Zuid (1963, 2072);Enkel kerend;has_aspect
07F-124-01: Groevesluis-Zuid (1963, 2072);Vierkantkerende puntdeuren;has_aspect
07F-124-01: Groevesluis-Zuid (1963, 2072);Deurschuiven;has_aspect
07F-124-01: Groevesluis-Zuid (1963, 2072);Elektrohydraulisch bewegingswerk deurschuiven;has_aspect
07F-124-01: Groevesluis-Zuid (1963, 2072);Elektrohydraulisch bewegingswerk puntdeur;has_aspect
07F-124-01: Groevesluis-Zuid (1963, 2072);CEMT II;has_aspect
07F-124-01: Groevesluis-Zuid (1963, 2072);Kolkbreedte kleiner dan 10m;has_aspect
07F-124-01: Groevesluis-Zuid (1963, 2072);Verval kleiner dan 3m;has_aspect
07F-002-02: Zeesluizen Farmsum kamer 2 (1958, 2067);Hoogwater keren;has_aspect
07F-002-02: Zeesluizen Farmsum kamer 2 (1958, 2067);Scheiden zout-zout water;has_aspect
07F-002-02: Zeesluizen Farmsum kamer 2 (1958, 2067);Tweezijdig kerend;has_aspect
07F-002-02: Zeesluizen Farmsum kamer 2 (1958, 2067);Dubbel kerend;has_aspect
07F-002-02: Zeesluizen Farmsum kamer 2 (1958, 2067);Vierkantkerende puntdeuren;has_aspect
07F-002-02: Zeesluizen Farmsum kamer 2 (1958, 2067);Deurschuiven;has_aspect
07F-002-02: Zeesluizen Farmsum kamer 2 (1958, 2067);Elektrohydraulisch bewegingswerk deurschuiven;has_aspect
07F-002-02: Zeesluizen Farmsum kamer 2 (1958, 2067);Elektrohydraulisch bewegingswerk puntdeur;has_aspect
07F-002-02: Zeesluizen Farmsum kamer 2 (1958, 2067);CEMT V;has_aspect
07F-002-02: Zeesluizen Farmsum kamer 2 (1958, 2067);Middenhoofd;has_aspect
07F-002-02: Zeesluizen Farmsum kamer 2 (1958, 2067);Kolkbreedte tussen 10m en 20m;has_aspect
07F-002-02: Zeesluizen Farmsum kamer 2 (1958, 2067);Verval tussen 3m en 6m;has_aspect
07D-135-01: Slochtersluis (1963, 2072);Hoogwater keren;has_aspect
07D-135-01: Slochtersluis (1963, 2072);Spuimogelijkheid door kolk;has_aspect
07D-135-01: Slochtersluis (1963, 2072);Eenzijdig kerend;has_aspect
07D-135-01: Slochtersluis (1963, 2072);Enkel kerend;has_aspect
07D-135-01: Slochtersluis (1963, 2072);Vierkantkerende puntdeuren;has_aspect
07D-135-01: Slochtersluis (1963, 2072);Deurschuiven;has_aspect
07D-135-01: Slochtersluis (1963, 2072);Elektrohydraulisch bewegingswerk deurschuiven;has_aspect
07D-135-01: Slochtersluis (1963, 2072);Elektrohydraulisch bewegingswerk puntdeur;has_aspect
07D-135-01: Slochtersluis (1963, 2072);CEMT II;has_aspect
07D-135-01: Slochtersluis (1963, 2072);Kolkbreedte kleiner dan 10m;has_aspect
07D-135-01: Slochtersluis (1963, 2072);Verval kleiner dan 3m;has_aspect
07C-003-01: Dorkwerdersluis (MWW) (1929, 2038);Hoogwater keren;has_aspect
07C-003-01: Dorkwerdersluis (MWW) (1929, 2038);Eenzijdig kerend;has_aspect
07C-003-01: Dorkwerdersluis (MWW) (1929, 2038);Enkel kerend;has_aspect
07C-003-01: Dorkwerdersluis (MWW) (1929, 2038);Roldeur;has_aspect
07C-003-01: Dorkwerdersluis (MWW) (1929, 2038);Omloopriolen;has_aspect
07C-003-01: Dorkwerdersluis (MWW) (1929, 2038);Elektrohydraulisch bewegingswerk roldeur;has_aspect
07C-003-01: Dorkwerdersluis (MWW) (1929, 2038);CEMT II;has_aspect
07C-003-01: Dorkwerdersluis (MWW) (1929, 2038);Elektromechanisch bewegingswerk omloopriool;has_aspect
07C-003-01: Dorkwerdersluis (MWW) (1929, 2038);Kolkbreedte tussen 10m en 20m;has_aspect
07D-002-04: Oostersluis (1994, 2103);Hoogwater keren;has_aspect
07D-002-04: Oostersluis (1994, 2103);Eenzijdig kerend;has_aspect
07D-002-04: Oostersluis (1994, 2103);Enkel kerend;has_aspect
07D-002-04: Oostersluis (1994, 2103);Vierkantkerende puntdeuren;has_aspect
07D-002-04: Oostersluis (1994, 2103);Deurschuiven;has_aspect
07D-002-04: Oostersluis (1994, 2103);Elektrohydraulisch bewegingswerk deurschuiven;has_aspect
07D-002-04: Oostersluis (1994, 2103);Elektrohydraulisch bewegingswerk puntdeur;has_aspect
07D-002-04: Oostersluis (1994, 2103);CEMT Va;has_aspect
07D-002-04: Oostersluis (1994, 2103);Kolkbreedte tussen 10m en 20m;has_aspect
06H-350-02: Gaarkeuken (1980, 2089);Hoogwater keren;has_aspect
06H-350-02: Gaarkeuken (1980, 2089);Eenzijdig kerend;has_aspect
06H-350-02: Gaarkeuken (1980, 2089);Enkel kerend;has_aspect
06H-350-02: Gaarkeuken (1980, 2089);Vierkantkerende puntdeuren;has_aspect
06H-350-02: Gaarkeuken (1980, 2089);Deurschuiven;has_aspect
06H-350-02: Gaarkeuken (1980, 2089);Elektrohydraulisch bewegingswerk deurschuiven;has_aspect
06H-350-02: Gaarkeuken (1980, 2089);Elektrohydraulisch bewegingswerk puntdeur;has_aspect
06H-350-02: Gaarkeuken (1980, 2089);CEMT Va;has_aspect
06H-350-02: Gaarkeuken (1980, 2089);Kolkbreedte tussen 10m en 20m;has_aspect
14E-001-01: Stevinsluizen (1930, 2051);Hoogwater keren;has_aspect
14E-001-01: Stevinsluizen (1930, 2051);Scheiden zout-zout water;has_aspect
14E-001-01: Stevinsluizen (1930, 2051);Tweezijdig kerend;has_aspect
14E-001-01: Stevinsluizen (1930, 2051);Dubbel kerend;has_aspect
14E-001-01: Stevinsluizen (1930, 2051);Vierkantkerende puntdeuren;has_aspect
14E-001-01: Stevinsluizen (1930, 2051);Deurschuiven;has_aspect
14E-001-01: Stevinsluizen (1930, 2051);Elektrohydraulisch bewegingswerk deurschuiven;has_aspect
14E-001-01: Stevinsluizen (1930, 2051);Elektromechanisch bewegingswerk puntdeur;has_aspect
14E-001-01: Stevinsluizen (1930, 2051);CEMT Va;has_aspect
14E-001-01: Stevinsluizen (1930, 2051);Middenhoofd;has_aspect
14E-001-01: Stevinsluizen (1930, 2051);Kolkbreedte tussen 10m en 20m;has_aspect
20A-100-01: Naviduct Krabbersgat (2000, 2109);Hoogwater keren;has_aspect
20A-100-01: Naviduct Krabbersgat (2000, 2109);Tweezijdig kerend;has_aspect
20A-100-01: Naviduct Krabbersgat (2000, 2109);Enkel kerend;has_aspect
20A-100-01: Naviduct Krabbersgat (2000, 2109);Puntdeur;has_aspect
20A-100-01: Naviduct Krabbersgat (2000, 2109);Elektrohydraulisch bewegingswerk puntdeur;has_aspect
20A-100-01: Naviduct Krabbersgat (2000, 2109);CEMT Vb;has_aspect
20A-100-01: Naviduct Krabbersgat (2000, 2109);Kolkbreedte tussen 10m en 20m;has_aspect
20A-100-02: Naviduct krabbersgat (2000, 2109);Hoogwater keren;has_aspect
20A-100-02: Naviduct krabbersgat (2000, 2109);Tweezijdig kerend;has_aspect
20A-100-02: Naviduct krabbersgat (2000, 2109);Enkel kerend;has_aspect
20A-100-02: Naviduct krabbersgat (2000, 2109);Puntdeur;has_aspect
20A-100-02: Naviduct krabbersgat (2000, 2109);Elektrohydraulisch bewegingswerk puntdeur;has_aspect
20A-100-02: Naviduct krabbersgat (2000, 2109);CEMT Vb;has_aspect
20A-100-02: Naviduct krabbersgat (2000, 2109);Kolkbreedte tussen 10m en 20m;has_aspect
20A-001-01: Krabbersgatsluis (1969, 2069);Hoogwater keren;has_aspect
20A-001-01: Krabbersgatsluis (1969, 2069);Tweezijdig kerend;has_aspect
20A-001-01: Krabbersgatsluis (1969, 2069);Dubbel kerend;has_aspect
20A-001-01: Krabbersgatsluis (1969, 2069);Vierkantkerende puntdeuren;has_aspect
20A-001-01: Krabbersgatsluis (1969, 2069);Omloopriolen;has_aspect
20A-001-01: Krabbersgatsluis (1969, 2069);Elektrohydraulisch bewegingswerk puntdeur;has_aspect
20A-001-01: Krabbersgatsluis (1969, 2069);CEMT Va;has_aspect
20A-001-01: Krabbersgatsluis (1969, 2069);Elektrohydraulisch bewegingswerk omloopriool;has_aspect
20A-001-01: Krabbersgatsluis (1969, 2069);Vloeddeuren;has_aspect
20A-001-01: Krabbersgatsluis (1969, 2069);Kolkbreedte tussen 10m en 20m;has_aspect
20D-001-02: Houtribsluizen (1972, 2072);Hoogwater keren;has_aspect
20D-001-02: Houtribsluizen (1972, 2072);Tweezijdig kerend;has_aspect
20D-001-02: Houtribsluizen (1972, 2072);Dubbel kerend;has_aspect
20D-001-02: Houtribsluizen (1972, 2072);Vierkantkerende puntdeuren;has_aspect
20D-001-02: Houtribsluizen (1972, 2072);Omloopriolen;has_aspect
20D-001-02: Houtribsluizen (1972, 2072);Elektrohydraulisch bewegingswerk puntdeur;has_aspect
20D-001-02: Houtribsluizen (1972, 2072);CEMT Vb;has_aspect
20D-001-02: Houtribsluizen (1972, 2072);Elektrohydraulisch bewegingswerk omloopriool;has_aspect
20D-001-02: Houtribsluizen (1972, 2072);Vloeddeuren;has_aspect
20D-001-02: Houtribsluizen (1972, 2072);Kolkbreedte tussen 10m en 20m;has_aspect
21E-001-01: Grote Kolksluis (1942, 2057);Vierkantkerende puntdeuren;has_aspect
21E-001-01: Grote Kolksluis (1942, 2057);Deurschuiven;has_aspect
21E-001-01: Grote Kolksluis (1942, 2057);Elektromechanisch bewegingswerk deurschuiven;has_aspect
21E-001-01: Grote Kolksluis (1942, 2057);Elektromechanisch bewegingswerk puntdeur;has_aspect
21E-001-01: Grote Kolksluis (1942, 2057);CEMT III;has_aspect
21E-001-01: Grote Kolksluis (1942, 2057);Kolkbreedte groter dan 20m;has_aspect
21E-002-01: Meppelerdiepsluis (1955, Onbekend);Roldeur;has_aspect
20D-001-01: Houtribsluizen (1972, 2072);Hoogwater keren;has_aspect
20D-001-01: Houtribsluizen (1972, 2072);Tweezijdig kerend;has_aspect
20D-001-01: Houtribsluizen (1972, 2072);Dubbel kerend;has_aspect
20D-001-01: Houtribsluizen (1972, 2072);Vierkantkerende puntdeuren;has_aspect
20D-001-01: Houtribsluizen (1972, 2072);Omloopriolen;has_aspect
20D-001-01: Houtribsluizen (1972, 2072);Elektrohydraulisch bewegingswerk puntdeur;has_aspect
20D-001-01: Houtribsluizen (1972, 2072);CEMT Vb;has_aspect
20D-001-01: Houtribsluizen (1972, 2072);Elektrohydraulisch bewegingswerk omloopriool;has_aspect
20D-001-01: Houtribsluizen (1972, 2072);Vloeddeuren;has_aspect
20D-001-01: Houtribsluizen (1972, 2072);Kolkbreedte tussen 10m en 20m;has_aspect
21C-001-01: Roggebotsluis (1955, 2064);Hoogwater keren;has_aspect
21C-001-01: Roggebotsluis (1955, 2064);Tweezijdig kerend;has_aspect
21C-001-01: Roggebotsluis (1955, 2064);Dubbel kerend;has_aspect
21C-001-01: Roggebotsluis (1955, 2064);Vierkantkerende puntdeuren;has_aspect
21C-001-01: Roggebotsluis (1955, 2064);Omloopriolen;has_aspect
21C-001-01: Roggebotsluis (1955, 2064);Elektromechanisch bewegingswerk puntdeur;has_aspect
21C-001-01: Roggebotsluis (1955, 2064);CEMT II;has_aspect
21C-001-01: Roggebotsluis (1955, 2064);Elektrohydraulisch bewegingswerk omloopriool;has_aspect
21C-001-01: Roggebotsluis (1955, 2064);Vloeddeuren;has_aspect
21C-001-01: Roggebotsluis (1955, 2064);Kolkbreedte kleiner dan 10m;has_aspect
15F-001-01: Prinses Margrietsluis (MWW) (1950, 2059);Hoogwater keren;has_aspect
15F-001-01: Prinses Margrietsluis (MWW) (1950, 2059);Eenzijdig kerend;has_aspect
15F-001-01: Prinses Margrietsluis (MWW) (1950, 2059);Enkel kerend;has_aspect
15F-001-01: Prinses Margrietsluis (MWW) (1950, 2059);Vierkantkerende puntdeuren;has_aspect
15F-001-01: Prinses Margrietsluis (MWW) (1950, 2059);Deurschuiven;has_aspect
15F-001-01: Prinses Margrietsluis (MWW) (1950, 2059);Elektromechanisch bewegingswerk deurschuiven;has_aspect
15F-001-01: Prinses Margrietsluis (MWW) (1950, 2059);Elektromechanisch bewegingswerk puntdeur;has_aspect
15F-001-01: Prinses Margrietsluis (MWW) (1950, 2059);CEMT IV;has_aspect
15F-001-01: Prinses Margrietsluis (MWW) (1950, 2059);Middenhoofd;has_aspect
15F-001-01: Prinses Margrietsluis (MWW) (1950, 2059);Kolkbreedte tussen 10m en 20m;has_aspect
25A-001-01: Noordersluis (1923, 2051);Hoogwater keren;has_aspect
25A-001-01: Noordersluis (1923, 2051);Spuimogelijkheid door kolk;has_aspect
25A-001-01: Noordersluis (1923, 2051);Scheiden zout-zout water;has_aspect
25A-001-01: Noordersluis (1923, 2051);Tweezijdig kerend;has_aspect
25A-001-01: Noordersluis (1923, 2051);Enkel kerend;has_aspect
25A-001-01: Noordersluis (1923, 2051);Roldeur;has_aspect
25A-001-01: Noordersluis (1923, 2051);Omloopriolen;has_aspect
25A-001-01: Noordersluis (1923, 2051);Elektrohydraulisch bewegingswerk roldeur;has_aspect
25A-001-01: Noordersluis (1923, 2051);Kolkbreedte groter dan 20m;has_aspect
25E-001-01: Noordersluis (MWW) (1870, 2059);Hoogwater keren;has_aspect
25E-001-01: Noordersluis (MWW) (1870, 2059);Tweezijdig kerend;has_aspect
25E-001-01: Noordersluis (MWW) (1870, 2059);Dubbel kerend;has_aspect
25E-001-01: Noordersluis (MWW) (1870, 2059);Puntdeur;has_aspect
25E-001-01: Noordersluis (MWW) (1870, 2059);Deurschuiven;has_aspect
25E-001-01: Noordersluis (MWW) (1870, 2059);Elektrohydraulisch bewegingswerk deurschuiven;has_aspect
25E-001-01: Noordersluis (MWW) (1870, 2059);Elektrohydraulisch bewegingswerk puntdeur;has_aspect
25E-001-01: Noordersluis (MWW) (1870, 2059);CEMT III;has_aspect
25E-001-01: Noordersluis (MWW) (1870, 2059);Vloeddeuren;has_aspect
25E-001-01: Noordersluis (MWW) (1870, 2059);Kolkbreedte tussen 10m en 20m;has_aspect
25E-001-02: Middensluis (MWW) (1870, 2059);Hoogwater keren;has_aspect
25E-001-02: Middensluis (MWW) (1870, 2059);Tweezijdig kerend;has_aspect
25E-001-02: Middensluis (MWW) (1870, 2059);Dubbel kerend;has_aspect
25E-001-02: Middensluis (MWW) (1870, 2059);Puntdeur;has_aspect
25E-001-02: Middensluis (MWW) (1870, 2059);Deurschuiven;has_aspect
25E-001-02: Middensluis (MWW) (1870, 2059);Elektrohydraulisch bewegingswerk deurschuiven;has_aspect
25E-001-02: Middensluis (MWW) (1870, 2059);Elektrohydraulisch bewegingswerk puntdeur;has_aspect
25E-001-02: Middensluis (MWW) (1870, 2059);CEMT IV;has_aspect
25E-001-02: Middensluis (MWW) (1870, 2059);Vloeddeuren;has_aspect
25E-001-02: Middensluis (MWW) (1870, 2059);Kolkbreedte tussen 10m en 20m;has_aspect
25E-001-03: Zuidersluis (MWW) (1870, 2059);Hoogwater keren;has_aspect
25E-001-03: Zuidersluis (MWW) (1870, 2059);Tweezijdig kerend;has_aspect
25E-001-03: Zuidersluis (MWW) (1870, 2059);Dubbel kerend;has_aspect
25E-001-03: Zuidersluis (MWW) (1870, 2059);Puntdeur;has_aspect
25E-001-03: Zuidersluis (MWW) (1870, 2059);Deurschuiven;has_aspect
25E-001-03: Zuidersluis (MWW) (1870, 2059);Elektrohydraulisch bewegingswerk deurschuiven;has_aspect
25E-001-03: Zuidersluis (MWW) (1870, 2059);Elektrohydraulisch bewegingswerk puntdeur;has_aspect
25E-001-03: Zuidersluis (MWW) (1870, 2059);CEMT III;has_aspect
25E-001-03: Zuidersluis (MWW) (1870, 2059);Vloeddeuren;has_aspect
25E-001-03: Zuidersluis (MWW) (1870, 2059);Kolkbreedte tussen 10m en 20m;has_aspect
25E-001-07: Prins Willem Alexander sluis (MWW) (1991, 2100);Hoogwater keren;has_aspect
25E-001-07: Prins Willem Alexander sluis (MWW) (1991, 2100);Tweezijdig kerend;has_aspect
25E-001-07: Prins Willem Alexander sluis (MWW) (1991, 2100);Enkel kerend;has_aspect
25E-001-07: Prins Willem Alexander sluis (MWW) (1991, 2100);Roldeur;has_aspect
25E-001-07: Prins Willem Alexander sluis (MWW) (1991, 2100);Deurschuiven;has_aspect
25E-001-07: Prins Willem Alexander sluis (MWW) (1991, 2100);Elektromechanisch bewegingswerk deurschuiven;has_aspect
25E-001-07: Prins Willem Alexander sluis (MWW) (1991, 2100);Elektromechanisch bewegingswerk roldeur;has_aspect
25E-001-07: Prins Willem Alexander sluis (MWW) (1991, 2100);CEMT VIa en VIb;has_aspect
25E-001-07: Prins Willem Alexander sluis (MWW) (1991, 2100);Kolkbreedte groter dan 20m;has_aspect
25A-001-03: Zuidersluis (1876, 2051);Hoogwater keren;has_aspect
25A-001-03: Zuidersluis (1876, 2051);Scheiden zout-zout water;has_aspect
25A-001-03: Zuidersluis (1876, 2051);Eenzijdig kerend;has_aspect
25A-001-03: Zuidersluis (1876, 2051);Enkel kerend;has_aspect
25A-001-03: Zuidersluis (1876, 2051);Puntdeur;has_aspect
25A-001-03: Zuidersluis (1876, 2051);Deurschuiven;has_aspect
25A-001-03: Zuidersluis (1876, 2051);Elektrohydraulisch bewegingswerk deurschuiven;has_aspect
25A-001-03: Zuidersluis (1876, 2051);Elektrohydraulisch bewegingswerk puntdeur;has_aspect
25A-001-03: Zuidersluis (1876, 2051);CEMT Va;has_aspect
25A-001-03: Zuidersluis (1876, 2051);Kolkbreedte tussen 10m en 20m;has_aspect
21G-350-01: Spooldersluis (1961, 2070);Hoogwater keren;has_aspect
21G-350-01: Spooldersluis (1961, 2070);Eenzijdig kerend;has_aspect
21G-350-01: Spooldersluis (1961, 2070);Enkel kerend;has_aspect
21G-350-01: Spooldersluis (1961, 2070);Puntdeur;has_aspect
21G-350-01: Spooldersluis (1961, 2070);Deurschuiven;has_aspect
21G-350-01: Spooldersluis (1961, 2070);Elektromechanisch bewegingswerk deurschuiven;has_aspect
21G-350-01: Spooldersluis (1961, 2070);Elektromechanisch bewegingswerk puntdeur;has_aspect
21G-350-01: Spooldersluis (1961, 2070);CEMT Va;has_aspect
21G-350-01: Spooldersluis (1961, 2070);Kolkbreedte tussen 10m en 20m;has_aspect
25A-001-04: Kleine Sluis (1876, 2051);Hoogwater keren;has_aspect
25A-001-04: Kleine Sluis (1876, 2051);Scheiden zout-zout water;has_aspect
25A-001-04: Kleine Sluis (1876, 2051);Eenzijdig kerend;has_aspect
25A-001-04: Kleine Sluis (1876, 2051);Enkel kerend;has_aspect
25A-001-04: Kleine Sluis (1876, 2051);Puntdeur;has_aspect
25A-001-04: Kleine Sluis (1876, 2051);Deurschuiven;has_aspect
25A-001-04: Kleine Sluis (1876, 2051);Elektrohydraulisch bewegingswerk deurschuiven;has_aspect
25A-001-04: Kleine Sluis (1876, 2051);Elektrohydraulisch bewegingswerk puntdeur;has_aspect
25A-001-04: Kleine Sluis (1876, 2051);CEMT IV;has_aspect
25A-001-04: Kleine Sluis (1876, 2051);Kolkbreedte tussen 10m en 20m;has_aspect
25A-001-02: Middensluis (MWW) (1891, 2047);Hoogwater keren;has_aspect
25A-001-02: Middensluis (MWW) (1891, 2047);Scheiden zout-zout water;has_aspect
25A-001-02: Middensluis (MWW) (1891, 2047);Tweezijdig kerend;has_aspect
25A-001-02: Middensluis (MWW) (1891, 2047);Enkel kerend;has_aspect
25A-001-02: Middensluis (MWW) (1891, 2047);Vierkantkerende puntdeuren;has_aspect
25A-001-02: Middensluis (MWW) (1891, 2047);Omloopriolen;has_aspect
25A-001-02: Middensluis (MWW) (1891, 2047);Elektromechanisch bewegingswerk puntdeur;has_aspect
25A-001-02: Middensluis (MWW) (1891, 2047);Elektrohydraulisch bewegingswerk omloopriool;has_aspect
25A-001-02: Middensluis (MWW) (1891, 2047);Vloeddeuren;has_aspect
25A-001-02: Middensluis (MWW) (1891, 2047);Middenhoofd;has_aspect
25A-001-02: Middensluis (MWW) (1891, 2047);Kolkbreedte groter dan 20m;has_aspect
31H-007-01: Noordersluis Kleine westelijke sluis (MWW) (1937, 2046);Tweezijdig kerend;has_aspect
31H-007-01: Noordersluis Kleine westelijke sluis (MWW) (1937, 2046);Enkel kerend;has_aspect
31H-007-01: Noordersluis Kleine westelijke sluis (MWW) (1937, 2046);Vierkantkerende puntdeuren;has_aspect
31H-007-01: Noordersluis Kleine westelijke sluis (MWW) (1937, 2046);Deurschuiven;has_aspect
31H-007-01: Noordersluis Kleine westelijke sluis (MWW) (1937, 2046);Elektrohydraulisch bewegingswerk deurschuiven;has_aspect
31H-007-01: Noordersluis Kleine westelijke sluis (MWW) (1937, 2046);Elektrohydraulisch bewegingswerk puntdeur;has_aspect
31H-007-01: Noordersluis Kleine westelijke sluis (MWW) (1937, 2046);CEMT Va;has_aspect
31H-007-01: Noordersluis Kleine westelijke sluis (MWW) (1937, 2046);Kolkbreedte kleiner dan 10m;has_aspect
31H-007-02: Noordersluis Grote oostelijke sluis (MWW) (1937, 2046);Eenzijdig kerend;has_aspect
31H-007-02: Noordersluis Grote oostelijke sluis (MWW) (1937, 2046);Enkel kerend;has_aspect
31H-007-02: Noordersluis Grote oostelijke sluis (MWW) (1937, 2046);Puntdeur;has_aspect
31H-007-02: Noordersluis Grote oostelijke sluis (MWW) (1937, 2046);Deurschuiven;has_aspect
31H-007-02: Noordersluis Grote oostelijke sluis (MWW) (1937, 2046);Elektrohydraulisch bewegingswerk deurschuiven;has_aspect
31H-007-02: Noordersluis Grote oostelijke sluis (MWW) (1937, 2046);Elektrohydraulisch bewegingswerk puntdeur;has_aspect
31H-007-02: Noordersluis Grote oostelijke sluis (MWW) (1937, 2046);CEMT Va;has_aspect
31H-007-02: Noordersluis Grote oostelijke sluis (MWW) (1937, 2046);Kolkbreedte tussen 10m en 20m;has_aspect
33F-001-01: Sluis Eefde (1933, 2051);Hoogwater keren;has_aspect
33F-001-01: Sluis Eefde (1933, 2051);Eenzijdig kerend;has_aspect
33F-001-01: Sluis Eefde (1933, 2051);Enkel kerend;has_aspect
33F-001-01: Sluis Eefde (1933, 2051);Hefdeur;has_aspect
33F-001-01: Sluis Eefde (1933, 2051);Deurschuiven;has_aspect
33F-001-01: Sluis Eefde (1933, 2051);Elektromechanisch bewegingswerk deurschuiven;has_aspect
33F-001-01: Sluis Eefde (1933, 2051);Elektromechanisch bewegingswerk hefdeur;has_aspect
33F-001-01: Sluis Eefde (1933, 2051);CEMT Va (beperkt);has_aspect
33F-001-01: Sluis Eefde (1933, 2051);Kolkbreedte tussen 10m en 20m;has_aspect
33F-001-01: Sluis Eefde (1933, 2051);Verval tussen 6m en 9m;has_aspect
34E-001-01: Sluis Delden (MWW) (1933, 2042);Eenzijdig kerend;has_aspect
34E-001-01: Sluis Delden (MWW) (1933, 2042);Enkel kerend;has_aspect
34E-001-01: Sluis Delden (MWW) (1933, 2042);Hefdeur;has_aspect
34E-001-01: Sluis Delden (MWW) (1933, 2042);Via deur;has_aspect
34E-001-01: Sluis Delden (MWW) (1933, 2042);Elektromechanisch bewegingswerk hefdeur;has_aspect
34E-001-01: Sluis Delden (MWW) (1933, 2042);CEMT Va (beperkt);has_aspect
34E-001-01: Sluis Delden (MWW) (1933, 2042);Kolkbreedte tussen 10m en 20m;has_aspect
34E-001-01: Sluis Delden (MWW) (1933, 2042);Verval tussen 6m en 9m;has_aspect
34F-001-01: Sluis Hengelo (MWW) (1935, 2044);Eenzijdig kerend;has_aspect
34F-001-01: Sluis Hengelo (MWW) (1935, 2044);Enkel kerend;has_aspect
34F-001-01: Sluis Hengelo (MWW) (1935, 2044);Hefdeur;has_aspect
34F-001-01: Sluis Hengelo (MWW) (1935, 2044);Deurschuiven;has_aspect
34F-001-01: Sluis Hengelo (MWW) (1935, 2044);Elektrohydraulisch bewegingswerk deurschuiven;has_aspect
34F-001-01: Sluis Hengelo (MWW) (1935, 2044);Elektromechanisch bewegingswerk hefdeur;has_aspect
34F-001-01: Sluis Hengelo (MWW) (1935, 2044);CEMT Va (beperkt);has_aspect
34F-001-01: Sluis Hengelo (MWW) (1935, 2044);Kolkbreedte tussen 10m en 20m;has_aspect
34F-001-01: Sluis Hengelo (MWW) (1935, 2044);Verval meer dan 9m;has_aspect
58C-002-03: Sluis Maasbracht west (1962, 2071);Eenzijdig kerend;has_aspect
58C-002-03: Sluis Maasbracht west (1962, 2071);Enkel kerend;has_aspect
58C-002-03: Sluis Maasbracht west (1962, 2071);Puntdeur;has_aspect
58C-002-03: Sluis Maasbracht west (1962, 2071);Omloopriolen;has_aspect
58C-002-03: Sluis Maasbracht west (1962, 2071);Elektrohydraulisch bewegingswerk puntdeur;has_aspect
58C-002-03: Sluis Maasbracht west (1962, 2071);CEMT Va;has_aspect
58C-002-03: Sluis Maasbracht west (1962, 2071);Elektrohydraulisch bewegingswerk omloopriool;has_aspect
58C-002-03: Sluis Maasbracht west (1962, 2071);Kolkbreedte tussen 10m en 20m;has_aspect
37H-001-02: Algerasluis (1958, 2067);Hoogwater keren;has_aspect
37H-001-02: Algerasluis (1958, 2067);Tweezijdig kerend;has_aspect
37H-001-02: Algerasluis (1958, 2067);Dubbel kerend;has_aspect
37H-001-02: Algerasluis (1958, 2067);Vierkantkerende puntdeuren;has_aspect
37H-001-02: Algerasluis (1958, 2067);Deurschuiven;has_aspect
37H-001-02: Algerasluis (1958, 2067);Elektromechanisch bewegingswerk deurschuiven;has_aspect
37H-001-02: Algerasluis (1958, 2067);Elektromechanisch bewegingswerk puntdeur;has_aspect
37H-001-02: Algerasluis (1958, 2067);CEMT V;has_aspect
37H-001-02: Algerasluis (1958, 2067);Vloeddeuren;has_aspect
37H-001-02: Algerasluis (1958, 2067);Kolkbreedte groter dan 20m;has_aspect
39D-001-01: Prins Bernhardsluis Oude sluis (westelijke sluis - sluis 1) (1952, 2061);Hoogwater keren;has_aspect
39D-001-01: Prins Bernhardsluis Oude sluis (westelijke sluis - sluis 1) (1952, 2061);Tweezijdig kerend;has_aspect
39D-001-01: Prins Bernhardsluis Oude sluis (westelijke sluis - sluis 1) (1952, 2061);Enkel kerend;has_aspect
39D-001-01: Prins Bernhardsluis Oude sluis (westelijke sluis - sluis 1) (1952, 2061);Hefdeur;has_aspect
39D-001-01: Prins Bernhardsluis Oude sluis (westelijke sluis - sluis 1) (1952, 2061);Deurschuiven;has_aspect
39D-001-01: Prins Bernhardsluis Oude sluis (westelijke sluis - sluis 1) (1952, 2061);Elektrohydraulisch bewegingswerk deurschuiven;has_aspect
39D-001-01: Prins Bernhardsluis Oude sluis (westelijke sluis - sluis 1) (1952, 2061);Elektromechanisch bewegingswerk hefdeur;has_aspect
39D-001-01: Prins Bernhardsluis Oude sluis (westelijke sluis - sluis 1) (1952, 2061);CEMT Vb;has_aspect
39D-001-01: Prins Bernhardsluis Oude sluis (westelijke sluis - sluis 1) (1952, 2061);Middenhoofd;has_aspect
39D-001-01: Prins Bernhardsluis Oude sluis (westelijke sluis - sluis 1) (1952, 2061);Kolkbreedte tussen 10m en 20m;has_aspect
39B-001-02: Prinses Marijkesluis oostelijke sluis (MWW) (1937, 2046);Hoogwater keren;has_aspect
39B-001-02: Prinses Marijkesluis oostelijke sluis (MWW) (1937, 2046);Eenzijdig kerend;has_aspect
39B-001-02: Prinses Marijkesluis oostelijke sluis (MWW) (1937, 2046);Enkel kerend;has_aspect
39B-001-02: Prinses Marijkesluis oostelijke sluis (MWW) (1937, 2046);Puntdeur;has_aspect
39B-001-02: Prinses Marijkesluis oostelijke sluis (MWW) (1937, 2046);Deurschuiven;has_aspect
39B-001-02: Prinses Marijkesluis oostelijke sluis (MWW) (1937, 2046);Elektromechanisch bewegingswerk deurschuiven;has_aspect
39B-001-02: Prinses Marijkesluis oostelijke sluis (MWW) (1937, 2046);Elektromechanisch bewegingswerk puntdeur;has_aspect
39B-001-02: Prinses Marijkesluis oostelijke sluis (MWW) (1937, 2046);Kolkbreedte tussen 10m en 20m;has_aspect
39B-001-02: Prinses Marijkesluis oostelijke sluis (MWW) (1937, 2046);Verval tussen 3m en 6m;has_aspect
39B-001-01: Prinses Marijkesluis westelijke sluis (MWW) (1937, 2046);Hoogwater keren;has_aspect
39B-001-01: Prinses Marijkesluis westelijke sluis (MWW) (1937, 2046);Eenzijdig kerend;has_aspect
39B-001-01: Prinses Marijkesluis westelijke sluis (MWW) (1937, 2046);Enkel kerend;has_aspect
39B-001-01: Prinses Marijkesluis westelijke sluis (MWW) (1937, 2046);Puntdeur;has_aspect
39B-001-01: Prinses Marijkesluis westelijke sluis (MWW) (1937, 2046);Deurschuiven;has_aspect
39B-001-01: Prinses Marijkesluis westelijke sluis (MWW) (1937, 2046);Elektromechanisch bewegingswerk deurschuiven;has_aspect
39B-001-01: Prinses Marijkesluis westelijke sluis (MWW) (1937, 2046);Elektromechanisch bewegingswerk puntdeur;has_aspect
39B-001-01: Prinses Marijkesluis westelijke sluis (MWW) (1937, 2046);CEMT Vb;has_aspect
39B-001-01: Prinses Marijkesluis westelijke sluis (MWW) (1937, 2046);Kolkbreedte tussen 10m en 20m;has_aspect
39B-001-01: Prinses Marijkesluis westelijke sluis (MWW) (1937, 2046);Verval tussen 3m en 6m;has_aspect
39B-002-01: Prinses Irenesluis Duwvaartsluis (sluis 2) (1974, 2083);Hoogwater keren;has_aspect
39B-002-01: Prinses Irenesluis Duwvaartsluis (sluis 2) (1974, 2083);Spuimogelijkheid door kolk;has_aspect
39B-002-01: Prinses Irenesluis Duwvaartsluis (sluis 2) (1974, 2083);Tweezijdig kerend;has_aspect
39B-002-01: Prinses Irenesluis Duwvaartsluis (sluis 2) (1974, 2083);Enkel kerend;has_aspect
39B-002-01: Prinses Irenesluis Duwvaartsluis (sluis 2) (1974, 2083);Hefdeur;has_aspect
39B-002-01: Prinses Irenesluis Duwvaartsluis (sluis 2) (1974, 2083);Deurschuiven;has_aspect
39B-002-01: Prinses Irenesluis Duwvaartsluis (sluis 2) (1974, 2083);Elektrohydraulisch bewegingswerk deurschuiven;has_aspect
39B-002-01: Prinses Irenesluis Duwvaartsluis (sluis 2) (1974, 2083);Elektromechanisch bewegingswerk hefdeur;has_aspect
39B-002-01: Prinses Irenesluis Duwvaartsluis (sluis 2) (1974, 2083);Kolkbreedte groter dan 20m;has_aspect
39B-002-02: Prinses Irenesluis Oude sluis (sluis 1) (MWW) (1937, 2046);Hoogwater keren;has_aspect
39B-002-02: Prinses Irenesluis Oude sluis (sluis 1) (MWW) (1937, 2046);Spuimogelijkheid door kolk;has_aspect
39B-002-02: Prinses Irenesluis Oude sluis (sluis 1) (MWW) (1937, 2046);Tweezijdig kerend;has_aspect
39B-002-02: Prinses Irenesluis Oude sluis (sluis 1) (MWW) (1937, 2046);Enkel kerend;has_aspect
39B-002-02: Prinses Irenesluis Oude sluis (sluis 1) (MWW) (1937, 2046);Hefdeur;has_aspect
39B-002-02: Prinses Irenesluis Oude sluis (sluis 1) (MWW) (1937, 2046);Deurschuiven;has_aspect
39B-002-02: Prinses Irenesluis Oude sluis (sluis 1) (MWW) (1937, 2046);Elektrohydraulisch bewegingswerk deurschuiven;has_aspect
39B-002-02: Prinses Irenesluis Oude sluis (sluis 1) (MWW) (1937, 2046);Elektromechanisch bewegingswerk hefdeur;has_aspect
39B-002-02: Prinses Irenesluis Oude sluis (sluis 1) (MWW) (1937, 2046);CEMT Vb;has_aspect
39B-002-02: Prinses Irenesluis Oude sluis (sluis 1) (MWW) (1937, 2046);Middenhoofd;has_aspect
39B-002-02: Prinses Irenesluis Oude sluis (sluis 1) (MWW) (1937, 2046);Kolkbreedte tussen 10m en 20m;has_aspect
44B-001-01: Biesboschsluis (1952, 2062);Hoogwater keren;has_aspect
44B-001-01: Biesboschsluis (1952, 2062);Eenzijdig kerend;has_aspect
44B-001-01: Biesboschsluis (1952, 2062);Dubbel kerend;has_aspect
44B-001-01: Biesboschsluis (1952, 2062);Puntdeur;has_aspect
44B-001-01: Biesboschsluis (1952, 2062);Deurschuiven;has_aspect
44B-001-01: Biesboschsluis (1952, 2062);Elektromechanisch bewegingswerk deurschuiven;has_aspect
44B-001-01: Biesboschsluis (1952, 2062);Elektromechanisch bewegingswerk puntdeur;has_aspect
44B-001-01: Biesboschsluis (1952, 2062);CEMT II;has_aspect
44B-001-01: Biesboschsluis (1952, 2062);Vloeddeuren;has_aspect
44B-001-01: Biesboschsluis (1952, 2062);Kolkbreedte kleiner dan 10m;has_aspect
44B-001-01: Biesboschsluis (1952, 2062);Verval kleiner dan 3m;has_aspect
44B-003-01: Ottersluis (MWW) (1863, 2035);Eenzijdig kerend;has_aspect
44B-003-01: Ottersluis (MWW) (1863, 2035);Enkel kerend;has_aspect
44B-003-01: Ottersluis (MWW) (1863, 2035);Puntdeur;has_aspect
44B-003-01: Ottersluis (MWW) (1863, 2035);Deurschuiven;has_aspect
44B-003-01: Ottersluis (MWW) (1863, 2035);Elektrohydraulisch bewegingswerk deurschuiven;has_aspect
44B-003-01: Ottersluis (MWW) (1863, 2035);Elektrohydraulisch bewegingswerk puntdeur;has_aspect
44B-003-01: Ottersluis (MWW) (1863, 2035);CEMT I;has_aspect
44B-003-01: Ottersluis (MWW) (1863, 2035);Kolkbreedte kleiner dan 10m;has_aspect
39D-001-02: Prins Bernhardsluis Duwvaartsluis (Oostelijke sluis - sluis 2) (1973, 2082);Hoogwater keren;has_aspect
39D-001-02: Prins Bernhardsluis Duwvaartsluis (Oostelijke sluis - sluis 2) (1973, 2082);Tweezijdig kerend;has_aspect
39D-001-02: Prins Bernhardsluis Duwvaartsluis (Oostelijke sluis - sluis 2) (1973, 2082);Enkel kerend;has_aspect
39D-001-02: Prins Bernhardsluis Duwvaartsluis (Oostelijke sluis - sluis 2) (1973, 2082);Hefdeur;has_aspect
39D-001-02: Prins Bernhardsluis Duwvaartsluis (Oostelijke sluis - sluis 2) (1973, 2082);Deurschuiven;has_aspect
39D-001-02: Prins Bernhardsluis Duwvaartsluis (Oostelijke sluis - sluis 2) (1973, 2082);Elektrohydraulisch bewegingswerk deurschuiven;has_aspect
39D-001-02: Prins Bernhardsluis Duwvaartsluis (Oostelijke sluis - sluis 2) (1973, 2082);Elektromechanisch bewegingswerk hefdeur;has_aspect
39D-001-02: Prins Bernhardsluis Duwvaartsluis (Oostelijke sluis - sluis 2) (1973, 2082);Kolkbreedte groter dan 20m;has_aspect
44B-002-01: Spieringsluis (1952, 2062);Eenzijdig kerend;has_aspect
44B-002-01: Spieringsluis (1952, 2062);Dubbel kerend;has_aspect
44B-002-01: Spieringsluis (1952, 2062);Puntdeur;has_aspect
44B-002-01: Spieringsluis (1952, 2062);Deurschuiven;has_aspect
44B-002-01: Spieringsluis (1952, 2062);Elektromechanisch bewegingswerk deurschuiven;has_aspect
44B-002-01: Spieringsluis (1952, 2062);Elektromechanisch bewegingswerk puntdeur;has_aspect
44B-002-01: Spieringsluis (1952, 2062);CEMT 0;has_aspect
44B-002-01: Spieringsluis (1952, 2062);Vloeddeuren;has_aspect
44B-002-01: Spieringsluis (1952, 2062);Kolkbreedte kleiner dan 10m;has_aspect
43C-002-04: Krammersluizencomplex 1e Jachtensluis (Zuid) (1987, 2096);Hoogwater keren;has_aspect
43C-002-04: Krammersluizencomplex 1e Jachtensluis (Zuid) (1987, 2096);Spuimogelijkheid door kolk;has_aspect
43C-002-04: Krammersluizencomplex 1e Jachtensluis (Zuid) (1987, 2096);Scheiden zout-zout water;has_aspect
43C-002-04: Krammersluizencomplex 1e Jachtensluis (Zuid) (1987, 2096);Tweezijdig kerend;has_aspect
43C-002-04: Krammersluizencomplex 1e Jachtensluis (Zuid) (1987, 2096);Enkel kerend;has_aspect
43C-002-04: Krammersluizencomplex 1e Jachtensluis (Zuid) (1987, 2096);Draaideur;has_aspect
43C-002-04: Krammersluizencomplex 1e Jachtensluis (Zuid) (1987, 2096);Omloopriolen;has_aspect
43C-002-04: Krammersluizencomplex 1e Jachtensluis (Zuid) (1987, 2096);CEMT III;has_aspect
43C-002-04: Krammersluizencomplex 1e Jachtensluis (Zuid) (1987, 2096);Elektromechanisch bewegingswerk omloopriool;has_aspect
43C-002-04: Krammersluizencomplex 1e Jachtensluis (Zuid) (1987, 2096);Kolkbreedte kleiner dan 10m;has_aspect
40C-004-02: Sluis Weurt oost (MWW) (1927, 2050);Hoogwater keren;has_aspect
40C-004-02: Sluis Weurt oost (MWW) (1927, 2050);Spuimogelijkheid door kolk;has_aspect
40C-004-02: Sluis Weurt oost (MWW) (1927, 2050);Tweezijdig kerend;has_aspect
40C-004-02: Sluis Weurt oost (MWW) (1927, 2050);Enkel kerend;has_aspect
40C-004-02: Sluis Weurt oost (MWW) (1927, 2050);Roldeur;has_aspect
40C-004-02: Sluis Weurt oost (MWW) (1927, 2050);Omloopriolen;has_aspect
40C-004-02: Sluis Weurt oost (MWW) (1927, 2050);Elektromechanisch bewegingswerk roldeur;has_aspect
40C-004-02: Sluis Weurt oost (MWW) (1927, 2050);CEMT Vb;has_aspect
40C-004-02: Sluis Weurt oost (MWW) (1927, 2050);Elektrohydraulisch bewegingswerk omloopriool;has_aspect
40C-004-02: Sluis Weurt oost (MWW) (1927, 2050);Middenhoofd;has_aspect
40C-004-02: Sluis Weurt oost (MWW) (1927, 2050);Kolkbreedte tussen 10m en 20m;has_aspect
40C-004-02: Sluis Weurt oost (MWW) (1927, 2050);Verval tussen 6m en 9m;has_aspect
44B-353-01: Helsluis (MWW) (1863, 2035);Eenzijdig kerend;has_aspect
44B-353-01: Helsluis (MWW) (1863, 2035);Enkel kerend;has_aspect
44B-353-01: Helsluis (MWW) (1863, 2035);Puntdeur;has_aspect
44B-353-01: Helsluis (MWW) (1863, 2035);Deurschuiven;has_aspect
44B-353-01: Helsluis (MWW) (1863, 2035);Handmatig bewegingswerk deurschuiven;has_aspect
44B-353-01: Helsluis (MWW) (1863, 2035);Elektromechanisch bewegingswerk puntdeur;has_aspect
44B-353-01: Helsluis (MWW) (1863, 2035);CEMT 0;has_aspect
44B-353-01: Helsluis (MWW) (1863, 2035);Kolkbreedte kleiner dan 10m;has_aspect
43G-001-05: Jachtensluis sluizencomplex Volkerak (1977, 2083);Hoogwater keren;has_aspect
43G-001-05: Jachtensluis sluizencomplex Volkerak (1977, 2083);Tweezijdig kerend;has_aspect
43G-001-05: Jachtensluis sluizencomplex Volkerak (1977, 2083);Enkel kerend;has_aspect
43G-001-05: Jachtensluis sluizencomplex Volkerak (1977, 2083);Vierkantkerende puntdeuren;has_aspect
43G-001-05: Jachtensluis sluizencomplex Volkerak (1977, 2083);Deurschuiven;has_aspect
43G-001-05: Jachtensluis sluizencomplex Volkerak (1977, 2083);Elektrohydraulisch bewegingswerk deurschuiven;has_aspect
43G-001-05: Jachtensluis sluizencomplex Volkerak (1977, 2083);Elektromechanisch bewegingswerk puntdeur;has_aspect
43G-001-05: Jachtensluis sluizencomplex Volkerak (1977, 2083);CEMT Va;has_aspect
43G-001-05: Jachtensluis sluizencomplex Volkerak (1977, 2083);Kolkbreedte tussen 10m en 20m;has_aspect
43C-002-03: Krammersluizencomplex 1e duwvaartsluis (Zuid) (1987, 2096);Hoogwater keren;has_aspect
43C-002-03: Krammersluizencomplex 1e duwvaartsluis (Zuid) (1987, 2096);Spuimogelijkheid door kolk;has_aspect
43C-002-03: Krammersluizencomplex 1e duwvaartsluis (Zuid) (1987, 2096);Scheiden zout-zout water;has_aspect
43C-002-03: Krammersluizencomplex 1e duwvaartsluis (Zuid) (1987, 2096);Tweezijdig kerend;has_aspect
43C-002-03: Krammersluizencomplex 1e duwvaartsluis (Zuid) (1987, 2096);Enkel kerend;has_aspect
43C-002-03: Krammersluizencomplex 1e duwvaartsluis (Zuid) (1987, 2096);Roldeur;has_aspect
43C-002-03: Krammersluizencomplex 1e duwvaartsluis (Zuid) (1987, 2096);Omloopriolen;has_aspect
43C-002-03: Krammersluizencomplex 1e duwvaartsluis (Zuid) (1987, 2096);Elektromechanisch bewegingswerk roldeur;has_aspect
43C-002-03: Krammersluizencomplex 1e duwvaartsluis (Zuid) (1987, 2096);Elektromechanisch bewegingswerk omloopriool;has_aspect
43C-002-03: Krammersluizencomplex 1e duwvaartsluis (Zuid) (1987, 2096);Kolkbreedte groter dan 20m;has_aspect
44D-001-01: Marksluis (1968, 2077);Tweezijdig kerend;has_aspect
44D-001-01: Marksluis (1968, 2077);Enkel kerend;has_aspect
44D-001-01: Marksluis (1968, 2077);Vierkantkerende puntdeuren;has_aspect
44D-001-01: Marksluis (1968, 2077);Deurschuiven;has_aspect
44D-001-01: Marksluis (1968, 2077);Elektromechanisch bewegingswerk deurschuiven;has_aspect
44D-001-01: Marksluis (1968, 2077);Elektromechanisch bewegingswerk puntdeur;has_aspect
44D-001-01: Marksluis (1968, 2077);CEMT IV;has_aspect
44D-001-01: Marksluis (1968, 2077);Kolkbreedte tussen 10m en 20m;has_aspect
45B-351-01: Sluis Lith zuid (oud) (MWW) (1936, 2045);Enkel kerend;has_aspect
45B-351-01: Sluis Lith zuid (oud) (MWW) (1936, 2045);Hefdeur;has_aspect
45B-351-01: Sluis Lith zuid (oud) (MWW) (1936, 2045);Elektromechanisch bewegingswerk hefdeur;has_aspect
45B-351-01: Sluis Lith zuid (oud) (MWW) (1936, 2045);CEMT Va;has_aspect
45B-351-01: Sluis Lith zuid (oud) (MWW) (1936, 2045);Kolkbreedte tussen 10m en 20m;has_aspect
44D-002-01: Sluis I (1968, 2077);Hoogwater keren;has_aspect
44D-002-01: Sluis I (1968, 2077);Spuimogelijkheid door kolk;has_aspect
44D-002-01: Sluis I (1968, 2077);Eenzijdig kerend;has_aspect
44D-002-01: Sluis I (1968, 2077);Enkel kerend;has_aspect
44D-002-01: Sluis I (1968, 2077);Puntdeur;has_aspect
44D-002-01: Sluis I (1968, 2077);Deurschuiven;has_aspect
44D-002-01: Sluis I (1968, 2077);Elektrohydraulisch bewegingswerk deurschuiven;has_aspect
44D-002-01: Sluis I (1968, 2077);Elektromechanisch bewegingswerk puntdeur;has_aspect
44D-002-01: Sluis I (1968, 2077);CEMT IV;has_aspect
44D-002-01: Sluis I (1968, 2077);Kolkbreedte tussen 10m en 20m;has_aspect
45G-352-01: Sluis Schijndel (1990, 2099);Spuimogelijkheid door kolk;has_aspect
45G-352-01: Sluis Schijndel (1990, 2099);Eenzijdig kerend;has_aspect
45G-352-01: Sluis Schijndel (1990, 2099);Enkel kerend;has_aspect
45G-352-01: Sluis Schijndel (1990, 2099);Puntdeur;has_aspect
45G-352-01: Sluis Schijndel (1990, 2099);Deurschuiven;has_aspect
45G-352-01: Sluis Schijndel (1990, 2099);Elektromechanisch bewegingswerk deurschuiven;has_aspect
45G-352-01: Sluis Schijndel (1990, 2099);Elektromechanisch bewegingswerk puntdeur;has_aspect
45G-352-01: Sluis Schijndel (1990, 2099);CEMT IV;has_aspect
45G-352-01: Sluis Schijndel (1990, 2099);Kolkbreedte tussen 10m en 20m;has_aspect
45G-352-01: Sluis Schijndel (1990, 2099);Verval tussen 3m en 6m;has_aspect
45D-358-01: Sluis Hintham (2012, 2121);Eenzijdig kerend;has_aspect
45D-358-01: Sluis Hintham (2012, 2121);Enkel kerend;has_aspect
45D-358-01: Sluis Hintham (2012, 2121);Puntdeur;has_aspect
45D-358-01: Sluis Hintham (2012, 2121);Deurschuiven;has_aspect
45D-358-01: Sluis Hintham (2012, 2121);Elektrohydraulisch bewegingswerk deurschuiven;has_aspect
45D-358-01: Sluis Hintham (2012, 2121);Elektrohydraulisch bewegingswerk puntdeur;has_aspect
45D-358-01: Sluis Hintham (2012, 2121);CEMT IV;has_aspect
45D-358-01: Sluis Hintham (2012, 2121);Kolkbreedte tussen 10m en 20m;has_aspect
45B-352-01: Sluis Empel (2012, 2121);Hoogwater keren;has_aspect
45B-352-01: Sluis Empel (2012, 2121);Tweezijdig kerend;has_aspect
45B-352-01: Sluis Empel (2012, 2121);Enkel kerend;has_aspect
45B-352-01: Sluis Empel (2012, 2121);Draaideur;has_aspect
45B-352-01: Sluis Empel (2012, 2121);Deurschuiven;has_aspect
45B-352-01: Sluis Empel (2012, 2121);Elektrohydraulisch bewegingswerk deurschuiven;has_aspect
45B-352-01: Sluis Empel (2012, 2121);CEMT IV;has_aspect
45B-352-01: Sluis Empel (2012, 2121);Kolkbreedte tussen 10m en 20m;has_aspect
45G-350-03: Sluis 4 (2009, 2118);Spuimogelijkheid door kolk;has_aspect
45G-350-03: Sluis 4 (2009, 2118);Eenzijdig kerend;has_aspect
45G-350-03: Sluis 4 (2009, 2118);Enkel kerend;has_aspect
45G-350-03: Sluis 4 (2009, 2118);Puntdeur;has_aspect
45G-350-03: Sluis 4 (2009, 2118);Deurschuiven;has_aspect
45G-350-03: Sluis 4 (2009, 2118);Elektrohydraulisch bewegingswerk deurschuiven;has_aspect
45G-350-03: Sluis 4 (2009, 2118);Elektrohydraulisch bewegingswerk puntdeur;has_aspect
45G-350-03: Sluis 4 (2009, 2118);CEMT II (beperkt);has_aspect
45G-350-03: Sluis 4 (2009, 2118);Kolkbreedte tussen 10m en 20m;has_aspect
44G-350-01: Sluis II (MWW) (1916, 2025);Spuimogelijkheid door kolk;has_aspect
44G-350-01: Sluis II (MWW) (1916, 2025);Eenzijdig kerend;has_aspect
44G-350-01: Sluis II (MWW) (1916, 2025);Enkel kerend;has_aspect
44G-350-01: Sluis II (MWW) (1916, 2025);Puntdeur;has_aspect
44G-350-01: Sluis II (MWW) (1916, 2025);Omloopriolen;has_aspect
44G-350-01: Sluis II (MWW) (1916, 2025);Elektromechanisch bewegingswerk puntdeur;has_aspect
44G-350-01: Sluis II (MWW) (1916, 2025);CEMT II (beperkt);has_aspect
44G-350-01: Sluis II (MWW) (1916, 2025);Elektrohydraulisch bewegingswerk omloopriool;has_aspect
44G-350-01: Sluis II (MWW) (1916, 2025);Kolkbreedte tussen 10m en 20m;has_aspect
44G-350-01: Sluis II (MWW) (1916, 2025);Verval kleiner dan 3m;has_aspect
45F-001-01: Sluis Grave noord (nieuw) (1974, 2083);Eenzijdig kerend;has_aspect
45F-001-01: Sluis Grave noord (nieuw) (1974, 2083);Enkel kerend;has_aspect
45F-001-01: Sluis Grave noord (nieuw) (1974, 2083);Puntdeur;has_aspect
45F-001-01: Sluis Grave noord (nieuw) (1974, 2083);Deurschuiven;has_aspect
45F-001-01: Sluis Grave noord (nieuw) (1974, 2083);Elektrohydraulisch bewegingswerk deurschuiven;has_aspect
45F-001-01: Sluis Grave noord (nieuw) (1974, 2083);Elektrohydraulisch bewegingswerk puntdeur;has_aspect
45F-001-01: Sluis Grave noord (nieuw) (1974, 2083);CEMT Va (beperkt);has_aspect
45F-001-01: Sluis Grave noord (nieuw) (1974, 2083);Kolkbreedte tussen 10m en 20m;has_aspect
45A-001-01: Henriettesluis (Schutsluis Engelen) (MWW) (1898, 2035);Eenzijdig kerend;has_aspect
45A-001-01: Henriettesluis (Schutsluis Engelen) (MWW) (1898, 2035);Enkel kerend;has_aspect
45A-001-01: Henriettesluis (Schutsluis Engelen) (MWW) (1898, 2035);Puntdeur;has_aspect
45A-001-01: Henriettesluis (Schutsluis Engelen) (MWW) (1898, 2035);Omloopriolen;has_aspect
45A-001-01: Henriettesluis (Schutsluis Engelen) (MWW) (1898, 2035);Elektromechanisch bewegingswerk puntdeur;has_aspect
45A-001-01: Henriettesluis (Schutsluis Engelen) (MWW) (1898, 2035);CEMT IV;has_aspect
45A-001-01: Henriettesluis (Schutsluis Engelen) (MWW) (1898, 2035);Elektromechanisch bewegingswerk omloopriool;has_aspect
45A-001-01: Henriettesluis (Schutsluis Engelen) (MWW) (1898, 2035);Kolkbreedte tussen 10m en 20m;has_aspect
45D-004-01: Sluis 0 (MWW) (1931, 2040);Eenzijdig kerend;has_aspect
45D-004-01: Sluis 0 (MWW) (1931, 2040);Enkel kerend;has_aspect
45D-004-01: Sluis 0 (MWW) (1931, 2040);Puntdeur;has_aspect
45D-004-01: Sluis 0 (MWW) (1931, 2040);Deurschuiven;has_aspect
45D-004-01: Sluis 0 (MWW) (1931, 2040);Elektrohydraulisch bewegingswerk deurschuiven;has_aspect
45D-004-01: Sluis 0 (MWW) (1931, 2040);Elektromechanisch bewegingswerk puntdeur;has_aspect
45D-004-01: Sluis 0 (MWW) (1931, 2040);CEMT II (beperkt);has_aspect
45D-004-01: Sluis 0 (MWW) (1931, 2040);Kolkbreedte groter dan 20m;has_aspect
46D-350-02: Schutsluis Sambeek west (1967, 2076);Spuimogelijkheid door kolk;has_aspect
46D-350-02: Schutsluis Sambeek west (1967, 2076);Eenzijdig kerend;has_aspect
46D-350-02: Schutsluis Sambeek west (1967, 2076);Enkel kerend;has_aspect
46D-350-02: Schutsluis Sambeek west (1967, 2076);Puntdeur;has_aspect
46D-350-02: Schutsluis Sambeek west (1967, 2076);Deurschuiven;has_aspect
46D-350-02: Schutsluis Sambeek west (1967, 2076);Elektrohydraulisch bewegingswerk deurschuiven;has_aspect
46D-350-02: Schutsluis Sambeek west (1967, 2076);Elektrohydraulisch bewegingswerk puntdeur;has_aspect
46D-350-02: Schutsluis Sambeek west (1967, 2076);CEMT Va;has_aspect
46D-350-02: Schutsluis Sambeek west (1967, 2076);Kolkbreedte tussen 10m en 20m;has_aspect
46D-350-02: Schutsluis Sambeek west (1967, 2076);Verval meer dan 9m;has_aspect
51E-002-02: Sluis V (MWW) (1920, 2035);Eenzijdig kerend;has_aspect
51E-002-02: Sluis V (MWW) (1920, 2035);Enkel kerend;has_aspect
51E-002-02: Sluis V (MWW) (1920, 2035);Puntdeur;has_aspect
51E-002-02: Sluis V (MWW) (1920, 2035);CEMT II;has_aspect
51E-002-02: Sluis V (MWW) (1920, 2035);Kolkbreedte tussen 10m en 20m;has_aspect
49B-001-01: Bergsediepsluis (1984, 2093);Hoogwater keren;has_aspect
49B-001-01: Bergsediepsluis (1984, 2093);Scheiden zout-zout water;has_aspect
49B-001-01: Bergsediepsluis (1984, 2093);Tweezijdig kerend;has_aspect
49B-001-01: Bergsediepsluis (1984, 2093);Enkel kerend;has_aspect
49B-001-01: Bergsediepsluis (1984, 2093);Draaideur;has_aspect
49B-001-01: Bergsediepsluis (1984, 2093);Deurschuiven;has_aspect
49B-001-01: Bergsediepsluis (1984, 2093);Elektrohydraulisch bewegingswerk deurschuiven;has_aspect
49B-001-01: Bergsediepsluis (1984, 2093);CEMT 0;has_aspect
49B-001-01: Bergsediepsluis (1984, 2093);Kolkbreedte kleiner dan 10m;has_aspect
46D-350-03: Schutsluis Sambeek midden (1967, 2076);Spuimogelijkheid door kolk;has_aspect
46D-350-03: Schutsluis Sambeek midden (1967, 2076);Eenzijdig kerend;has_aspect
46D-350-03: Schutsluis Sambeek midden (1967, 2076);Enkel kerend;has_aspect
46D-350-03: Schutsluis Sambeek midden (1967, 2076);Puntdeur;has_aspect
46D-350-03: Schutsluis Sambeek midden (1967, 2076);Deurschuiven;has_aspect
46D-350-03: Schutsluis Sambeek midden (1967, 2076);Elektrohydraulisch bewegingswerk deurschuiven;has_aspect
46D-350-03: Schutsluis Sambeek midden (1967, 2076);Elektrohydraulisch bewegingswerk puntdeur;has_aspect
46D-350-03: Schutsluis Sambeek midden (1967, 2076);CEMT Va;has_aspect
46D-350-03: Schutsluis Sambeek midden (1967, 2076);Kolkbreedte tussen 10m en 20m;has_aspect
46D-350-03: Schutsluis Sambeek midden (1967, 2076);Verval meer dan 9m;has_aspect
46A-001-01: Sluis Heumen (MWW) (1927, 2036);Hoogwater keren;has_aspect
46A-001-01: Sluis Heumen (MWW) (1927, 2036);Tweezijdig kerend;has_aspect
46A-001-01: Sluis Heumen (MWW) (1927, 2036);Enkel kerend;has_aspect
46A-001-01: Sluis Heumen (MWW) (1927, 2036);Puntdeur;has_aspect
46A-001-01: Sluis Heumen (MWW) (1927, 2036);Omloopriolen;has_aspect
46A-001-01: Sluis Heumen (MWW) (1927, 2036);Elektromechanisch bewegingswerk puntdeur;has_aspect
46A-001-01: Sluis Heumen (MWW) (1927, 2036);CEMT Vb;has_aspect
46A-001-01: Sluis Heumen (MWW) (1927, 2036);Elektrohydraulisch bewegingswerk omloopriool;has_aspect
46A-001-01: Sluis Heumen (MWW) (1927, 2036);Middenhoofd;has_aspect
46A-001-01: Sluis Heumen (MWW) (1927, 2036);Kolkbreedte tussen 10m en 20m;has_aspect
46A-001-01: Sluis Heumen (MWW) (1927, 2036);Verval tussen 3m en 6m;has_aspect
50F-350-02: Sluis III (2015, Onbekend);Eenzijdig kerend;has_aspect
50F-350-02: Sluis III (2015, Onbekend);Enkel kerend;has_aspect
50F-350-02: Sluis III (2015, Onbekend);Puntdeur;has_aspect
50F-350-02: Sluis III (2015, Onbekend);CEMT II (beperkt);has_aspect
50F-350-02: Sluis III (2015, Onbekend);Kolkbreedte tussen 10m en 20m;has_aspect
50F-350-02: Sluis III (2015, Onbekend);Verval tussen 3m en 6m;has_aspect
51H-003-01: Sluis 11 (2003, 2112);Eenzijdig kerend;has_aspect
51H-003-01: Sluis 11 (2003, 2112);Enkel kerend;has_aspect
51H-003-01: Sluis 11 (2003, 2112);Puntdeur;has_aspect
51H-003-01: Sluis 11 (2003, 2112);Deurschuiven;has_aspect
51H-003-01: Sluis 11 (2003, 2112);Elektrohydraulisch bewegingswerk deurschuiven;has_aspect
51H-003-01: Sluis 11 (2003, 2112);Elektrohydraulisch bewegingswerk puntdeur;has_aspect
51H-003-01: Sluis 11 (2003, 2112);CEMT II;has_aspect
51H-003-01: Sluis 11 (2003, 2112);Kolkbreedte kleiner dan 10m;has_aspect
51H-003-01: Sluis 11 (2003, 2112);Verval kleiner dan 3m;has_aspect
46D-350-01: Schutsluis Sambeek oost (MWW) (1925, 2034);Spuimogelijkheid door kolk;has_aspect
46D-350-01: Schutsluis Sambeek oost (MWW) (1925, 2034);Eenzijdig kerend;has_aspect
46D-350-01: Schutsluis Sambeek oost (MWW) (1925, 2034);Enkel kerend;has_aspect
46D-350-01: Schutsluis Sambeek oost (MWW) (1925, 2034);Puntdeur;has_aspect
46D-350-01: Schutsluis Sambeek oost (MWW) (1925, 2034);Deurschuiven;has_aspect
46D-350-01: Schutsluis Sambeek oost (MWW) (1925, 2034);Elektromechanisch bewegingswerk deurschuiven;has_aspect
46D-350-01: Schutsluis Sambeek oost (MWW) (1925, 2034);Elektromechanisch bewegingswerk puntdeur;has_aspect
46D-350-01: Schutsluis Sambeek oost (MWW) (1925, 2034);CEMT Va;has_aspect
46D-350-01: Schutsluis Sambeek oost (MWW) (1925, 2034);Middenhoofd;has_aspect
46D-350-01: Schutsluis Sambeek oost (MWW) (1925, 2034);Kolkbreedte tussen 10m en 20m;has_aspect
49D-350-01: Kreekraksluizen (Oostsluis) (1969, 2078);Scheiden zout-zout water;has_aspect
49D-350-01: Kreekraksluizen (Oostsluis) (1969, 2078);Tweezijdig kerend;has_aspect
49D-350-01: Kreekraksluizen (Oostsluis) (1969, 2078);Enkel kerend;has_aspect
49D-350-01: Kreekraksluizen (Oostsluis) (1969, 2078);Hefdeur;has_aspect
49D-350-01: Kreekraksluizen (Oostsluis) (1969, 2078);Omloopriolen;has_aspect
49D-350-01: Kreekraksluizen (Oostsluis) (1969, 2078);Elektromechanisch bewegingswerk hefdeur;has_aspect
49D-350-01: Kreekraksluizen (Oostsluis) (1969, 2078);Elektromechanisch bewegingswerk omloopriool;has_aspect
49D-350-01: Kreekraksluizen (Oostsluis) (1969, 2078);Kolkbreedte groter dan 20m;has_aspect
51A-002-01: Sluis IV (1920, 2058);Eenzijdig kerend;has_aspect
51A-002-01: Sluis IV (1920, 2058);Enkel kerend;has_aspect
51A-002-01: Sluis IV (1920, 2058);Puntdeur;has_aspect
51A-002-01: Sluis IV (1920, 2058);Omloopriolen;has_aspect
51A-002-01: Sluis IV (1920, 2058);Elektrohydraulisch bewegingswerk puntdeur;has_aspect
51A-002-01: Sluis IV (1920, 2058);CEMT II (beperkt);has_aspect
51A-002-01: Sluis IV (1920, 2058);Elektrohydraulisch bewegingswerk omloopriool;has_aspect
51A-002-01: Sluis IV (1920, 2058);Kolkbreedte tussen 10m en 20m;has_aspect
51A-002-01: Sluis IV (1920, 2058);Verval kleiner dan 3m;has_aspect
58C-001-04: Sluis Panheel (nieuwe kolk) (1987, 2096);Spuimogelijkheid door kolk;has_aspect
58C-001-04: Sluis Panheel (nieuwe kolk) (1987, 2096);Eenzijdig kerend;has_aspect
58C-001-04: Sluis Panheel (nieuwe kolk) (1987, 2096);Enkel kerend;has_aspect
58C-001-04: Sluis Panheel (nieuwe kolk) (1987, 2096);Puntdeur;has_aspect
58C-001-04: Sluis Panheel (nieuwe kolk) (1987, 2096);Deurschuiven;has_aspect
58C-001-04: Sluis Panheel (nieuwe kolk) (1987, 2096);Elektrohydraulisch bewegingswerk deurschuiven;has_aspect
58C-001-04: Sluis Panheel (nieuwe kolk) (1987, 2096);Elektromechanisch bewegingswerk puntdeur;has_aspect
58C-001-04: Sluis Panheel (nieuwe kolk) (1987, 2096);CEMT II;has_aspect
58C-001-04: Sluis Panheel (nieuwe kolk) (1987, 2096);Kolkbreedte tussen 10m en 20m;has_aspect
58C-001-04: Sluis Panheel (nieuwe kolk) (1987, 2096);Verval tussen 6m en 9m;has_aspect
54E-001-04: Middensluis, Terneuzen (MWW) (1910, 2034);Hoogwater keren;has_aspect
54E-001-04: Middensluis, Terneuzen (MWW) (1910, 2034);Spuimogelijkheid door kolk;has_aspect
54E-001-04: Middensluis, Terneuzen (MWW) (1910, 2034);Scheiden zout-zout water;has_aspect
54E-001-04: Middensluis, Terneuzen (MWW) (1910, 2034);Tweezijdig kerend;has_aspect
54E-001-04: Middensluis, Terneuzen (MWW) (1910, 2034);Enkel kerend;has_aspect
54E-001-04: Middensluis, Terneuzen (MWW) (1910, 2034);Roldeur;has_aspect
54E-001-04: Middensluis, Terneuzen (MWW) (1910, 2034);Deurschuiven;has_aspect
54E-001-04: Middensluis, Terneuzen (MWW) (1910, 2034);Elektrohydraulisch bewegingswerk deurschuiven;has_aspect
54E-001-04: Middensluis, Terneuzen (MWW) (1910, 2034);Elektromechanisch bewegingswerk roldeur;has_aspect
54E-001-04: Middensluis, Terneuzen (MWW) (1910, 2034);Vloeddeuren;has_aspect
54E-001-04: Middensluis, Terneuzen (MWW) (1910, 2034);Middenhoofd;has_aspect
54E-001-04: Middensluis, Terneuzen (MWW) (1910, 2034);Kolkbreedte groter dan 20m;has_aspect
51E-001-04: Sluis 5 (2009, 2118);Eenzijdig kerend;has_aspect
51E-001-04: Sluis 5 (2009, 2118);Enkel kerend;has_aspect
51E-001-04: Sluis 5 (2009, 2118);Puntdeur;has_aspect
51E-001-04: Sluis 5 (2009, 2118);Deurschuiven;has_aspect
51E-001-04: Sluis 5 (2009, 2118);Elektrohydraulisch bewegingswerk deurschuiven;has_aspect
51E-001-04: Sluis 5 (2009, 2118);Elektrohydraulisch bewegingswerk puntdeur;has_aspect
51E-001-04: Sluis 5 (2009, 2118);CEMT II (beperkt);has_aspect
51E-001-04: Sluis 5 (2009, 2118);Kolkbreedte tussen 10m en 20m;has_aspect
51H-004-03: Sluis 10 (2007, 2116);Eenzijdig kerend;has_aspect
51H-004-03: Sluis 10 (2007, 2116);Enkel kerend;has_aspect
51H-004-03: Sluis 10 (2007, 2116);Puntdeur;has_aspect
51H-004-03: Sluis 10 (2007, 2116);Deurschuiven;has_aspect
51H-004-03: Sluis 10 (2007, 2116);Elektrohydraulisch bewegingswerk deurschuiven;has_aspect
51H-004-03: Sluis 10 (2007, 2116);Elektrohydraulisch bewegingswerk puntdeur;has_aspect
51H-004-03: Sluis 10 (2007, 2116);CEMT II;has_aspect
51H-004-03: Sluis 10 (2007, 2116);Kolkbreedte kleiner dan 10m;has_aspect
51H-004-03: Sluis 10 (2007, 2116);Verval kleiner dan 3m;has_aspect
58C-002-02: Sluis Maasbracht midden (1962, 2071);Eenzijdig kerend;has_aspect
58C-002-02: Sluis Maasbracht midden (1962, 2071);Enkel kerend;has_aspect
58C-002-02: Sluis Maasbracht midden (1962, 2071);Puntdeur;has_aspect
58C-002-02: Sluis Maasbracht midden (1962, 2071);Omloopriolen;has_aspect
58C-002-02: Sluis Maasbracht midden (1962, 2071);Elektrohydraulisch bewegingswerk puntdeur;has_aspect
58C-002-02: Sluis Maasbracht midden (1962, 2071);CEMT Va;has_aspect
58C-002-02: Sluis Maasbracht midden (1962, 2071);Elektrohydraulisch bewegingswerk omloopriool;has_aspect
58C-002-02: Sluis Maasbracht midden (1962, 2071);Kolkbreedte tussen 10m en 20m;has_aspect
54E-001-07: Westsluis, Terneuzen (1967, 2076);Hoogwater keren;has_aspect
54E-001-07: Westsluis, Terneuzen (1967, 2076);Spuimogelijkheid door kolk;has_aspect
54E-001-07: Westsluis, Terneuzen (1967, 2076);Scheiden zout-zout water;has_aspect
54E-001-07: Westsluis, Terneuzen (1967, 2076);Tweezijdig kerend;has_aspect
54E-001-07: Westsluis, Terneuzen (1967, 2076);Enkel kerend;has_aspect
54E-001-07: Westsluis, Terneuzen (1967, 2076);Roldeur;has_aspect
54E-001-07: Westsluis, Terneuzen (1967, 2076);Omloopriolen;has_aspect
54E-001-07: Westsluis, Terneuzen (1967, 2076);Elektrohydraulisch bewegingswerk roldeur;has_aspect
54E-001-07: Westsluis, Terneuzen (1967, 2076);Elektrohydraulisch bewegingswerk omloopriool;has_aspect
54E-001-07: Westsluis, Terneuzen (1967, 2076);Vloeddeuren;has_aspect
54E-001-07: Westsluis, Terneuzen (1967, 2076);Middenhoofd;has_aspect
54E-001-07: Westsluis, Terneuzen (1967, 2076);Kolkbreedte groter dan 20m;has_aspect
51F-001-04: Sluis 6 (2009, 2118);Eenzijdig kerend;has_aspect
51F-001-04: Sluis 6 (2009, 2118);Enkel kerend;has_aspect
51F-001-04: Sluis 6 (2009, 2118);Puntdeur;has_aspect
51F-001-04: Sluis 6 (2009, 2118);Deurschuiven;has_aspect
51F-001-04: Sluis 6 (2009, 2118);Elektrohydraulisch bewegingswerk deurschuiven;has_aspect
51F-001-04: Sluis 6 (2009, 2118);Elektrohydraulisch bewegingswerk puntdeur;has_aspect
51F-001-04: Sluis 6 (2009, 2118);CEMT II;has_aspect
51F-001-04: Sluis 6 (2009, 2118);Kolkbreedte tussen 10m en 20m;has_aspect
58D-350-01: Sluis Roermond (MWW) (1926, 2035);Spuimogelijkheid door kolk;has_aspect
58D-350-01: Sluis Roermond (MWW) (1926, 2035);Eenzijdig kerend;has_aspect
58D-350-01: Sluis Roermond (MWW) (1926, 2035);Enkel kerend;has_aspect
58D-350-01: Sluis Roermond (MWW) (1926, 2035);Puntdeur;has_aspect
58D-350-01: Sluis Roermond (MWW) (1926, 2035);Omloopriolen;has_aspect
58D-350-01: Sluis Roermond (MWW) (1926, 2035);Elektromechanisch bewegingswerk puntdeur;has_aspect
58D-350-01: Sluis Roermond (MWW) (1926, 2035);CEMT Va;has_aspect
58D-350-01: Sluis Roermond (MWW) (1926, 2035);Elektromechanisch bewegingswerk omloopriool;has_aspect
58D-350-01: Sluis Roermond (MWW) (1926, 2035);Middenhoofd;has_aspect
58D-350-01: Sluis Roermond (MWW) (1926, 2035);Kolkbreedte tussen 10m en 20m;has_aspect
58A-351-01: Sluis Hulsen (MWW) (1932, 2032);Eenzijdig kerend;has_aspect
58A-351-01: Sluis Hulsen (MWW) (1932, 2032);Enkel kerend;has_aspect
58A-351-01: Sluis Hulsen (MWW) (1932, 2032);Puntdeur;has_aspect
58A-351-01: Sluis Hulsen (MWW) (1932, 2032);Omloopriolen;has_aspect
58A-351-01: Sluis Hulsen (MWW) (1932, 2032);Elektromechanisch bewegingswerk puntdeur;has_aspect
58A-351-01: Sluis Hulsen (MWW) (1932, 2032);CEMT II;has_aspect
58A-351-01: Sluis Hulsen (MWW) (1932, 2032);Elektromechanisch bewegingswerk omloopriool;has_aspect
58A-351-01: Sluis Hulsen (MWW) (1932, 2032);Kolkbreedte kleiner dan 10m;has_aspect
58A-001-01: Sluis 13 (2003, 2112);Eenzijdig kerend;has_aspect
58A-001-01: Sluis 13 (2003, 2112);Enkel kerend;has_aspect
58A-001-01: Sluis 13 (2003, 2112);Puntdeur;has_aspect
58A-001-01: Sluis 13 (2003, 2112);Deurschuiven;has_aspect
58A-001-01: Sluis 13 (2003, 2112);Elektrohydraulisch bewegingswerk deurschuiven;has_aspect
58A-001-01: Sluis 13 (2003, 2112);Elektrohydraulisch bewegingswerk puntdeur;has_aspect
58A-001-01: Sluis 13 (2003, 2112);CEMT II;has_aspect
58A-001-01: Sluis 13 (2003, 2112);Kolkbreedte kleiner dan 10m;has_aspect
58A-001-01: Sluis 13 (2003, 2112);Verval kleiner dan 3m;has_aspect
58E-350-03: Schutsluis Belfeld (midden) (1968, 2077);Spuimogelijkheid door kolk;has_aspect
58E-350-03: Schutsluis Belfeld (midden) (1968, 2077);Eenzijdig kerend;has_aspect
58E-350-03: Schutsluis Belfeld (midden) (1968, 2077);Enkel kerend;has_aspect
58E-350-03: Schutsluis Belfeld (midden) (1968, 2077);Puntdeur;has_aspect
58E-350-03: Schutsluis Belfeld (midden) (1968, 2077);Deurschuiven;has_aspect
58E-350-03: Schutsluis Belfeld (midden) (1968, 2077);Elektrohydraulisch bewegingswerk deurschuiven;has_aspect
58E-350-03: Schutsluis Belfeld (midden) (1968, 2077);Elektrohydraulisch bewegingswerk puntdeur;has_aspect
58E-350-03: Schutsluis Belfeld (midden) (1968, 2077);CEMT Va;has_aspect
58E-350-03: Schutsluis Belfeld (midden) (1968, 2077);Kolkbreedte tussen 10m en 20m;has_aspect
58D-001-01: Sluis Heel west (1971, 2076);Eenzijdig kerend;has_aspect
58D-001-01: Sluis Heel west (1971, 2076);Enkel kerend;has_aspect
58D-001-01: Sluis Heel west (1971, 2076);Puntdeur;has_aspect
58D-001-01: Sluis Heel west (1971, 2076);Omloopriolen;has_aspect
58D-001-01: Sluis Heel west (1971, 2076);Elektromechanisch bewegingswerk puntdeur;has_aspect
58D-001-01: Sluis Heel west (1971, 2076);CEMT Va;has_aspect
58D-001-01: Sluis Heel west (1971, 2076);Kolkbreedte tussen 10m en 20m;has_aspect
58E-350-01: Schutsluis Belfeld oost (oude sluis) (MWW) (1926, 2035);Spuimogelijkheid door kolk;has_aspect
58E-350-01: Schutsluis Belfeld oost (oude sluis) (MWW) (1926, 2035);Eenzijdig kerend;has_aspect
58E-350-01: Schutsluis Belfeld oost (oude sluis) (MWW) (1926, 2035);Enkel kerend;has_aspect
58E-350-01: Schutsluis Belfeld oost (oude sluis) (MWW) (1926, 2035);Puntdeur;has_aspect
58E-350-01: Schutsluis Belfeld oost (oude sluis) (MWW) (1926, 2035);Deurschuiven;has_aspect
58E-350-01: Schutsluis Belfeld oost (oude sluis) (MWW) (1926, 2035);Elektromechanisch bewegingswerk deurschuiven;has_aspect
58E-350-01: Schutsluis Belfeld oost (oude sluis) (MWW) (1926, 2035);Elektrohydraulisch bewegingswerk puntdeur;has_aspect
58E-350-01: Schutsluis Belfeld oost (oude sluis) (MWW) (1926, 2035);CEMT Va;has_aspect
58E-350-01: Schutsluis Belfeld oost (oude sluis) (MWW) (1926, 2035);Kolkbreedte tussen 10m en 20m;has_aspect
51H-357-01: Sluis Helmond (1989, 2098);Eenzijdig kerend;has_aspect
51H-357-01: Sluis Helmond (1989, 2098);Enkel kerend;has_aspect
51H-357-01: Sluis Helmond (1989, 2098);Puntdeur;has_aspect
51H-357-01: Sluis Helmond (1989, 2098);Deurschuiven;has_aspect
51H-357-01: Sluis Helmond (1989, 2098);Elektromechanisch bewegingswerk deurschuiven;has_aspect
51H-357-01: Sluis Helmond (1989, 2098);Elektromechanisch bewegingswerk puntdeur;has_aspect
51H-357-01: Sluis Helmond (1989, 2098);CEMT II;has_aspect
51H-357-01: Sluis Helmond (1989, 2098);Kolkbreedte tussen 10m en 20m;has_aspect
57F-001-01: Sluis 12 (2007, 2116);Eenzijdig kerend;has_aspect
57F-001-01: Sluis 12 (2007, 2116);Enkel kerend;has_aspect
57F-001-01: Sluis 12 (2007, 2116);Puntdeur;has_aspect
57F-001-01: Sluis 12 (2007, 2116);Deurschuiven;has_aspect
57F-001-01: Sluis 12 (2007, 2116);Elektrohydraulisch bewegingswerk deurschuiven;has_aspect
57F-001-01: Sluis 12 (2007, 2116);Elektrohydraulisch bewegingswerk puntdeur;has_aspect
57F-001-01: Sluis 12 (2007, 2116);CEMT II;has_aspect
57F-001-01: Sluis 12 (2007, 2116);Kolkbreedte kleiner dan 10m;has_aspect
57F-001-01: Sluis 12 (2007, 2116);Verval kleiner dan 3m;has_aspect
58A-002-01: Sluis 15 (1930, 2051);Spuimogelijkheid door kolk;has_aspect
58A-002-01: Sluis 15 (1930, 2051);Eenzijdig kerend;has_aspect
58A-002-01: Sluis 15 (1930, 2051);Enkel kerend;has_aspect
58A-002-01: Sluis 15 (1930, 2051);Puntdeur;has_aspect
58A-002-01: Sluis 15 (1930, 2051);Omloopriolen;has_aspect
58A-002-01: Sluis 15 (1930, 2051);Elektrohydraulisch bewegingswerk puntdeur;has_aspect
58A-002-01: Sluis 15 (1930, 2051);CEMT II;has_aspect
58A-002-01: Sluis 15 (1930, 2051);Elektromechanisch bewegingswerk omloopriool;has_aspect
58A-002-01: Sluis 15 (1930, 2051);Kolkbreedte tussen 10m en 20m;has_aspect
58A-002-01: Sluis 15 (1930, 2051);Verval tussen 3m en 6m;has_aspect
58D-001-02: Sluis Heel oost (1971, 2076);Eenzijdig kerend;has_aspect
58D-001-02: Sluis Heel oost (1971, 2076);Enkel kerend;has_aspect
58D-001-02: Sluis Heel oost (1971, 2076);Puntdeur;has_aspect
58D-001-02: Sluis Heel oost (1971, 2076);Omloopriolen;has_aspect
58D-001-02: Sluis Heel oost (1971, 2076);Elektrohydraulisch bewegingswerk puntdeur;has_aspect
58D-001-02: Sluis Heel oost (1971, 2076);CEMT Va;has_aspect
58D-001-02: Sluis Heel oost (1971, 2076);Kolkbreedte tussen 10m en 20m;has_aspect
48E-001-01: Zandkreeksluis (1958, 2067);Hoogwater keren;has_aspect
48E-001-01: Zandkreeksluis (1958, 2067);Spuimogelijkheid door kolk;has_aspect
48E-001-01: Zandkreeksluis (1958, 2067);Tweezijdig kerend;has_aspect
48E-001-01: Zandkreeksluis (1958, 2067);Enkel kerend;has_aspect
48E-001-01: Zandkreeksluis (1958, 2067);Vierkantkerende puntdeuren;has_aspect
48E-001-01: Zandkreeksluis (1958, 2067);Deurschuiven;has_aspect
48E-001-01: Zandkreeksluis (1958, 2067);Elektromechanisch bewegingswerk deurschuiven;has_aspect
48E-001-01: Zandkreeksluis (1958, 2067);Elektromechanisch bewegingswerk puntdeur;has_aspect
48E-001-01: Zandkreeksluis (1958, 2067);CEMT Va;has_aspect
48E-001-01: Zandkreeksluis (1958, 2067);Kolkbreedte tussen 10m en 20m;has_aspect
60A-001-02: Sluis Born oost (1958, 2067);Spuimogelijkheid door kolk;has_aspect
60A-001-02: Sluis Born oost (1958, 2067);Eenzijdig kerend;has_aspect
60A-001-02: Sluis Born oost (1958, 2067);Enkel kerend;has_aspect
60A-001-02: Sluis Born oost (1958, 2067);Puntdeur;has_aspect
60A-001-02: Sluis Born oost (1958, 2067);Omloopriolen;has_aspect
60A-001-02: Sluis Born oost (1958, 2067);Elektrohydraulisch bewegingswerk puntdeur;has_aspect
60A-001-02: Sluis Born oost (1958, 2067);CEMT Va;has_aspect
60A-001-02: Sluis Born oost (1958, 2067);Elektrohydraulisch bewegingswerk omloopriool;has_aspect
60A-001-02: Sluis Born oost (1958, 2067);Kolkbreedte tussen 10m en 20m;has_aspect
58C-002-01: Sluis Maasbracht oost (1962, 2071);Eenzijdig kerend;has_aspect
58C-002-01: Sluis Maasbracht oost (1962, 2071);Enkel kerend;has_aspect
58C-002-01: Sluis Maasbracht oost (1962, 2071);Puntdeur;has_aspect
58C-002-01: Sluis Maasbracht oost (1962, 2071);Omloopriolen;has_aspect
58C-002-01: Sluis Maasbracht oost (1962, 2071);Elektrohydraulisch bewegingswerk puntdeur;has_aspect
58C-002-01: Sluis Maasbracht oost (1962, 2071);CEMT Va;has_aspect
58C-002-01: Sluis Maasbracht oost (1962, 2071);Elektrohydraulisch bewegingswerk omloopriool;has_aspect
58C-002-01: Sluis Maasbracht oost (1962, 2071);Kolkbreedte tussen 10m en 20m;has_aspect
54E-001-01: Oostsluis, Terneuzen (1966, 2075);Hoogwater keren;has_aspect
54E-001-01: Oostsluis, Terneuzen (1966, 2075);Spuimogelijkheid door kolk;has_aspect
54E-001-01: Oostsluis, Terneuzen (1966, 2075);Scheiden zout-zout water;has_aspect
54E-001-01: Oostsluis, Terneuzen (1966, 2075);Tweezijdig kerend;has_aspect
54E-001-01: Oostsluis, Terneuzen (1966, 2075);Enkel kerend;has_aspect
54E-001-01: Oostsluis, Terneuzen (1966, 2075);Vierkantkerende puntdeuren;has_aspect
54E-001-01: Oostsluis, Terneuzen (1966, 2075);Deurschuiven;has_aspect
54E-001-01: Oostsluis, Terneuzen (1966, 2075);Elektrohydraulisch bewegingswerk deurschuiven;has_aspect
54E-001-01: Oostsluis, Terneuzen (1966, 2075);Elektrohydraulisch bewegingswerk puntdeur;has_aspect
54E-001-01: Oostsluis, Terneuzen (1966, 2075);Vloeddeuren;has_aspect
54E-001-01: Oostsluis, Terneuzen (1966, 2075);Middenhoofd;has_aspect
54E-001-01: Oostsluis, Terneuzen (1966, 2075);Kolkbreedte groter dan 20m;has_aspect
54E-001-01: Oostsluis, Terneuzen (1966, 2075);Verval tussen 3m en 6m;has_aspect
58E-350-02: Schutsluis Belfeld west (1968, 2077);Spuimogelijkheid door kolk;has_aspect
58E-350-02: Schutsluis Belfeld west (1968, 2077);Eenzijdig kerend;has_aspect
58E-350-02: Schutsluis Belfeld west (1968, 2077);Enkel kerend;has_aspect
58E-350-02: Schutsluis Belfeld west (1968, 2077);Puntdeur;has_aspect
58E-350-02: Schutsluis Belfeld west (1968, 2077);Deurschuiven;has_aspect
58E-350-02: Schutsluis Belfeld west (1968, 2077);Elektrohydraulisch bewegingswerk deurschuiven;has_aspect
58E-350-02: Schutsluis Belfeld west (1968, 2077);Elektrohydraulisch bewegingswerk puntdeur;has_aspect
58E-350-02: Schutsluis Belfeld west (1968, 2077);CEMT Va;has_aspect
58E-350-02: Schutsluis Belfeld west (1968, 2077);Kolkbreedte tussen 10m en 20m;has_aspect
49D-350-02: Kreekraksluizen (Westsluis) (1969, 2078);Scheiden zout-zout water;has_aspect
49D-350-02: Kreekraksluizen (Westsluis) (1969, 2078);Tweezijdig kerend;has_aspect
49D-350-02: Kreekraksluizen (Westsluis) (1969, 2078);Dubbel kerend;has_aspect
49D-350-02: Kreekraksluizen (Westsluis) (1969, 2078);Hefdeur;has_aspect
49D-350-02: Kreekraksluizen (Westsluis) (1969, 2078);Omloopriolen;has_aspect
49D-350-02: Kreekraksluizen (Westsluis) (1969, 2078);Elektromechanisch bewegingswerk hefdeur;has_aspect
49D-350-02: Kreekraksluizen (Westsluis) (1969, 2078);Elektromechanisch bewegingswerk omloopriool;has_aspect
49D-350-02: Kreekraksluizen (Westsluis) (1969, 2078);Kolkbreedte groter dan 20m;has_aspect
48H-353-02: Hansweert Westelijke sluis (1988, 2097);Hoogwater keren;has_aspect
48H-353-02: Hansweert Westelijke sluis (1988, 2097);Tweezijdig kerend;has_aspect
48H-353-02: Hansweert Westelijke sluis (1988, 2097);Enkel kerend;has_aspect
48H-353-02: Hansweert Westelijke sluis (1988, 2097);Roldeur;has_aspect
48H-353-02: Hansweert Westelijke sluis (1988, 2097);Deurschuiven;has_aspect
48H-353-02: Hansweert Westelijke sluis (1988, 2097);Elektromechanisch bewegingswerk deurschuiven;has_aspect
48H-353-02: Hansweert Westelijke sluis (1988, 2097);Elektromechanisch bewegingswerk roldeur;has_aspect
48H-353-02: Hansweert Westelijke sluis (1988, 2097);Kolkbreedte groter dan 20m;has_aspect
48H-353-01: Hansweert Oostelijke sluis (1988, 2097);Hoogwater keren;has_aspect
48H-353-01: Hansweert Oostelijke sluis (1988, 2097);Tweezijdig kerend;has_aspect
48H-353-01: Hansweert Oostelijke sluis (1988, 2097);Enkel kerend;has_aspect
48H-353-01: Hansweert Oostelijke sluis (1988, 2097);Roldeur;has_aspect
48H-353-01: Hansweert Oostelijke sluis (1988, 2097);Deurschuiven;has_aspect
48H-353-01: Hansweert Oostelijke sluis (1988, 2097);Elektromechanisch bewegingswerk deurschuiven;has_aspect
48H-353-01: Hansweert Oostelijke sluis (1988, 2097);Elektromechanisch bewegingswerk roldeur;has_aspect
48H-353-01: Hansweert Oostelijke sluis (1988, 2097);Kolkbreedte groter dan 20m;has_aspect
40C-004-01: Sluis Weurt west (1977, 2086);Hoogwater keren;has_aspect
40C-004-01: Sluis Weurt west (1977, 2086);Spuimogelijkheid door kolk;has_aspect
40C-004-01: Sluis Weurt west (1977, 2086);Tweezijdig kerend;has_aspect
40C-004-01: Sluis Weurt west (1977, 2086);Enkel kerend;has_aspect
40C-004-01: Sluis Weurt west (1977, 2086);Hefdeur;has_aspect
40C-004-01: Sluis Weurt west (1977, 2086);Deurschuiven;has_aspect
40C-004-01: Sluis Weurt west (1977, 2086);Elektromechanisch bewegingswerk deurschuiven;has_aspect
40C-004-01: Sluis Weurt west (1977, 2086);Elektromechanisch bewegingswerk hefdeur;has_aspect
40C-004-01: Sluis Weurt west (1977, 2086);CEMT Vb;has_aspect
40C-004-01: Sluis Weurt west (1977, 2086);Middenhoofd;has_aspect
40C-004-01: Sluis Weurt west (1977, 2086);Kolkbreedte tussen 10m en 20m;has_aspect
40C-004-01: Sluis Weurt west (1977, 2086);Verval tussen 6m en 9m;has_aspect
58D-002-01: Sluis Linne (MWW) (1921, 2035);Spuimogelijkheid door kolk;has_aspect
58D-002-01: Sluis Linne (MWW) (1921, 2035);Eenzijdig kerend;has_aspect
58D-002-01: Sluis Linne (MWW) (1921, 2035);Enkel kerend;has_aspect
58D-002-01: Sluis Linne (MWW) (1921, 2035);Puntdeur;has_aspect
58D-002-01: Sluis Linne (MWW) (1921, 2035);Omloopriolen;has_aspect
58D-002-01: Sluis Linne (MWW) (1921, 2035);Elektromechanisch bewegingswerk puntdeur;has_aspect
58D-002-01: Sluis Linne (MWW) (1921, 2035);CEMT Va;has_aspect
58D-002-01: Sluis Linne (MWW) (1921, 2035);Elektromechanisch bewegingswerk omloopriool;has_aspect
58D-002-01: Sluis Linne (MWW) (1921, 2035);Middenhoofd;has_aspect
58D-002-01: Sluis Linne (MWW) (1921, 2035);Kolkbreedte tussen 10m en 20m;has_aspect
45B-001-01: Sluis Sint Andries (MWW) (1934, 2043);Hoogwater keren;has_aspect
45B-001-01: Sluis Sint Andries (MWW) (1934, 2043);Spuimogelijkheid door kolk;has_aspect
45B-001-01: Sluis Sint Andries (MWW) (1934, 2043);Tweezijdig kerend;has_aspect
45B-001-01: Sluis Sint Andries (MWW) (1934, 2043);Enkel kerend;has_aspect
45B-001-01: Sluis Sint Andries (MWW) (1934, 2043);Hefdeur;has_aspect
45B-001-01: Sluis Sint Andries (MWW) (1934, 2043);Via deur;has_aspect
45B-001-01: Sluis Sint Andries (MWW) (1934, 2043);Elektromechanisch bewegingswerk hefdeur;has_aspect
45B-001-01: Sluis Sint Andries (MWW) (1934, 2043);CEMT Va;has_aspect
45B-001-01: Sluis Sint Andries (MWW) (1934, 2043);Kolkbreedte tussen 10m en 20m;has_aspect
45B-001-01: Sluis Sint Andries (MWW) (1934, 2043);Verval tussen 3m en 6m;has_aspect
43C-002-02: Krammersluizencomplex 2e Duwvaartsluis (Noord) (1987, 2096);Hoogwater keren;has_aspect
43C-002-02: Krammersluizencomplex 2e Duwvaartsluis (Noord) (1987, 2096);Spuimogelijkheid door kolk;has_aspect
43C-002-02: Krammersluizencomplex 2e Duwvaartsluis (Noord) (1987, 2096);Scheiden zout-zout water;has_aspect
43C-002-02: Krammersluizencomplex 2e Duwvaartsluis (Noord) (1987, 2096);Tweezijdig kerend;has_aspect
43C-002-02: Krammersluizencomplex 2e Duwvaartsluis (Noord) (1987, 2096);Enkel kerend;has_aspect
43C-002-02: Krammersluizencomplex 2e Duwvaartsluis (Noord) (1987, 2096);Roldeur;has_aspect
43C-002-02: Krammersluizencomplex 2e Duwvaartsluis (Noord) (1987, 2096);Omloopriolen;has_aspect
43C-002-02: Krammersluizencomplex 2e Duwvaartsluis (Noord) (1987, 2096);Elektromechanisch bewegingswerk roldeur;has_aspect
43C-002-02: Krammersluizencomplex 2e Duwvaartsluis (Noord) (1987, 2096);Elektromechanisch bewegingswerk omloopriool;has_aspect
43C-002-02: Krammersluizencomplex 2e Duwvaartsluis (Noord) (1987, 2096);Kolkbreedte groter dan 20m;has_aspect
31H-006-01: Zuidersluis (MWW) (1937, 2046);Hoogwater keren;has_aspect
31H-006-01: Zuidersluis (MWW) (1937, 2046);Tweezijdig kerend;has_aspect
31H-006-01: Zuidersluis (MWW) (1937, 2046);Enkel kerend;has_aspect
31H-006-01: Zuidersluis (MWW) (1937, 2046);Vierkantkerende puntdeuren;has_aspect
31H-006-01: Zuidersluis (MWW) (1937, 2046);Deurschuiven;has_aspect
31H-006-01: Zuidersluis (MWW) (1937, 2046);Elektrohydraulisch bewegingswerk deurschuiven;has_aspect
31H-006-01: Zuidersluis (MWW) (1937, 2046);Elektrohydraulisch bewegingswerk puntdeur;has_aspect
31H-006-01: Zuidersluis (MWW) (1937, 2046);CEMT Va;has_aspect
31H-006-01: Zuidersluis (MWW) (1937, 2046);Vloeddeuren;has_aspect
31H-006-01: Zuidersluis (MWW) (1937, 2046);Kolkbreedte tussen 10m en 20m;has_aspect
43G-001-03: Sluis 3 (1977, 2084);Hoogwater keren;has_aspect
43G-001-03: Sluis 3 (1977, 2084);Tweezijdig kerend;has_aspect
43G-001-03: Sluis 3 (1977, 2084);Enkel kerend;has_aspect
43G-001-03: Sluis 3 (1977, 2084);Vierkantkerende puntdeuren;has_aspect
43G-001-03: Sluis 3 (1977, 2084);Deurschuiven;has_aspect
43G-001-03: Sluis 3 (1977, 2084);Elektrohydraulisch bewegingswerk deurschuiven;has_aspect
43G-001-03: Sluis 3 (1977, 2084);Elektrohydraulisch bewegingswerk puntdeur;has_aspect
43G-001-03: Sluis 3 (1977, 2084);Kolkbreedte groter dan 20m;has_aspect
38F-352-02: Prinses Beatrixsluis westelijke sluis (1933, 2055);Hoogwater keren;has_aspect
38F-352-02: Prinses Beatrixsluis westelijke sluis (1933, 2055);Spuimogelijkheid door kolk;has_aspect
38F-352-02: Prinses Beatrixsluis westelijke sluis (1933, 2055);Tweezijdig kerend;has_aspect
38F-352-02: Prinses Beatrixsluis westelijke sluis (1933, 2055);Enkel kerend;has_aspect
38F-352-02: Prinses Beatrixsluis westelijke sluis (1933, 2055);Hefdeur;has_aspect
38F-352-02: Prinses Beatrixsluis westelijke sluis (1933, 2055);Roldeur;has_aspect
38F-352-02: Prinses Beatrixsluis westelijke sluis (1933, 2055);Deurschuiven;has_aspect
38F-352-02: Prinses Beatrixsluis westelijke sluis (1933, 2055);Elektrohydraulisch bewegingswerk deurschuiven;has_aspect
38F-352-02: Prinses Beatrixsluis westelijke sluis (1933, 2055);Elektromechanisch bewegingswerk hefdeur;has_aspect
38F-352-02: Prinses Beatrixsluis westelijke sluis (1933, 2055);CEMT Vb en VIa;has_aspect
38F-352-02: Prinses Beatrixsluis westelijke sluis (1933, 2055);Kolkbreedte tussen 10m en 20m;has_aspect
31H-008-02: 2e Sluis Bewesten Utrecht (Muntsluis) (1906, Onbekend);Eenzijdig kerend;has_aspect
31H-008-02: 2e Sluis Bewesten Utrecht (Muntsluis) (1906, Onbekend);Enkel kerend;has_aspect
31H-008-02: 2e Sluis Bewesten Utrecht (Muntsluis) (1906, Onbekend);Puntdeur;has_aspect
31H-008-02: 2e Sluis Bewesten Utrecht (Muntsluis) (1906, Onbekend);Deurschuiven;has_aspect
31H-008-02: 2e Sluis Bewesten Utrecht (Muntsluis) (1906, Onbekend);Elektromechanisch bewegingswerk deurschuiven;has_aspect
31H-008-02: 2e Sluis Bewesten Utrecht (Muntsluis) (1906, Onbekend);Elektromechanisch bewegingswerk puntdeur;has_aspect
31H-008-02: 2e Sluis Bewesten Utrecht (Muntsluis) (1906, Onbekend);CEMT Va;has_aspect
31H-008-02: 2e Sluis Bewesten Utrecht (Muntsluis) (1906, Onbekend);Kolkbreedte groter dan 20m;has_aspect
43C-002-01: Krammersluizencomplex 2e Jachtensluis (Noord) (1995, 2096);Hoogwater keren;has_aspect
43C-002-01: Krammersluizencomplex 2e Jachtensluis (Noord) (1995, 2096);Spuimogelijkheid door kolk;has_aspect
43C-002-01: Krammersluizencomplex 2e Jachtensluis (Noord) (1995, 2096);Scheiden zout-zout water;has_aspect
43C-002-01: Krammersluizencomplex 2e Jachtensluis (Noord) (1995, 2096);Tweezijdig kerend;has_aspect
43C-002-01: Krammersluizencomplex 2e Jachtensluis (Noord) (1995, 2096);Enkel kerend;has_aspect
43C-002-01: Krammersluizencomplex 2e Jachtensluis (Noord) (1995, 2096);Draaideur;has_aspect
43C-002-01: Krammersluizencomplex 2e Jachtensluis (Noord) (1995, 2096);Omloopriolen;has_aspect
43C-002-01: Krammersluizencomplex 2e Jachtensluis (Noord) (1995, 2096);CEMT III;has_aspect
43C-002-01: Krammersluizencomplex 2e Jachtensluis (Noord) (1995, 2096);Elektromechanisch bewegingswerk omloopriool;has_aspect
43C-002-01: Krammersluizencomplex 2e Jachtensluis (Noord) (1995, 2096);Kolkbreedte kleiner dan 10m;has_aspect
43G-001-02: Sluis 2 (1967, 2073);Hoogwater keren;has_aspect
43G-001-02: Sluis 2 (1967, 2073);Tweezijdig kerend;has_aspect
43G-001-02: Sluis 2 (1967, 2073);Enkel kerend;has_aspect
43G-001-02: Sluis 2 (1967, 2073);Vierkantkerende puntdeuren;has_aspect
43G-001-02: Sluis 2 (1967, 2073);Deurschuiven;has_aspect
43G-001-02: Sluis 2 (1967, 2073);Elektrohydraulisch bewegingswerk deurschuiven;has_aspect
43G-001-02: Sluis 2 (1967, 2073);Elektrohydraulisch bewegingswerk puntdeur;has_aspect
43G-001-02: Sluis 2 (1967, 2073);Vloeddeuren;has_aspect
43G-001-02: Sluis 2 (1967, 2073);Middenhoofd;has_aspect
43G-001-02: Sluis 2 (1967, 2073);Kolkbreedte groter dan 20m;has_aspect
37C-001-01: Goereese sluis (1960, 2069);Hoogwater keren;has_aspect
37C-001-01: Goereese sluis (1960, 2069);Tweezijdig kerend;has_aspect
37C-001-01: Goereese sluis (1960, 2069);Dubbel kerend;has_aspect
37C-001-01: Goereese sluis (1960, 2069);Vierkantkerende puntdeuren;has_aspect
37C-001-01: Goereese sluis (1960, 2069);Deurschuiven;has_aspect
37C-001-01: Goereese sluis (1960, 2069);Elektrohydraulisch bewegingswerk deurschuiven;has_aspect
37C-001-01: Goereese sluis (1960, 2069);Elektrohydraulisch bewegingswerk puntdeur;has_aspect
37C-001-01: Goereese sluis (1960, 2069);CEMT Va;has_aspect
37C-001-01: Goereese sluis (1960, 2069);Vloeddeuren;has_aspect
37C-001-01: Goereese sluis (1960, 2069);Middenhoofd;has_aspect
37C-001-01: Goereese sluis (1960, 2069);Kolkbreedte tussen 10m en 20m;has_aspect
37C-001-01: Goereese sluis (1960, 2069);Verval tussen 3m en 6m;has_aspect
42D-001-05: Roompotsluis (1982, 2091);Hoogwater keren;has_aspect
42D-001-05: Roompotsluis (1982, 2091);Tweezijdig kerend;has_aspect
42D-001-05: Roompotsluis (1982, 2091);Enkel kerend;has_aspect
42D-001-05: Roompotsluis (1982, 2091);Roldeur;has_aspect
42D-001-05: Roompotsluis (1982, 2091);Deurschuiven;has_aspect
42D-001-05: Roompotsluis (1982, 2091);Elektromechanisch bewegingswerk deurschuiven;has_aspect
42D-001-05: Roompotsluis (1982, 2091);Elektromechanisch bewegingswerk roldeur;has_aspect
42D-001-05: Roompotsluis (1982, 2091);CEMT Va;has_aspect
42D-001-05: Roompotsluis (1982, 2091);Kolkbreedte tussen 10m en 20m;has_aspect
43G-001-01: Sluis 1 (1967, 2073);Hoogwater keren;has_aspect
43G-001-01: Sluis 1 (1967, 2073);Tweezijdig kerend;has_aspect
43G-001-01: Sluis 1 (1967, 2073);Enkel kerend;has_aspect
43G-001-01: Sluis 1 (1967, 2073);Vierkantkerende puntdeuren;has_aspect
43G-001-01: Sluis 1 (1967, 2073);Deurschuiven;has_aspect
43G-001-01: Sluis 1 (1967, 2073);Elektrohydraulisch bewegingswerk deurschuiven;has_aspect
43G-001-01: Sluis 1 (1967, 2073);Elektrohydraulisch bewegingswerk puntdeur;has_aspect
43G-001-01: Sluis 1 (1967, 2073);Vloeddeuren;has_aspect
43G-001-01: Sluis 1 (1967, 2073);Middenhoofd;has_aspect
43G-001-01: Sluis 1 (1967, 2073);Kolkbreedte groter dan 20m;has_aspect
32E-001-01: Nijkerkersluis (1962, 2071);Hoogwater keren;has_aspect
32E-001-01: Nijkerkersluis (1962, 2071);Tweezijdig kerend;has_aspect
32E-001-01: Nijkerkersluis (1962, 2071);Dubbel kerend;has_aspect
32E-001-01: Nijkerkersluis (1962, 2071);Vierkantkerende puntdeuren;has_aspect
32E-001-01: Nijkerkersluis (1962, 2071);Deurschuiven;has_aspect
32E-001-01: Nijkerkersluis (1962, 2071);Elektrohydraulisch bewegingswerk deurschuiven;has_aspect
32E-001-01: Nijkerkersluis (1962, 2071);Elektrohydraulisch bewegingswerk puntdeur;has_aspect
32E-001-01: Nijkerkersluis (1962, 2071);CEMT II;has_aspect
32E-001-01: Nijkerkersluis (1962, 2071);Kolkbreedte kleiner dan 10m;has_aspect
43C-001-01: Grevelingensluis (1960, 2069);Hoogwater keren;has_aspect
43C-001-01: Grevelingensluis (1960, 2069);Tweezijdig kerend;has_aspect
43C-001-01: Grevelingensluis (1960, 2069);Dubbel kerend;has_aspect
43C-001-01: Grevelingensluis (1960, 2069);Vierkantkerende puntdeuren;has_aspect
43C-001-01: Grevelingensluis (1960, 2069);Deurschuiven;has_aspect
43C-001-01: Grevelingensluis (1960, 2069);Elektrohydraulisch bewegingswerk deurschuiven;has_aspect
43C-001-01: Grevelingensluis (1960, 2069);Elektrohydraulisch bewegingswerk puntdeur;has_aspect
43C-001-01: Grevelingensluis (1960, 2069);CEMT Va;has_aspect
43C-001-01: Grevelingensluis (1960, 2069);Kolkbreedte tussen 10m en 20m;has_aspect
38F-352-01: Prinses Beatrixsluis oostelijke sluis (1938, 2055);Hoogwater keren;has_aspect
38F-352-01: Prinses Beatrixsluis oostelijke sluis (1938, 2055);Spuimogelijkheid door kolk;has_aspect
38F-352-01: Prinses Beatrixsluis oostelijke sluis (1938, 2055);Tweezijdig kerend;has_aspect
38F-352-01: Prinses Beatrixsluis oostelijke sluis (1938, 2055);Enkel kerend;has_aspect
38F-352-01: Prinses Beatrixsluis oostelijke sluis (1938, 2055);Hefdeur;has_aspect
38F-352-01: Prinses Beatrixsluis oostelijke sluis (1938, 2055);Roldeur;has_aspect
38F-352-01: Prinses Beatrixsluis oostelijke sluis (1938, 2055);Deurschuiven;has_aspect
38F-352-01: Prinses Beatrixsluis oostelijke sluis (1938, 2055);Elektrohydraulisch bewegingswerk deurschuiven;has_aspect
38F-352-01: Prinses Beatrixsluis oostelijke sluis (1938, 2055);Elektromechanisch bewegingswerk hefdeur;has_aspect
38F-352-01: Prinses Beatrixsluis oostelijke sluis (1938, 2055);CEMT Vb en VIa;has_aspect
38F-352-01: Prinses Beatrixsluis oostelijke sluis (1938, 2055);Kolkbreedte tussen 10m en 20m;has_aspect
38F-006-01: Koninginnensluis (1885, Onbekend);Hoogwater keren;has_aspect
38F-006-01: Koninginnensluis (1885, Onbekend);Eenzijdig kerend;has_aspect
38F-006-01: Koninginnensluis (1885, Onbekend);Dubbel kerend;has_aspect
38F-006-01: Koninginnensluis (1885, Onbekend);Vierkantkerende puntdeuren;has_aspect
38F-006-01: Koninginnensluis (1885, Onbekend);Deurschuiven;has_aspect
38F-006-01: Koninginnensluis (1885, Onbekend);Elektrohydraulisch bewegingswerk deurschuiven;has_aspect
38F-006-01: Koninginnensluis (1885, Onbekend);Elektromechanisch bewegingswerk puntdeur;has_aspect
38F-006-01: Koninginnensluis (1885, Onbekend);CEMT Va;has_aspect
38F-006-01: Koninginnensluis (1885, Onbekend);Kolkbreedte groter dan 20m;has_aspect
38F-006-01: Koninginnensluis (1885, Onbekend);Verval tussen 6m en 9m;has_aspect
45B-351-03: Sluis Lith noord (nieuw) (1997, 2106);Spuimogelijkheid door kolk;has_aspect
45B-351-03: Sluis Lith noord (nieuw) (1997, 2106);Eenzijdig kerend;has_aspect
45B-351-03: Sluis Lith noord (nieuw) (1997, 2106);Enkel kerend;has_aspect
45B-351-03: Sluis Lith noord (nieuw) (1997, 2106);Puntdeur;has_aspect
45B-351-03: Sluis Lith noord (nieuw) (1997, 2106);Deurschuiven;has_aspect
45B-351-03: Sluis Lith noord (nieuw) (1997, 2106);Elektrohydraulisch bewegingswerk deurschuiven;has_aspect
45B-351-03: Sluis Lith noord (nieuw) (1997, 2106);Elektromechanisch bewegingswerk puntdeur;has_aspect
45B-351-03: Sluis Lith noord (nieuw) (1997, 2106);CEMT Va;has_aspect
45B-351-03: Sluis Lith noord (nieuw) (1997, 2106);Kolkbreedte tussen 10m en 20m;has_aspect
50F-350-01: Sluis III (MWW) (1916, 2025);Eenzijdig kerend;has_aspect
50F-350-01: Sluis III (MWW) (1916, 2025);Enkel kerend;has_aspect
50F-350-01: Sluis III (MWW) (1916, 2025);Puntdeur;has_aspect
50F-350-01: Sluis III (MWW) (1916, 2025);Omloopriolen;has_aspect
50F-350-01: Sluis III (MWW) (1916, 2025);Elektromechanisch bewegingswerk puntdeur;has_aspect
50F-350-01: Sluis III (MWW) (1916, 2025);CEMT II (beperkt);has_aspect
50F-350-01: Sluis III (MWW) (1916, 2025);Elektrohydraulisch bewegingswerk omloopriool;has_aspect
50F-350-01: Sluis III (MWW) (1916, 2025);Middenhoofd;has_aspect
50F-350-01: Sluis III (MWW) (1916, 2025);Kolkbreedte tussen 10m en 20m;has_aspect
50F-350-01: Sluis III (MWW) (1916, 2025);Verval tussen 3m en 6m;has_aspect
07F-002-01: Zeesluizen Farmsum kamer 1 (1958, 2067);Hoogwater keren;has_aspect
07F-002-01: Zeesluizen Farmsum kamer 1 (1958, 2067);Spuimogelijkheid door kolk;has_aspect
07F-002-01: Zeesluizen Farmsum kamer 1 (1958, 2067);Scheiden zout-zout water;has_aspect
07F-002-01: Zeesluizen Farmsum kamer 1 (1958, 2067);Tweezijdig kerend;has_aspect
07F-002-01: Zeesluizen Farmsum kamer 1 (1958, 2067);Dubbel kerend;has_aspect
07F-002-01: Zeesluizen Farmsum kamer 1 (1958, 2067);Vierkantkerende puntdeuren;has_aspect
07F-002-01: Zeesluizen Farmsum kamer 1 (1958, 2067);Deurschuiven;has_aspect
07F-002-01: Zeesluizen Farmsum kamer 1 (1958, 2067);Elektrohydraulisch bewegingswerk deurschuiven;has_aspect
07F-002-01: Zeesluizen Farmsum kamer 1 (1958, 2067);Elektrohydraulisch bewegingswerk puntdeur;has_aspect
07F-002-01: Zeesluizen Farmsum kamer 1 (1958, 2067);CEMT V;has_aspect
07F-002-01: Zeesluizen Farmsum kamer 1 (1958, 2067);Vloeddeuren;has_aspect
07F-002-01: Zeesluizen Farmsum kamer 1 (1958, 2067);Kolkbreedte tussen 10m en 20m;has_aspect
07F-002-01: Zeesluizen Farmsum kamer 1 (1958, 2067);Verval tussen 3m en 6m;has_aspect
11C-350-01: Terhorne sluis (1948, 2057);Hoogwater keren;has_aspect
11C-350-01: Terhorne sluis (1948, 2057);Eenzijdig kerend;has_aspect
11C-350-01: Terhorne sluis (1948, 2057);Enkel kerend;has_aspect
11C-350-01: Terhorne sluis (1948, 2057);Vierkantkerende puntdeuren;has_aspect
11C-350-01: Terhorne sluis (1948, 2057);Deurschuiven;has_aspect
11C-350-01: Terhorne sluis (1948, 2057);Elektromechanisch bewegingswerk deurschuiven;has_aspect
11C-350-01: Terhorne sluis (1948, 2057);Elektromechanisch bewegingswerk puntdeur;has_aspect
11C-350-01: Terhorne sluis (1948, 2057);CEMT IV;has_aspect
11C-350-01: Terhorne sluis (1948, 2057);Kolkbreedte tussen 10m en 20m;has_aspect
07D-136-01: Driewegsluis (MWW) (1934, 2043);Hoogwater keren;has_aspect
07D-136-01: Driewegsluis (MWW) (1934, 2043);Eenzijdig kerend;has_aspect
07D-136-01: Driewegsluis (MWW) (1934, 2043);Enkel kerend;has_aspect
07D-136-01: Driewegsluis (MWW) (1934, 2043);Roldeur;has_aspect
07D-136-01: Driewegsluis (MWW) (1934, 2043);Handmatig bewegingswerk roldeur;has_aspect
07D-136-01: Driewegsluis (MWW) (1934, 2043);CEMT II;has_aspect
07D-136-01: Driewegsluis (MWW) (1934, 2043);Kolkbreedte tussen 10m en 20m;has_aspect
07D-136-01: Driewegsluis (MWW) (1934, 2043);Verval kleiner dan 3m;has_aspect
40A-004-01: Sluis Driel (1970, 2078);Eenzijdig kerend;has_aspect
40A-004-01: Sluis Driel (1970, 2078);Enkel kerend;has_aspect
40A-004-01: Sluis Driel (1970, 2078);Puntdeur;has_aspect
40A-004-01: Sluis Driel (1970, 2078);Deurschuiven;has_aspect
40A-004-01: Sluis Driel (1970, 2078);Elektrohydraulisch bewegingswerk deurschuiven;has_aspect
40A-004-01: Sluis Driel (1970, 2078);Elektromechanisch bewegingswerk puntdeur;has_aspect
40A-004-01: Sluis Driel (1970, 2078);CEMT Va;has_aspect
40A-004-01: Sluis Driel (1970, 2078);Middenhoofd;has_aspect
40A-004-01: Sluis Driel (1970, 2078);Kolkbreedte tussen 10m en 20m;has_aspect
38F-001-02: Sluis Hagestein (1961, 2068);Eenzijdig kerend;has_aspect
38F-001-02: Sluis Hagestein (1961, 2068);Enkel kerend;has_aspect
38F-001-02: Sluis Hagestein (1961, 2068);Puntdeur;has_aspect
38F-001-02: Sluis Hagestein (1961, 2068);Deurschuiven;has_aspect
38F-001-02: Sluis Hagestein (1961, 2068);Elektrohydraulisch bewegingswerk deurschuiven;has_aspect
38F-001-02: Sluis Hagestein (1961, 2068);Elektromechanisch bewegingswerk puntdeur;has_aspect
38F-001-02: Sluis Hagestein (1961, 2068);CEMT Va;has_aspect
38F-001-02: Sluis Hagestein (1961, 2068);Middenhoofd;has_aspect
38F-001-02: Sluis Hagestein (1961, 2068);Kolkbreedte tussen 10m en 20m;has_aspect
39B-003-01: Sluis Amerongen (1964, 2073);Eenzijdig kerend;has_aspect
39B-003-01: Sluis Amerongen (1964, 2073);Enkel kerend;has_aspect
39B-003-01: Sluis Amerongen (1964, 2073);Puntdeur;has_aspect
39B-003-01: Sluis Amerongen (1964, 2073);Deurschuiven;has_aspect
39B-003-01: Sluis Amerongen (1964, 2073);Elektrohydraulisch bewegingswerk deurschuiven;has_aspect
39B-003-01: Sluis Amerongen (1964, 2073);Elektromechanisch bewegingswerk puntdeur;has_aspect
39B-003-01: Sluis Amerongen (1964, 2073);CEMT Va;has_aspect
39B-003-01: Sluis Amerongen (1964, 2073);Middenhoofd;has_aspect
39B-003-01: Sluis Amerongen (1964, 2073);Kolkbreedte tussen 10m en 20m;has_aspect
60A-001-01: Sluis Born midden (1958, 2067);Spuimogelijkheid door kolk;has_aspect
60A-001-01: Sluis Born midden (1958, 2067);Eenzijdig kerend;has_aspect
60A-001-01: Sluis Born midden (1958, 2067);Enkel kerend;has_aspect
60A-001-01: Sluis Born midden (1958, 2067);Puntdeur;has_aspect
60A-001-01: Sluis Born midden (1958, 2067);Omloopriolen;has_aspect
60A-001-01: Sluis Born midden (1958, 2067);Elektrohydraulisch bewegingswerk puntdeur;has_aspect
60A-001-01: Sluis Born midden (1958, 2067);CEMT Va;has_aspect
60A-001-01: Sluis Born midden (1958, 2067);Elektrohydraulisch bewegingswerk omloopriool;has_aspect
60A-001-01: Sluis Born midden (1958, 2067);Kolkbreedte tussen 10m en 20m;has_aspect
44F-002-01: Wilhelminasluis, Andel (MWW) (1896, 2033);Tweezijdig kerend;has_aspect
44F-002-01: Wilhelminasluis, Andel (MWW) (1896, 2033);Enkel kerend;has_aspect
44F-002-01: Wilhelminasluis, Andel (MWW) (1896, 2033);Waaierdeur;has_aspect
44F-002-01: Wilhelminasluis, Andel (MWW) (1896, 2033);Deurschuiven;has_aspect
44F-002-01: Wilhelminasluis, Andel (MWW) (1896, 2033);Elektromechanisch bewegingswerk deurschuiven;has_aspect
44F-002-01: Wilhelminasluis, Andel (MWW) (1896, 2033);CEMT Va;has_aspect
44F-002-01: Wilhelminasluis, Andel (MWW) (1896, 2033);Kolkbreedte tussen 10m en 20m;has_aspect
58C-001-01: Sluis Panheel (oude kolk,noord) (MWW) (1930, 2039);Eenzijdig kerend;has_aspect
58C-001-01: Sluis Panheel (oude kolk,noord) (MWW) (1930, 2039);Enkel kerend;has_aspect
58C-001-01: Sluis Panheel (oude kolk,noord) (MWW) (1930, 2039);Puntdeur;has_aspect
58C-001-01: Sluis Panheel (oude kolk,noord) (MWW) (1930, 2039);Omloopriolen;has_aspect
58C-001-01: Sluis Panheel (oude kolk,noord) (MWW) (1930, 2039);Elektromechanisch bewegingswerk puntdeur;has_aspect
58C-001-01: Sluis Panheel (oude kolk,noord) (MWW) (1930, 2039);CEMT II;has_aspect
58C-001-01: Sluis Panheel (oude kolk,noord) (MWW) (1930, 2039);Elektromechanisch bewegingswerk omloopriool;has_aspect
58C-001-01: Sluis Panheel (oude kolk,noord) (MWW) (1930, 2039);Kolkbreedte kleiner dan 10m;has_aspect
58C-001-01: Sluis Panheel (oude kolk,noord) (MWW) (1930, 2039);Verval tussen 6m en 9m;has_aspect
61F-002-01: Sluis Bosscherveld (MWW) (1930, 2039);Hoogwater keren;has_aspect
61F-002-01: Sluis Bosscherveld (MWW) (1930, 2039);Spuimogelijkheid door kolk;has_aspect
61F-002-01: Sluis Bosscherveld (MWW) (1930, 2039);Enkel kerend;has_aspect
61F-002-01: Sluis Bosscherveld (MWW) (1930, 2039);Hefdeur;has_aspect
61F-002-01: Sluis Bosscherveld (MWW) (1930, 2039);Via deur;has_aspect
61F-002-01: Sluis Bosscherveld (MWW) (1930, 2039);Elektromechanisch bewegingswerk hefdeur;has_aspect
61F-002-01: Sluis Bosscherveld (MWW) (1930, 2039);CEMT Va;has_aspect
61F-002-01: Sluis Bosscherveld (MWW) (1930, 2039);Kolkbreedte tussen 10m en 20m;has_aspect
61F-002-01: Sluis Bosscherveld (MWW) (1930, 2039);Verval tussen 3m en 6m;has_aspect
31H-354-01: Sluis bij Den Hommel (MWW) (1937, 2046);Hoogwater keren;has_aspect
31H-354-01: Sluis bij Den Hommel (MWW) (1937, 2046);Eenzijdig kerend;has_aspect
31H-354-01: Sluis bij Den Hommel (MWW) (1937, 2046);Enkel kerend;has_aspect
31H-354-01: Sluis bij Den Hommel (MWW) (1937, 2046);Puntdeur;has_aspect
31H-354-01: Sluis bij Den Hommel (MWW) (1937, 2046);Deurschuiven;has_aspect
31H-354-01: Sluis bij Den Hommel (MWW) (1937, 2046);Elektromechanisch bewegingswerk deurschuiven;has_aspect
31H-354-01: Sluis bij Den Hommel (MWW) (1937, 2046);Elektromechanisch bewegingswerk puntdeur;has_aspect
31H-354-01: Sluis bij Den Hommel (MWW) (1937, 2046);CEMT Va;has_aspect
31H-354-01: Sluis bij Den Hommel (MWW) (1937, 2046);Kolkbreedte kleiner dan 10m;has_aspect
60A-001-06: Sluis Born west (MWW) (1933, 2042);Spuimogelijkheid door kolk;has_aspect
60A-001-06: Sluis Born west (MWW) (1933, 2042);Eenzijdig kerend;has_aspect
60A-001-06: Sluis Born west (MWW) (1933, 2042);Enkel kerend;has_aspect
60A-001-06: Sluis Born west (MWW) (1933, 2042);Hefdeur;has_aspect
60A-001-06: Sluis Born west (MWW) (1933, 2042);Elektrohydraulisch bewegingswerk hefdeur;has_aspect
60A-001-06: Sluis Born west (MWW) (1933, 2042);CEMT Va;has_aspect
60A-001-06: Sluis Born west (MWW) (1933, 2042);Kolkbreedte tussen 10m en 20m;has_aspect
57H-001-01: Sluis 16 (MWW) (1930, 2039);Spuimogelijkheid door kolk;has_aspect
57H-001-01: Sluis 16 (MWW) (1930, 2039);Enkel kerend;has_aspect
57H-001-01: Sluis 16 (MWW) (1930, 2039);Hefdeur;has_aspect
57H-001-01: Sluis 16 (MWW) (1930, 2039);Via deur;has_aspect
57H-001-01: Sluis 16 (MWW) (1930, 2039);Elektromechanisch bewegingswerk hefdeur;has_aspect
57H-001-01: Sluis 16 (MWW) (1930, 2039);CEMT II;has_aspect
57H-001-01: Sluis 16 (MWW) (1930, 2039);Kolkbreedte tussen 10m en 20m;has_aspect
57H-001-01: Sluis 16 (MWW) (1930, 2039);Verval kleiner dan 3m;has_aspect
