<?xml version="1.0" encoding="UTF-8"?>
<svg xmlns="http://www.w3.org/2000/svg" xmlns:xlink="http://www.w3.org/1999/xlink"
     width="716.8" height="716.8" viewBox="-358.4 -358.4 716.8 716.8">
<defs>
<linearGradient x1="200.0" y1="-0.0" x2="185.2256460540513" y2="-75.44176591159105" gradientUnits="userSpaceOnUse" id="d0">
<stop offset="0" stop-color="#6a9ffc" />
<stop offset="1" stop-color="#f27663" />
</linearGradient>
<linearGradient x1="181.44741550093164" y1="-84.1239288670725" x2="95.38442353318402" y2="-175.78911157191212" gradientUnits="userSpaceOnUse" id="d1">
<stop offset="0" stop-color="#f27663" />
<stop offset="1" stop-color="#c89336" />
</linearGradient>
<linearGradient x1="181.44741550093164" y1="-84.1239288670725" x2="14.192335655027927" y2="199.49580849896327" gradientUnits="userSpaceOnUse" id="d2">
<stop offset="0" stop-color="#f27663" />
<stop offset="1" stop-color="#56c950" />
</linearGradient>
<linearGradient x1="139.7374983043296" y1="-143.08539956140694" x2="124.33292596451804" y2="-156.65670595637354" gradientUnits="userSpaceOnUse" id="d3">
<stop offset="0" stop-color="#56c950" />
<stop offset="1" stop-color="#a57fff" />
</linearGradient>
<linearGradient x1="152.6406947471452" y1="-129.23164591967725" x2="-121.86235026534796" y2="-158.5861519421089" gradientUnits="userSpaceOnUse" id="d4">
<stop offset="0" stop-color="#56c950" />
<stop offset="1" stop-color="#dc69e2" />
</linearGradient>
<linearGradient x1="152.6406947471452" y1="-129.23164591967725" x2="-199.69374273990815" y2="-11.063865080855843" gradientUnits="userSpaceOnUse" id="d5">
<stop offset="0" stop-color="#56c950" />
<stop offset="1" stop-color="#8db32f" />
</linearGradient>
<linearGradient x1="149.53880609877015" y1="-132.80867995185565" x2="198.94629698440363" y2="20.50294896334358" gradientUnits="userSpaceOnUse" id="d6">
<stop offset="0" stop-color="#56c950" />
<stop offset="1" stop-color="#38cc8e" />
</linearGradient>
<linearGradient x1="128.00639799638375" y1="-153.66965241058952" x2="-180.10664129572135" y2="86.9574479913846" gradientUnits="userSpaceOnUse" id="d7">
<stop offset="0" stop-color="#a57fff" />
<stop offset="1" stop-color="#40bccf" />
</linearGradient>
<linearGradient x1="78.33556824372863" y1="-184.02048458780922" x2="3.134629578724061" y2="-199.975433734757" gradientUnits="userSpaceOnUse" id="d8">
<stop offset="0" stop-color="#c89336" />
<stop offset="1" stop-color="#38cc8e" />
</linearGradient>
<linearGradient x1="95.38442353318402" y1="-175.78911157191212" x2="-199.69374273990815" y2="-11.063865080855843" gradientUnits="userSpaceOnUse" id="d9">
<stop offset="0" stop-color="#c89336" />
<stop offset="1" stop-color="#8db32f" />
</linearGradient>
<linearGradient x1="-71.03604289459675" y1="-186.95956945253434" x2="-197.75293807347057" y2="-29.8960780590048" gradientUnits="userSpaceOnUse" id="d10">
<stop offset="0" stop-color="#38cc8e" />
<stop offset="1" stop-color="#8db32f" />
</linearGradient>
<linearGradient x1="-43.85359168617971" y1="-195.13293544715054" x2="-180.10664129572135" y2="86.9574479913846" gradientUnits="userSpaceOnUse" id="d11">
<stop offset="0" stop-color="#38cc8e" />
<stop offset="1" stop-color="#40bccf" />
</linearGradient>
<linearGradient x1="-25.20657667301187" y1="-198.4052128660625" x2="-162.36580657880506" y2="116.7790428716303" gradientUnits="userSpaceOnUse" id="d12">
<stop offset="0" stop-color="#38cc8e" />
<stop offset="1" stop-color="#fa66a4" />
</linearGradient>
<linearGradient x1="-6.333698779638268" y1="-199.8996854919207" x2="-114.21991544754387" y2="164.17615818125338" gradientUnits="userSpaceOnUse" id="d13">
<stop offset="0" stop-color="#38cc8e" />
<stop offset="1" stop-color="#6a9ffc" />
</linearGradient>
<linearGradient x1="-6.333698779638268" y1="-199.8996854919207" x2="4.734315676474831" y2="199.94395778586428" gradientUnits="userSpaceOnUse" id="d14">
<stop offset="0" stop-color="#38cc8e" />
<stop offset="1" stop-color="#56c950" />
</linearGradient>
<linearGradient x1="-171.86751395571645" y1="-102.28175617714828" x2="-188.5887165687576" y2="-66.5905097063299" gradientUnits="userSpaceOnUse" id="d15">
<stop offset="0" stop-color="#dc69e2" />
<stop offset="1" stop-color="#8db32f" />
</linearGradient>
<linearGradient x1="-161.4263885228449" y1="-118.07421855964803" x2="96.78766913986234" y2="175.02041910152238" gradientUnits="userSpaceOnUse" id="d16">
<stop offset="0" stop-color="#dc69e2" />
<stop offset="1" stop-color="#a57fff" />
</linearGradient>
<linearGradient x1="-149.53880609877012" y1="-132.80867995185565" x2="136.3112850592247" y2="146.35311259246518" gradientUnits="userSpaceOnUse" id="d17">
<stop offset="0" stop-color="#dc69e2" />
<stop offset="1" stop-color="#c89336" />
</linearGradient>
<linearGradient x1="-149.53880609877012" y1="-132.80867995185565" x2="191.52908914458249" y2="57.589999231173564" gradientUnits="userSpaceOnUse" id="d18">
<stop offset="0" stop-color="#dc69e2" />
<stop offset="1" stop-color="#38cc8e" />
</linearGradient>
<linearGradient x1="-199.975433734757" y1="3.1346295787240686" x2="-190.60294679741048" y2="60.584789115284664" gradientUnits="userSpaceOnUse" id="d19">
<stop offset="0" stop-color="#8db32f" />
<stop offset="1" stop-color="#40bccf" />
</linearGradient>
<linearGradient x1="-199.37588719297372" y1="-15.787830947113038" x2="191.52908914458249" y2="57.589999231173564" gradientUnits="userSpaceOnUse" id="d20">
<stop offset="0" stop-color="#8db32f" />
<stop offset="1" stop-color="#38cc8e" />
</linearGradient>
<linearGradient x1="-182.1145934669869" y1="82.66967307516163" x2="-172.68025954600387" y2="100.90355773274173" gradientUnits="userSpaceOnUse" id="d21">
<stop offset="0" stop-color="#40bccf" />
<stop offset="1" stop-color="#fa66a4" />
</linearGradient>
<linearGradient x1="-156.65670595637354" y1="124.33292596451801" x2="-129.23164591967733" y2="152.64069474714518" gradientUnits="userSpaceOnUse" id="d22">
<stop offset="0" stop-color="#fa66a4" />
<stop offset="1" stop-color="#6a9ffc" />
</linearGradient>
<linearGradient x1="-162.36580657880506" y1="116.7790428716303" x2="4.734315676474831" y2="199.94395778586428" gradientUnits="userSpaceOnUse" id="d23">
<stop offset="0" stop-color="#fa66a4" />
<stop offset="1" stop-color="#56c950" />
</linearGradient>
<linearGradient x1="-72.52943035513569" y1="186.3853044967857" x2="-34.56882502091388" y2="196.98983815586385" gradientUnits="userSpaceOnUse" id="d24">
<stop offset="0" stop-color="#6a9ffc" />
<stop offset="1" stop-color="#f27663" />
</linearGradient>
<linearGradient x1="-81.26974363526205" y1="182.7436148527734" x2="-4.734315676474905" y2="199.94395778586428" gradientUnits="userSpaceOnUse" id="d25">
<stop offset="0" stop-color="#6a9ffc" />
<stop offset="1" stop-color="#56c950" />
</linearGradient>
<linearGradient x1="-98.18472036875254" y1="174.24052538405027" x2="79.80520969258554" y2="183.3879181023724" gradientUnits="userSpaceOnUse" id="d26">
<stop offset="0" stop-color="#6a9ffc" />
<stop offset="1" stop-color="#a57fff" />
</linearGradient>
<linearGradient x1="-114.21991544754387" y1="164.17615818125338" x2="121.86235026534808" y2="158.5861519421088" gradientUnits="userSpaceOnUse" id="d27">
<stop offset="0" stop-color="#6a9ffc" />
<stop offset="1" stop-color="#c89336" />
</linearGradient>
<linearGradient x1="-34.56882502091388" y1="196.98983815586385" x2="-14.192335655028" y2="199.49580849896327" gradientUnits="userSpaceOnUse" id="d28">
<stop offset="0" stop-color="#f27663" />
<stop offset="1" stop-color="#56c950" />
</linearGradient>
<linearGradient x1="42.29114154644339" y1="195.47751621784712" x2="62.10765772201945" y2="190.1121743926056" gradientUnits="userSpaceOnUse" id="d29">
<stop offset="0" stop-color="#56c950" />
<stop offset="1" stop-color="#a57fff" />
</linearGradient>
<linearGradient x1="32.99181692891151" y1="197.26008216496612" x2="106.32147102472558" y2="169.39818416718177" gradientUnits="userSpaceOnUse" id="d30">
<stop offset="0" stop-color="#56c950" />
<stop offset="1" stop-color="#c89336" />
</linearGradient>
<linearGradient x1="23.61854529445571" y1="198.60051439554164" x2="185.22564605405134" y2="75.441765911591" gradientUnits="userSpaceOnUse" id="d31">
<stop offset="0" stop-color="#56c950" />
<stop offset="1" stop-color="#38cc8e" />
</linearGradient>
<linearGradient x1="136.3112850592247" y1="146.35311259246518" x2="181.4474155009316" y2="84.12392886707252" gradientUnits="userSpaceOnUse" id="d32">
<stop offset="0" stop-color="#c89336" />
<stop offset="1" stop-color="#38cc8e" />
</linearGradient>
</defs>
<rect x="-358.4" y="-358.4" width="716.8" height="716.8" fill="#ffffff" fill-opacity="1.0" />
<path d="M200.0,-0.0 A200,200,0,0,0,196.42383932573085,-37.65202975324791 L206.24503129201742,-39.53463124091031 A210.0,210.0,0,0,1,210.0,-0.0 Z" fill="#6a9ffc" fill-opacity="0.9" />
<path d="M196.11634077133232,-39.22219884788027 A200,200,0,0,0,162.365806578805,-116.77904287163037 L170.48409690774525,-122.61799501521189 A210.0,210.0,0,0,1,205.92215780989895,-41.18330879027429 Z" fill="#f27663" fill-opacity="0.9" />
<path d="M161.4263885228449,-118.07421855964802 A200,200,0,0,0,132.80867995185565,-149.53880609877015 L139.44911394944845,-157.01574640370868 A210.0,210.0,0,0,1,169.49770794898714,-123.97792948763042 Z" fill="#56c950" fill-opacity="0.9" />
<path d="M131.60813240857695,-150.59647898913997 A200,200,0,0,0,128.00639799638375,-153.66965241058952 L134.40671789620293,-161.353135031119 A210.0,210.0,0,0,1,138.1885390290058,-158.12630293859698 Z" fill="#a57fff" fill-opacity="0.9" />
<path d="M126.77295770731125,-154.688775268732 A200,200,0,0,0,42.29114154644344,-195.47751621784712 L44.405698623765616,-205.2513920287395 A210.0,210.0,0,0,1,133.11160559267682,-162.4232140321686 Z" fill="#c89336" fill-opacity="0.9" />
<path d="M40.72598478808352,-195.8095864942286 A200,200,0,0,0,-104.96289773772615,-170.2433261496604 L-110.21104262461246,-178.75549245714342 A210.0,210.0,0,0,1,42.7622840274877,-205.60006581894004 Z" fill="#38cc8e" fill-opacity="0.9" />
<path d="M-106.32147102472544,-169.39818416718185 A200,200,0,0,0,-180.76862496221827,-85.57280075625009 L-189.8070562103292,-89.8514407940626 A210.0,210.0,0,0,1,-111.63754457596171,-177.86809337554095 Z" fill="#dc69e2" fill-opacity="0.9" />
<path d="M-181.44741550093164,-84.1239288670725 A200,200,0,0,0,-197.51770159614108,31.412697371887226 L-207.39358667594814,32.98333224048159 A210.0,210.0,0,0,1,-190.51978627597822,-88.33012531042613 Z" fill="#8db32f" fill-opacity="0.9" />
<path d="M-197.26008216496612,32.99181692891161 A200,200,0,0,0,-177.99775337486832,91.19649002839724 L-186.89764104361174,95.7563145298171 A210.0,210.0,0,0,1,-207.12308627321443,34.641407775357195 Z" fill="#40bccf" fill-opacity="0.9" />
<path d="M-177.26249333898693,92.61753859418643 A200,200,0,0,0,-144.19870891524718,138.58835574165607 L-151.40864436100955,145.51777352873887 A210.0,210.0,0,0,1,-186.12561800593627,97.24841552389576 Z" fill="#fa66a4" fill-opacity="0.9" />
<path d="M-143.085399561407,139.73749830432956 A200,200,0,0,0,-54.581061635097974,192.40817994769773 L-57.31011471685287,202.02858894508262 A210.0,210.0,0,0,1,-150.23966953947735,146.72437321954604 Z" fill="#6a9ffc" fill-opacity="0.9" />
<path d="M-53.04006602963802,192.83866675428877 A200,200,0,0,0,-25.20657667301192,198.4052128660625 L-26.466905506662517,208.32547350936562 A210.0,210.0,0,0,1,-55.692069331119924,202.48060009200321 Z" fill="#f27663" fill-opacity="0.9" />
<path d="M-23.61854529445578,198.60051439554164 A200,200,0,0,0,51.495675878056424,193.25681195202966 L54.07045967195925,202.91965254963117 A210.0,210.0,0,0,1,-24.79947255917857,208.53054011531873 Z" fill="#56c950" fill-opacity="0.9" />
<path d="M53.040066029637956,192.8386667542888 A200,200,0,0,0,96.78766913986234,175.02041910152238 L101.62705259685546,183.7714400565985 A210.0,210.0,0,0,1,55.69206933111985,202.48060009200324 Z" fill="#a57fff" fill-opacity="0.9" />
<path d="M98.18472036875247,174.24052538405033 A200,200,0,0,0,161.42638852284492,118.07421855964799 L169.49770794898717,123.97792948763039 A210.0,210.0,0,0,1,103.09395638719009,182.95255165325284 Z" fill="#c89336" fill-opacity="0.9" />
<path d="M162.365806578805,116.77904287163034 A200,200,0,0,0,199.99360003413327,1.599982933387997 L209.99328003583994,1.6799820800573968 A210.0,210.0,0,0,1,170.48409690774525,122.61799501521186 Z" fill="#38cc8e" fill-opacity="0.9" />
<path d="M200.0,-0.0 A200.0,200.0,0,0,0,196.42383932573085,-37.65202975324791 C78.56953573029234,-15.060811901299164,78.44653630853293,-15.68887953915211,196.11634077133232,-39.22219884788027 A200.0,200.0,0,0,0,185.2256460540513,-75.44176591159105 C74.09025842162053,-30.17670636463642,80.0,-0.0,200.0,-0.0 Z" fill="url(#d0)" fill-opacity="0.6" />
<path d="M181.44741550093164,-84.1239288670725 A200.0,200.0,0,0,0,162.365806578805,-116.77904287163037 C64.94632263152201,-46.71161714865215,50.709183082924504,-61.8755101074928,126.77295770731125,-154.688775268732 A200.0,200.0,0,0,0,95.38442353318402,-175.78911157191212 C38.15376941327361,-70.31564462876484,72.57896620037266,-33.649571546829,181.44741550093164,-84.1239288670725 Z" fill="url(#d1)" fill-opacity="0.6" />
<path d="M185.2256460540513,-75.44176591159105 A200.0,200.0,0,0,0,181.44741550093164,-84.1239288670725 C72.57896620037266,-33.649571546829,5.676934262011171,79.79832339958531,14.192335655027927,199.49580849896327 A200.0,200.0,0,0,0,23.61854529445571,198.60051439554164 C9.447418117782284,79.44020575821666,74.09025842162053,-30.17670636463642,185.2256460540513,-75.44176591159105 Z" fill="url(#d2)" fill-opacity="0.6" />
<path d="M139.7374983043296,-143.08539956140694 A200.0,200.0,0,0,0,132.80867995185565,-149.53880609877015 C53.123471980742266,-59.815522439508065,52.64325296343078,-60.23859159565599,131.60813240857695,-150.59647898913997 A200.0,200.0,0,0,0,124.33292596451804,-156.65670595637354 C49.73317038580722,-62.66268238254942,55.89499932173184,-57.23415982456278,139.7374983043296,-143.08539956140694 Z" fill="url(#d3)" fill-opacity="0.6" />
<path d="M152.6406947471452,-129.23164591967725 A200.0,200.0,0,0,0,139.7374983043296,-143.08539956140694 C55.89499932173184,-57.23415982456278,-42.528588409890176,-67.75927366687274,-106.32147102472544,-169.39818416718185 A200.0,200.0,0,0,0,-121.86235026534796,-158.5861519421089 C-48.74494010613918,-63.434460776843565,61.056277898858085,-51.692658367870905,152.6406947471452,-129.23164591967725 Z" fill="url(#d4)" fill-opacity="0.6" />
<path d="M149.53880609877015,-132.80867995185565 A200.0,200.0,0,0,0,152.6406947471452,-129.23164591967725 C61.056277898858085,-51.692658367870905,-79.87749709596326,-4.4255460323423375,-199.69374273990815,-11.063865080855843 A200.0,200.0,0,0,0,-199.37588719297372,-15.787830947113038 C-79.7503548771895,-6.315132378845216,59.815522439508065,-53.123471980742266,149.53880609877015,-132.80867995185565 Z" fill="url(#d5)" fill-opacity="0.6" />
<path d="M161.4263885228449,-118.07421855964802 A200.0,200.0,0,0,0,149.53880609877015,-132.80867995185565 C59.815522439508065,-53.123471980742266,79.57851879376146,8.201179585337433,198.94629698440363,20.50294896334358 A200.0,200.0,0,0,0,199.99360003413327,1.599982933387997 C79.99744001365332,0.6399931733551988,64.57055540913795,-47.22968742385921,161.4263885228449,-118.07421855964802 Z" fill="url(#d6)" fill-opacity="0.6" />
<path d="M124.33292596451804,-156.65670595637354 A200.0,200.0,0,0,0,128.00639799638375,-153.66965241058952 C51.2025591985535,-61.46786096423581,-72.04265651828854,34.78297919655384,-180.10664129572135,86.9574479913846 A200.0,200.0,0,0,0,-182.1145934669869,82.66967307516163 C-72.84583738679476,33.06786923006465,49.73317038580722,-62.66268238254942,124.33292596451804,-156.65670595637354 Z" fill="url(#d7)" fill-opacity="0.6" />
<path d="M78.33556824372863,-184.02048458780922 A200.0,200.0,0,0,0,42.29114154644344,-195.47751621784712 C16.916456618577378,-78.19100648713885,16.29039391523341,-78.32383459769144,40.72598478808352,-195.8095864942286 A200.0,200.0,0,0,0,3.134629578724061,-199.975433734757 C1.2538518314896245,-79.9901734939028,31.334227297491452,-73.60819383512369,78.33556824372863,-184.02048458780922 Z" fill="url(#d8)" fill-opacity="0.6" />
<path d="M95.38442353318402,-175.78911157191212 A200.0,200.0,0,0,0,78.33556824372863,-184.02048458780922 C31.334227297491452,-73.60819383512369,-79.10117522938823,-11.95843122360192,-197.75293807347057,-29.8960780590048 A200.0,200.0,0,0,0,-199.69374273990815,-11.063865080855843 C-79.87749709596326,-4.4255460323423375,38.15376941327361,-70.31564462876484,95.38442353318402,-175.78911157191212 Z" fill="url(#d9)" fill-opacity="0.6" />
<path d="M-71.03604289459675,-186.95956945253434 A200.0,200.0,0,0,0,-104.96289773772615,-170.2433261496604 C-41.98515909509047,-68.09733045986415,-75.43548662750304,-26.63620388253196,-188.5887165687576,-66.5905097063299 A200.0,200.0,0,0,0,-197.75293807347057,-29.8960780590048 C-79.10117522938823,-11.95843122360192,-28.4144171578387,-74.78382778101374,-71.03604289459675,-186.95956945253434 Z" fill="url(#d10)" fill-opacity="0.6" />
<path d="M-43.85359168617971,-195.13293544715054 A200.0,200.0,0,0,0,-71.03604289459675,-186.95956945253434 C-28.4144171578387,-74.78382778101374,-76.24117871896419,24.233915646113868,-190.60294679741048,60.584789115284664 A200.0,200.0,0,0,0,-180.10664129572135,86.9574479913846 C-72.04265651828854,34.78297919655384,-17.541436674471885,-78.05317417886022,-43.85359168617971,-195.13293544715054 Z" fill="url(#d11)" fill-opacity="0.6" />
<path d="M-25.20657667301187,-198.4052128660625 A200.0,200.0,0,0,0,-43.85359168617971,-195.13293544715054 C-17.541436674471885,-78.05317417886022,-69.07210381840154,40.3614230930967,-172.68025954600387,100.90355773274173 A200.0,200.0,0,0,0,-162.36580657880506,116.7790428716303 C-64.94632263152202,46.711617148652124,-10.082630669204748,-79.362085146425,-25.20657667301187,-198.4052128660625 Z" fill="url(#d12)" fill-opacity="0.6" />
<path d="M-6.333698779638268,-199.8996854919207 A200.0,200.0,0,0,0,-25.20657667301187,-198.4052128660625 C-10.082630669204748,-79.362085146425,-51.69265836787093,61.05627789885807,-129.23164591967733,152.64069474714518 A200.0,200.0,0,0,0,-114.21991544754387,164.17615818125338 C-45.68796617901755,65.67046327250135,-2.5334795118553073,-79.95987419676828,-6.333698779638268,-199.8996854919207 Z" fill="url(#d13)" fill-opacity="0.6" />
<path d="M3.134629578724061,-199.975433734757 A200.0,200.0,0,0,0,-6.333698779638268,-199.8996854919207 C-2.5334795118553073,-79.95987419676828,1.8937262705899327,79.97758311434572,4.734315676474831,199.94395778586428 A200.0,200.0,0,0,0,14.192335655027927,199.49580849896327 C5.676934262011171,79.79832339958531,1.2538518314896245,-79.9901734939028,3.134629578724061,-199.975433734757 Z" fill="url(#d14)" fill-opacity="0.6" />
<path d="M-171.86751395571645,-102.28175617714828 A200.0,200.0,0,0,0,-180.76862496221827,-85.57280075625009 C-72.30744998488731,-34.229120302500036,-72.57896620037266,-33.649571546829,-181.44741550093164,-84.1239288670725 A200.0,200.0,0,0,0,-188.5887165687576,-66.5905097063299 C-75.43548662750304,-26.63620388253196,-68.74700558228658,-40.912702470859315,-171.86751395571645,-102.28175617714828 Z" fill="url(#d15)" fill-opacity="0.6" />
<path d="M-161.4263885228449,-118.07421855964803 A200.0,200.0,0,0,0,-171.86751395571645,-102.28175617714828 C-68.74700558228658,-40.912702470859315,31.922083877034215,73.35516724094896,79.80520969258554,183.3879181023724 A200.0,200.0,0,0,0,96.78766913986234,175.02041910152238 C38.71506765594494,70.00816764060896,-64.57055540913795,-47.22968742385922,-161.4263885228449,-118.07421855964803 Z" fill="url(#d16)" fill-opacity="0.6" />
<path d="M-149.53880609877012,-132.80867995185565 A200.0,200.0,0,0,0,-161.4263885228449,-118.07421855964803 C-64.57055540913795,-47.22968742385922,48.74494010613924,63.43446077684353,121.86235026534808,158.5861519421088 A200.0,200.0,0,0,0,136.3112850592247,146.35311259246518 C54.52451402368988,58.541245036986076,-59.81552243950805,-53.123471980742266,-149.53880609877012,-132.80867995185565 Z" fill="url(#d17)" fill-opacity="0.6" />
<path d="M-121.86235026534796,-158.5861519421089 A200.0,200.0,0,0,0,-149.53880609877012,-132.80867995185565 C-59.81552243950805,-53.123471980742266,76.61163565783299,23.035999692469428,191.52908914458249,57.589999231173564 A200.0,200.0,0,0,0,198.94629698440363,20.50294896334358 C79.57851879376146,8.201179585337433,-48.74494010613918,-63.434460776843565,-121.86235026534796,-158.5861519421089 Z" fill="url(#d18)" fill-opacity="0.6" />
<path d="M-199.975433734757,3.1346295787240686 A200.0,200.0,0,0,0,-197.51770159614108,31.412697371887226 C-79.00708063845644,12.565078948754891,-78.90403286598645,13.196726771564645,-197.26008216496612,32.99181692891161 A200.0,200.0,0,0,0,-190.60294679741048,60.584789115284664 C-76.24117871896419,24.233915646113868,-79.9901734939028,1.2538518314896274,-199.975433734757,3.1346295787240686 Z" fill="url(#d19)" fill-opacity="0.6" />
<path d="M-199.37588719297372,-15.787830947113038 A200.0,200.0,0,0,0,-199.975433734757,3.1346295787240686 C-79.9901734939028,1.2538518314896274,74.09025842162053,30.176706364636402,185.22564605405134,75.441765911591 A200.0,200.0,0,0,0,191.52908914458249,57.589999231173564 C76.61163565783299,23.035999692469428,-79.7503548771895,-6.315132378845216,-199.37588719297372,-15.787830947113038 Z" fill="url(#d20)" fill-opacity="0.6" />
<path d="M-182.1145934669869,82.66967307516163 A200.0,200.0,0,0,0,-177.99775337486832,91.19649002839724 C-71.19910134994733,36.478596011358896,-70.90499733559477,37.047015437674574,-177.26249333898693,92.61753859418643 A200.0,200.0,0,0,0,-172.68025954600387,100.90355773274173 C-69.07210381840154,40.3614230930967,-72.84583738679476,33.06786923006465,-182.1145934669869,82.66967307516163 Z" fill="url(#d21)" fill-opacity="0.6" />
<path d="M-156.65670595637354,124.33292596451801 A200.0,200.0,0,0,0,-144.19870891524718,138.58835574165607 C-57.679483566098874,55.435342296662434,-57.2341598245628,55.89499932173183,-143.085399561407,139.73749830432956 A200.0,200.0,0,0,0,-129.23164591967733,152.64069474714518 C-51.69265836787093,61.05627789885807,-62.66268238254942,49.733170385807206,-156.65670595637354,124.33292596451801 Z" fill="url(#d22)" fill-opacity="0.6" />
<path d="M-162.36580657880506,116.7790428716303 A200.0,200.0,0,0,0,-156.65670595637354,124.33292596451801 C-62.66268238254942,49.733170385807206,-1.893726270589962,79.97758311434572,-4.734315676474905,199.94395778586428 A200.0,200.0,0,0,0,4.734315676474831,199.94395778586428 C1.8937262705899327,79.97758311434572,-64.94632263152202,46.711617148652124,-162.36580657880506,116.7790428716303 Z" fill="url(#d23)" fill-opacity="0.6" />
<path d="M-72.52943035513569,186.3853044967857 A200.0,200.0,0,0,0,-54.581061635097974,192.40817994769773 C-21.83242465403919,76.9632719790791,-21.21602641185521,77.13546670171552,-53.04006602963802,192.83866675428877 A200.0,200.0,0,0,0,-34.56882502091388,196.98983815586385 C-13.827530008365551,78.79593526234555,-29.011772142054276,74.55412179871428,-72.52943035513569,186.3853044967857 Z" fill="url(#d24)" fill-opacity="0.6" />
<path d="M-81.26974363526205,182.7436148527734 A200.0,200.0,0,0,0,-72.52943035513569,186.3853044967857 C-29.011772142054276,74.55412179871428,-5.6769342620112,79.79832339958531,-14.192335655028,199.49580849896327 A200.0,200.0,0,0,0,-4.734315676474905,199.94395778586428 C-1.893726270589962,79.97758311434572,-32.50789745410482,73.09744594110936,-81.26974363526205,182.7436148527734 Z" fill="url(#d25)" fill-opacity="0.6" />
<path d="M-98.18472036875254,174.24052538405027 A200.0,200.0,0,0,0,-81.26974363526205,182.7436148527734 C-32.50789745410482,73.09744594110936,24.84306308880778,76.04486975704224,62.10765772201945,190.1121743926056 A200.0,200.0,0,0,0,79.80520969258554,183.3879181023724 C31.922083877034215,73.35516724094896,-39.27388814750102,69.69621015362011,-98.18472036875254,174.24052538405027 Z" fill="url(#d26)" fill-opacity="0.6" />
<path d="M-114.21991544754387,164.17615818125338 A200.0,200.0,0,0,0,-98.18472036875254,174.24052538405027 C-39.27388814750102,69.69621015362011,42.52858840989023,67.75927366687272,106.32147102472558,169.39818416718177 A200.0,200.0,0,0,0,121.86235026534808,158.5861519421088 C48.74494010613924,63.43446077684353,-45.68796617901755,65.67046327250135,-114.21991544754387,164.17615818125338 Z" fill="url(#d27)" fill-opacity="0.6" />
<path d="M-34.56882502091388,196.98983815586385 A200.0,200.0,0,0,0,-25.20657667301192,198.4052128660625 C-10.082630669204768,79.362085146425,-9.447418117782313,79.44020575821666,-23.61854529445578,198.60051439554164 A200.0,200.0,0,0,0,-14.192335655028,199.49580849896327 C-5.6769342620112,79.79832339958531,-13.827530008365551,78.79593526234555,-34.56882502091388,196.98983815586385 Z" fill="url(#d28)" fill-opacity="0.6" />
<path d="M42.29114154644339,195.47751621784712 A200.0,200.0,0,0,0,51.495675878056424,193.25681195202966 C20.59827035122257,77.30272478081187,21.216026411855182,77.13546670171553,53.040066029637956,192.8386667542888 A200.0,200.0,0,0,0,62.10765772201945,190.1121743926056 C24.84306308880778,76.04486975704224,16.916456618577357,78.19100648713885,42.29114154644339,195.47751621784712 Z" fill="url(#d29)" fill-opacity="0.6" />
<path d="M32.99181692891151,197.26008216496612 A200.0,200.0,0,0,0,42.29114154644339,195.47751621784712 C16.916456618577357,78.19100648713885,39.27388814750099,69.69621015362013,98.18472036875247,174.24052538405033 A200.0,200.0,0,0,0,106.32147102472558,169.39818416718177 C42.52858840989023,67.75927366687272,13.196726771564606,78.90403286598645,32.99181692891151,197.26008216496612 Z" fill="url(#d30)" fill-opacity="0.6" />
<path d="M23.61854529445571,198.60051439554164 A200.0,200.0,0,0,0,32.99181692891151,197.26008216496612 C13.196726771564606,78.90403286598645,72.57896620037265,33.64957154682901,181.4474155009316,84.12392886707252 A200.0,200.0,0,0,0,185.22564605405134,75.441765911591 C74.09025842162053,30.176706364636402,9.447418117782284,79.44020575821666,23.61854529445571,198.60051439554164 Z" fill="url(#d31)" fill-opacity="0.6" />
<path d="M136.3112850592247,146.35311259246518 A200.0,200.0,0,0,0,161.42638852284492,118.07421855964799 C64.57055540913797,47.2296874238592,64.94632263152201,46.71161714865214,162.365806578805,116.77904287163034 A200.0,200.0,0,0,0,181.4474155009316,84.12392886707252 C72.57896620037265,33.64957154682901,54.52451402368988,58.541245036986076,136.3112850592247,146.35311259246518 Z" fill="url(#d32)" fill-opacity="0.6" />
<text x="220.00000000000003" y="0" font-size="10" text-anchor="start" dominant-baseline="middle" transform="rotate(-5.425633)" font-family="Fira Code,Noto Sans,Courier New,monospace" fill="black">Radiator</text>
<text x="220.00000000000003" y="0" font-size="10" text-anchor="start" dominant-baseline="middle" transform="rotate(-23.517306)" font-family="Fira Code,Noto Sans,Courier New,monospace" fill="black">Engine Fan</text>
<text x="220.00000000000003" y="0" font-size="10" text-anchor="start" dominant-baseline="middle" transform="rotate(-42.287184)" font-family="Fira Code,Noto Sans,Courier New,monospace" fill="black">Heater Core</text>
<text x="220.00000000000003" y="0" font-size="10" text-anchor="start" dominant-baseline="middle" transform="rotate(-49.527591)" font-family="Fira Code,Noto Sans,Courier New,monospace" fill="black">Heater Hoses</text>
<text x="220.00000000000003" y="0" font-size="10" text-anchor="start" dominant-baseline="middle" transform="rotate(-64.228244)" font-family="Fira Code,Noto Sans,Courier New,monospace" fill="black">Condenser</text>
<text x="-220.00000000000003" y="0" font-size="10" text-anchor="end" dominant-baseline="middle" transform="rotate(80.046776)" font-family="Fira Code,Noto Sans,Courier New,monospace" fill="black">Compressor</text>
<text x="-220.00000000000003" y="0" font-size="10" text-anchor="end" dominant-baseline="middle" transform="rotate(41.608979)" font-family="Fira Code,Noto Sans,Courier New,monospace" fill="black">Evaporator Case</text>
<text x="-220.00000000000003" y="0" font-size="10" text-anchor="end" dominant-baseline="middle" transform="rotate(7.918612)" font-family="Fira Code,Noto Sans,Courier New,monospace" fill="black">Evaporator Core</text>
<text x="-220.00000000000003" y="0" font-size="10" text-anchor="end" dominant-baseline="middle" transform="rotate(-18.311511)" font-family="Fira Code,Noto Sans,Courier New,monospace" fill="black">Accumulator</text>
<text x="-220.00000000000003" y="0" font-size="10" text-anchor="end" dominant-baseline="middle" transform="rotate(-35.724980)" font-family="Fira Code,Noto Sans,Courier New,monospace" fill="black">Refrigeration Controls</text>
<text x="-220.00000000000003" y="0" font-size="10" text-anchor="end" dominant-baseline="middle" transform="rotate(-59.242286)" font-family="Fira Code,Noto Sans,Courier New,monospace" fill="black">Air Controls</text>
<text x="-220.00000000000003" y="0" font-size="10" text-anchor="end" dominant-baseline="middle" transform="rotate(-78.690368)" font-family="Fira Code,Noto Sans,Courier New,monospace" fill="black">Sensors</text>
<text x="220.00000000000003" y="0" font-size="10" text-anchor="start" dominant-baseline="middle" transform="rotate(-274.069225)" font-family="Fira Code,Noto Sans,Courier New,monospace" fill="black">Command Distribution</text>
<text x="220.00000000000003" y="0" font-size="10" text-anchor="start" dominant-baseline="middle" transform="rotate(-292.160898)" font-family="Fira Code,Noto Sans,Courier New,monospace" fill="black">Actuators</text>
<text x="220.00000000000003" y="0" font-size="10" text-anchor="start" dominant-baseline="middle" transform="rotate(-311.608979)" font-family="Fira Code,Noto Sans,Courier New,monospace" fill="black">Blower Controller</text>
<text x="220.00000000000003" y="0" font-size="10" text-anchor="start" dominant-baseline="middle" transform="rotate(-341.908327)" font-family="Fira Code,Noto Sans,Courier New,monospace" fill="black">Blower Motor</text>
</svg>