name;kind
prod01;product
prod02;product
prod03;product
prod04;product
prod05;product
prod06;product
prod07;product
prod08;product
prod09;product
prod10;product
prod11;product
prod12;product
attr01;attribute
attr02;attribute
attr03;attribute
attr04;attribute
attr05;attribute
attr06;attribute
attr07;attribute
attr08;attribute
attr09;attribute
attr10;attribute
