{
    "annotations": {},
    "edges": {
        "00000000-0000-0000-0000-000000000008": {
            "annotations": {},
            "kind": "edge",
            "labels": [
                "default"
            ],
            "name": "ab",
            "source": "00000000-0000-0000-0000-000000000002",
            "target": "00000000-0000-0000-0000-000000000003",
            "uuid": "00000000-0000-0000-0000-000000000008",
            "weights": {
                "default": 1
            }
        },
        "00000000-0000-0000-0000-000000000009": {
            "annotations": {},
            "kind": "edge",
            "labels": [
                "default"
            ],
            "name": "ac",
            "source": "00000000-0000-0000-0000-000000000002",
            "target": "00000000-0000-0000-0000-000000000004",
            "uuid": "00000000-0000-0000-0000-000000000009",
            "weights": {
                "default": 1
            }
        },
        "00000000-0000-0000-0000-00000000000a": {
            "annotations": {},
            "kind": "edge",
            "labels": [
                "default"
            ],
            "name": "ae",
            "source": "00000000-0000-0000-0000-000000000002",
            "target": "00000000-0000-0000-0000-000000000006",
            "uuid": "00000000-0000-0000-0000-00000000000a",
            "weights": {
                "default": 1
            }
        },
        "00000000-0000-0000-0000-00000000000b": {
            "annotations": {},
            "kind": "edge",
            "labels": [
                "default"
            ],
            "name": "ba",
            "source": "00000000-0000-0000-0000-000000000003",
            "target": "00000000-0000-0000-0000-000000000002",
            "uuid": "00000000-0000-0000-0000-00000000000b",
            "weights": {
                "default": 1
            }
        },
        "00000000-0000-0000-0000-00000000000c": {
            "annotations": {},
            "kind": "edge",
            "labels": [
                "default"
            ],
            "name": "be",
            "source": "00000000-0000-0000-0000-000000000003",
            "target": "00000000-0000-0000-0000-000000000006",
            "uuid": "00000000-0000-0000-0000-00000000000c",
            "weights": {
                "default": 1
            }
        },
        "00000000-0000-0000-0000-00000000000d": {
            "annotations": {},
            "kind": "edge",
            "labels": [
                "default"
            ],
            "name": "ca",
            "source": "00000000-0000-0000-0000-000000000004",
            "target": "00000000-0000-0000-0000-000000000002",
            "uuid": "00000000-0000-0000-0000-00000000000d",
            "weights": {
                "default": 1
            }
        },
        "00000000-0000-0000-0000-00000000000e": {
            "annotations": {},
            "kind": "edge",
            "labels": [
                "default"
            ],
            "name": "ce",
            "source": "00000000-0000-0000-0000-000000000004",
            "target": "00000000-0000-0000-0000-000000000006",
            "uuid": "00000000-0000-0000-0000-00000000000e",
            "weights": {
                "default": 1
            }
        },
        "00000000-0000-0000-0000-00000000000f": {
            "annotations": {},
            "kind": "edge",
            "labels": [
                "default"
            ],
            "name": "de",
            "source": "00000000-0000-0000-0000-000000000005",
            "target": "00000000-0000-0000-0000-000000000006",
            "uuid": "00000000-0000-0000-0000-00000000000f",
            "weights": {
                "default": 1
            }
        },
        "00000000-0000-0000-0000-000000000010": {
            "annotations": {},
            "kind": "edge",
            "labels": [
                "default"
            ],
            "name": "ea",
            "source": "00000000-0000-0000-0000-000000000006",
            "target": "00000000-0000-0000-0000-000000000002",
            "uuid": "00000000-0000-0000-0000-000000000010",
            "weights": {
                "default": 1
            }
        },
        "00000000-0000-0000-0000-000000000011": {
            "annotations": {},
            "kind": "edge",
            "labels": [
                "default"
            ],
            "name": "eb",
            "source": "00000000-0000-0000-0000-000000000006",
            "target": "00000000-0000-0000-0000-000000000003",
            "uuid": "00000000-0000-0000-0000-000000000011",
            "weights": {
                "default": 1
            }
        },
        "00000000-0000-0000-0000-000000000012": {
            "annotations": {},
            "kind": "edge",
            "labels": [
                "default"
            ],
            "name": "ec",
            "source": "00000000-0000-0000-0000-000000000006",
            "target": "00000000-0000-0000-0000-000000000004",
            "uuid": "00000000-0000-0000-0000-000000000012",
            "weights": {
                "default": 1
            }
        },
        "00000000-0000-0000-0000-000000000013": {
            "annotations": {},
            "kind": "edge",
            "labels": [
                "default"
            ],
            "name": "ed",
            "source": "00000000-0000-0000-0000-000000000006",
            "target": "00000000-0000-0000-0000-000000000005",
            "uuid": "00000000-0000-0000-0000-000000000013",
            "weights": {
                "default": 1
            }
        }
    },
    "kind": "default",
    "labels": [
        "default"
    ],
    "name": "simple",
    "nodes": {
        "00000000-0000-0000-0000-000000000002": {
            "annotations": {},
            "children": [],
            "is_bus": false,
            "kind": "node",
            "labels": [
                "default"
            ],
            "name": "a",
            "parent": null,
            "uuid": "00000000-0000-0000-0000-000000000002",
            "weights": {
                "default": 1
            }
        },
        "00000000-0000-0000-0000-000000000003": {
            "annotations": {},
            "children": [],
            "is_bus": false,
            "kind": "node",
            "labels": [
                "default"
            ],
            "name": "b",
            "parent": null,
            "uuid": "00000000-0000-0000-0000-000000000003",
            "weights": {
                "default": 1
            }
        },
        "00000000-0000-0000-0000-000000000004": {
            "annotations": {},
            "children": [],
            "is_bus": false,
            "kind": "node",
            "labels": [
                "default"
            ],
            "name": "c",
            "parent": null,
            "uuid": "00000000-0000-0000-0000-000000000004",
            "weights": {
                "default": 1
            }
        },
        "00000000-0000-0000-0000-000000000005": {
            "annotations": {},
            "children": [],
            "is_bus": false,
            "kind": "node",
            "labels": [
                "default"
            ],
            "name": "d",
            "parent": null,
            "uuid": "00000000-0000-0000-0000-000000000005",
            "weights": {
                "default": 1
            }
        },
        "00000000-0000-0000-0000-000000000006": {
            "annotations": {},
            "children": [],
            "is_bus": false,
            "kind": "node",
            "labels": [
                "default"
            ],
            "name": "e",
            "parent": null,
            "uuid": "00000000-0000-0000-0000-000000000006",
            "weights": {
                "default": 1
            }
        },
        "00000000-0000-0000-0000-000000000007": {
            "annotations": {},
            "children": [],
            "is_bus": false,
            "kind": "node",
            "labels": [
                "default"
            ],
            "name": "f",
            "parent": null,
            "uuid": "00000000-0000-0000-0000-000000000007",
            "weights": {
                "default": 1
            }
        }
    },
    "uuid": "00000000-0000-0000-0000-000000000001",
    "weights": {
        "default": 1
    }
}