name;kind
a;object
b;object
c;object
d;object
e;object
f;object
g;object
h;object
i;object
j;object
k;object
l;object
m;object
n;object
o;object
p;object
q;object
r;object
c.1.1;aspect_1
c.1.2;aspect_1
c.1.3;aspect_1
c.1.4;aspect_1
c.2.1;aspect_2
c.2.2;aspect_2
c.2.3;aspect_2
c.2.4;aspect_2
c.3.1;aspect_3
c.3.2;aspect_3
c.3.3;aspect_3
c.3.4;aspect_3