id;Name;;id;Name;Interface type
f11;eps;has an interface with;f65;bi;
f10;lv;has an interface with;f65;bi;
f1;o;has an interface with;f65;bi;
f2;ob;has an interface with;f65;bi;
f12;h_lh;has an interface with;f41;bp_lh;
f26;h_uh;has an interface with;f49;bp_uh;
f47;j_uh;has an interface with;f49;bp_uh;
f39;j_lh;has an interface with;f41;bp_lh;
f42;pa_lh;has an interface with;f41;bp_lh;
f50;pa_uh;has an interface with;f49;bp_uh;
f40;sp_lh;has an interface with;f41;bp_lh;
f48;sp_uh;has an interface with;f49;bp_uh;
f44;wa_lh;has an interface with;f41;bp_lh;
f52;wa_uh;has an interface with;f49;bp_uh;
f66;ep;has an interface with;f36;c_uc;
f66;ep;has an interface with;f33;c_lc;
f35;f_lc;has an interface with;f33;c_lc;
f38;f_uc;has an interface with;f36;c_uc;
f12;h_lh;has an interface with;f33;c_lc;
f12;h_lh;has an interface with;f36;c_uc;
f19;h_mh;has an interface with;f33;c_lc;
f19;h_mh;has an interface with;f36;c_uc;
f26;h_uh;has an interface with;f33;c_lc;
f26;h_uh;has an interface with;f36;c_uc;
f64;lm;has an interface with;f33;c_lc;
f64;lm;has an interface with;f36;c_uc;
f34;spc_lc;has an interface with;f33;c_lc;
f37;spc_uc;has an interface with;f36;c_uc;
f45;ss_lh;has an interface with;f33;c_lc;
f53;ss_uh;has an interface with;f33;c_lc;
f45;ss_lh;has an interface with;f36;c_uc;
f53;ss_uh;has an interface with;f36;c_uc;
f6;cs;has an interface with;f56;ci;
f11;eps;has an interface with;f56;ci;
f10;lv;has an interface with;f56;ci;
f1;o;has an interface with;f56;ci;
f2;ob;has an interface with;f56;ci;
f55;ol;has an interface with;f56;ci;
f56;ci;has an interface with;f6;cs;
f11;eps;has an interface with;f6;cs;
f7;es;has an interface with;f6;cs;
f58;fd;has an interface with;f6;cs;
f14;ga_lh;has an interface with;f6;cs;
f21;ga_mh;has an interface with;f6;cs;
f28;ga_uh;has an interface with;f6;cs;
f17;i_lh;has an interface with;f6;cs;
f24;i_mh;has an interface with;f6;cs;
f31;i_uh;has an interface with;f6;cs;
f16;la_lh;has an interface with;f6;cs;
f23;la_mh;has an interface with;f6;cs;
f30;la_uh;has an interface with;f6;cs;
f61;lg;has an interface with;f6;cs;
f64;lm;has an interface with;f6;cs;
f10;lv;has an interface with;f6;cs;
f1;o;has an interface with;f6;cs;
f2;ob;has an interface with;f6;cs;
f55;ol;has an interface with;f6;cs;
f3;ose;has an interface with;f6;cs;
f4;osm;has an interface with;f6;cs;
f5;osr;has an interface with;f6;cs;
f67;ri;has an interface with;f6;cs;
f70;se;has an interface with;f6;cs;
f68;vs;has an interface with;f6;cs;
f63;wm;has an interface with;f6;cs;
f33;c_lc;has an interface with;f66;ep;
f36;c_uc;has an interface with;f66;ep;
f10;lv;has an interface with;f66;ep;
f1;o;has an interface with;f66;ep;
f2;ob;has an interface with;f66;ep;
f65;bi;has an interface with;f11;eps;
f56;ci;has an interface with;f11;eps;
f6;cs;has an interface with;f11;eps;
f7;es;has an interface with;f11;eps;
f58;fd;has an interface with;f11;eps;
f9;hv;has an interface with;f11;eps;
f59;ii;has an interface with;f11;eps;
f60;is;has an interface with;f11;eps;
f64;lm;has an interface with;f11;eps;
f10;lv;has an interface with;f11;eps;
f2;ob;has an interface with;f11;eps;
f3;ose;has an interface with;f11;eps;
f4;osm;has an interface with;f11;eps;
f5;osr;has an interface with;f11;eps;
f67;ri;has an interface with;f11;eps;
f45;ss_lh;has an interface with;f11;eps;
f53;ss_uh;has an interface with;f11;eps;
f69;t;has an interface with;f11;eps;
f8;uc;has an interface with;f11;eps;
f62;vi;has an interface with;f11;eps;
f68;vs;has an interface with;f11;eps;
f6;cs;has an interface with;f7;es;
f11;eps;has an interface with;f7;es;
f14;ga_lh;has an interface with;f7;es;
f21;ga_mh;has an interface with;f7;es;
f28;ga_uh;has an interface with;f7;es;
f12;h_lh;has an interface with;f7;es;
f19;h_mh;has an interface with;f7;es;
f26;h_uh;has an interface with;f7;es;
f16;la_lh;has an interface with;f7;es;
f23;la_mh;has an interface with;f7;es;
f30;la_uh;has an interface with;f7;es;
f64;lm;has an interface with;f7;es;
f10;lv;has an interface with;f7;es;
f1;o;has an interface with;f7;es;
f2;ob;has an interface with;f7;es;
f3;ose;has an interface with;f7;es;
f4;osm;has an interface with;f7;es;
f5;osr;has an interface with;f7;es;
f33;c_lc;has an interface with;f35;f_lc;
f36;c_uc;has an interface with;f38;f_uc;
f6;cs;has an interface with;f58;fd;
f11;eps;has an interface with;f58;fd;
f10;lv;has an interface with;f58;fd;
f1;o;has an interface with;f58;fd;
f2;ob;has an interface with;f58;fd;
f14;ga_lh;has an interface with;f13;g_lh;
f21;ga_mh;has an interface with;f20;g_mh;
f28;ga_uh;has an interface with;f27;g_uh;
f12;h_lh;has an interface with;f13;g_lh;
f19;h_mh;has an interface with;f20;g_mh;
f26;h_uh;has an interface with;f27;g_uh;
f17;i_lh;has an interface with;f13;g_lh;
f24;i_mh;has an interface with;f20;g_mh;
f31;i_uh;has an interface with;f27;g_uh;
f15;l_lh;has an interface with;f13;g_lh;
f22;l_mh;has an interface with;f20;g_mh;
f29;l_uh;has an interface with;f27;g_uh;
f16;la_lh;has an interface with;f13;g_lh;
f23;la_mh;has an interface with;f20;g_mh;
f30;la_uh;has an interface with;f27;g_uh;
f57;lp;has an interface with;f13;g_lh;
f57;lp;has an interface with;f20;g_mh;
f57;lp;has an interface with;f27;g_uh;
f55;ol;has an interface with;f13;g_lh;
f55;ol;has an interface with;f20;g_mh;
f55;ol;has an interface with;f27;g_uh;
f70;se;has an interface with;f13;g_lh;
f70;se;has an interface with;f20;g_mh;
f70;se;has an interface with;f27;g_uh;
f6;cs;has an interface with;f14;ga_lh;
f6;cs;has an interface with;f21;ga_mh;
f6;cs;has an interface with;f28;ga_uh;
f7;es;has an interface with;f14;ga_lh;
f7;es;has an interface with;f21;ga_mh;
f7;es;has an interface with;f28;ga_uh;
f13;g_lh;has an interface with;f14;ga_lh;
f20;g_mh;has an interface with;f21;ga_mh;
f27;g_uh;has an interface with;f28;ga_uh;
f12;h_lh;has an interface with;f14;ga_lh;
f19;h_mh;has an interface with;f21;ga_mh;
f26;h_uh;has an interface with;f28;ga_uh;
f9;hv;has an interface with;f14;ga_lh;
f9;hv;has an interface with;f21;ga_mh;
f9;hv;has an interface with;f28;ga_uh;
f17;i_lh;has an interface with;f14;ga_lh;
f24;i_mh;has an interface with;f21;ga_mh;
f31;i_uh;has an interface with;f28;ga_uh;
f15;l_lh;has an interface with;f14;ga_lh;
f22;l_mh;has an interface with;f21;ga_mh;
f29;l_uh;has an interface with;f28;ga_uh;
f1;o;has an interface with;f14;ga_lh;
f1;o;has an interface with;f21;ga_mh;
f1;o;has an interface with;f28;ga_uh;
f3;ose;has an interface with;f14;ga_lh;
f3;ose;has an interface with;f21;ga_mh;
f3;ose;has an interface with;f28;ga_uh;
f4;osm;has an interface with;f14;ga_lh;
f4;osm;has an interface with;f21;ga_mh;
f4;osm;has an interface with;f28;ga_uh;
f5;osr;has an interface with;f14;ga_lh;
f5;osr;has an interface with;f21;ga_mh;
f5;osr;has an interface with;f28;ga_uh;
f41;bp_lh;has an interface with;f12;h_lh;
f49;bp_uh;has an interface with;f26;h_uh;
f33;c_lc;has an interface with;f12;h_lh;
f33;c_lc;has an interface with;f19;h_mh;
f33;c_lc;has an interface with;f26;h_uh;
f36;c_uc;has an interface with;f12;h_lh;
f36;c_uc;has an interface with;f19;h_mh;
f36;c_uc;has an interface with;f26;h_uh;
f7;es;has an interface with;f12;h_lh;
f7;es;has an interface with;f19;h_mh;
f7;es;has an interface with;f26;h_uh;
f13;g_lh;has an interface with;f12;h_lh;
f20;g_mh;has an interface with;f19;h_mh;
f27;g_uh;has an interface with;f26;h_uh;
f14;ga_lh;has an interface with;f12;h_lh;
f21;ga_mh;has an interface with;f19;h_mh;
f28;ga_uh;has an interface with;f26;h_uh;
f17;i_lh;has an interface with;f12;h_lh;
f24;i_mh;has an interface with;f19;h_mh;
f31;i_uh;has an interface with;f26;h_uh;
f59;ii;has an interface with;f12;h_lh;
f59;ii;has an interface with;f19;h_mh;
f59;ii;has an interface with;f26;h_uh;
f39;j_lh;has an interface with;f12;h_lh;
f47;j_uh;has an interface with;f26;h_uh;
f15;l_lh;has an interface with;f12;h_lh;
f22;l_mh;has an interface with;f19;h_mh;
f29;l_uh;has an interface with;f26;h_uh;
f16;la_lh;has an interface with;f12;h_lh;
f23;la_mh;has an interface with;f19;h_mh;
f30;la_uh;has an interface with;f26;h_uh;
f64;lm;has an interface with;f12;h_lh;
f64;lm;has an interface with;f19;h_mh;
f64;lm;has an interface with;f26;h_uh;
f57;lp;has an interface with;f12;h_lh;
f57;lp;has an interface with;f19;h_mh;
f57;lp;has an interface with;f26;h_uh;
f10;lv;has an interface with;f12;h_lh;
f10;lv;has an interface with;f19;h_mh;
f10;lv;has an interface with;f26;h_uh;
f55;ol;has an interface with;f12;h_lh;
f55;ol;has an interface with;f19;h_mh;
f55;ol;has an interface with;f26;h_uh;
f3;ose;has an interface with;f12;h_lh;
f3;ose;has an interface with;f19;h_mh;
f3;ose;has an interface with;f26;h_uh;
f4;osm;has an interface with;f12;h_lh;
f4;osm;has an interface with;f19;h_mh;
f4;osm;has an interface with;f26;h_uh;
f5;osr;has an interface with;f12;h_lh;
f5;osr;has an interface with;f19;h_mh;
f5;osr;has an interface with;f26;h_uh;
f46;sc_lh;has an interface with;f12;h_lh;
f54;sc_uh;has an interface with;f26;h_uh;
f40;sp_lh;has an interface with;f12;h_lh;
f48;sp_uh;has an interface with;f26;h_uh;
f34;spc_lc;has an interface with;f12;h_lh;
f34;spc_lc;has an interface with;f19;h_mh;
f34;spc_lc;has an interface with;f26;h_uh;
f37;spc_uc;has an interface with;f12;h_lh;
f37;spc_uc;has an interface with;f19;h_mh;
f37;spc_uc;has an interface with;f26;h_uh;
f45;ss_lh;has an interface with;f12;h_lh;
f53;ss_uh;has an interface with;f26;h_uh;
f68;vs;has an interface with;f12;h_lh;
f68;vs;has an interface with;f19;h_mh;
f68;vs;has an interface with;f26;h_uh;
f11;eps;has an interface with;f9;hv;
f14;ga_lh;has an interface with;f9;hv;
f21;ga_mh;has an interface with;f9;hv;
f28;ga_uh;has an interface with;f9;hv;
f16;la_lh;has an interface with;f9;hv;
f23;la_mh;has an interface with;f9;hv;
f30;la_uh;has an interface with;f9;hv;
f10;lv;has an interface with;f9;hv;
f2;ob;has an interface with;f9;hv;
f8;uc;has an interface with;f9;hv;
f6;cs;has an interface with;f17;i_lh;
f6;cs;has an interface with;f24;i_mh;
f6;cs;has an interface with;f31;i_uh;
f13;g_lh;has an interface with;f17;i_lh;
f20;g_mh;has an interface with;f24;i_mh;
f27;g_uh;has an interface with;f31;i_uh;
f14;ga_lh;has an interface with;f17;i_lh;
f21;ga_mh;has an interface with;f24;i_mh;
f28;ga_uh;has an interface with;f31;i_uh;
f12;h_lh;has an interface with;f17;i_lh;
f19;h_mh;has an interface with;f24;i_mh;
f26;h_uh;has an interface with;f31;i_uh;
f15;l_lh;has an interface with;f17;i_lh;
f22;l_mh;has an interface with;f24;i_mh;
f29;l_uh;has an interface with;f31;i_uh;
f16;la_lh;has an interface with;f17;i_lh;
f23;la_mh;has an interface with;f24;i_mh;
f30;la_uh;has an interface with;f31;i_uh;
f2;ob;has an interface with;f17;i_lh;
f2;ob;has an interface with;f24;i_mh;
f2;ob;has an interface with;f31;i_uh;
f11;eps;has an interface with;f59;ii;
f12;h_lh;has an interface with;f59;ii;
f19;h_mh;has an interface with;f59;ii;
f26;h_uh;has an interface with;f59;ii;
f10;lv;has an interface with;f59;ii;
f1;o;has an interface with;f59;ii;
f2;ob;has an interface with;f59;ii;
f11;eps;has an interface with;f60;is;
f10;lv;has an interface with;f60;is;
f1;o;has an interface with;f60;is;
f2;ob;has an interface with;f60;is;
f41;bp_lh;has an interface with;f39;j_lh;
f49;bp_uh;has an interface with;f47;j_uh;
f12;h_lh;has an interface with;f39;j_lh;
f26;h_uh;has an interface with;f47;j_uh;
f55;ol;has an interface with;f39;j_lh;
f55;ol;has an interface with;f47;j_uh;
f42;pa_lh;has an interface with;f39;j_lh;
f50;pa_uh;has an interface with;f47;j_uh;
f40;sp_lh;has an interface with;f39;j_lh;
f48;sp_uh;has an interface with;f47;j_uh;
f45;ss_lh;has an interface with;f39;j_lh;
f53;ss_uh;has an interface with;f47;j_uh;
f13;g_lh;has an interface with;f15;l_lh;
f20;g_mh;has an interface with;f22;l_mh;
f27;g_uh;has an interface with;f29;l_uh;
f14;ga_lh;has an interface with;f15;l_lh;
f21;ga_mh;has an interface with;f22;l_mh;
f28;ga_uh;has an interface with;f29;l_uh;
f12;h_lh;has an interface with;f15;l_lh;
f19;h_mh;has an interface with;f22;l_mh;
f26;h_uh;has an interface with;f29;l_uh;
f17;i_lh;has an interface with;f15;l_lh;
f24;i_mh;has an interface with;f22;l_mh;
f31;i_uh;has an interface with;f29;l_uh;
f16;la_lh;has an interface with;f15;l_lh;
f23;la_mh;has an interface with;f22;l_mh;
f30;la_uh;has an interface with;f29;l_uh;
f6;cs;has an interface with;f16;la_lh;
f6;cs;has an interface with;f23;la_mh;
f6;cs;has an interface with;f30;la_uh;
f7;es;has an interface with;f16;la_lh;
f7;es;has an interface with;f23;la_mh;
f7;es;has an interface with;f30;la_uh;
f13;g_lh;has an interface with;f16;la_lh;
f20;g_mh;has an interface with;f23;la_mh;
f27;g_uh;has an interface with;f30;la_uh;
f12;h_lh;has an interface with;f16;la_lh;
f19;h_mh;has an interface with;f23;la_mh;
f26;h_uh;has an interface with;f30;la_uh;
f9;hv;has an interface with;f16;la_lh;
f9;hv;has an interface with;f23;la_mh;
f9;hv;has an interface with;f30;la_uh;
f17;i_lh;has an interface with;f16;la_lh;
f24;i_mh;has an interface with;f23;la_mh;
f31;i_uh;has an interface with;f30;la_uh;
f15;l_lh;has an interface with;f16;la_lh;
f22;l_mh;has an interface with;f23;la_mh;
f29;l_uh;has an interface with;f30;la_uh;
f1;o;has an interface with;f16;la_lh;
f1;o;has an interface with;f23;la_mh;
f1;o;has an interface with;f30;la_uh;
f3;ose;has an interface with;f16;la_lh;
f3;ose;has an interface with;f23;la_mh;
f3;ose;has an interface with;f30;la_uh;
f4;osm;has an interface with;f16;la_lh;
f4;osm;has an interface with;f23;la_mh;
f4;osm;has an interface with;f30;la_uh;
f5;osr;has an interface with;f16;la_lh;
f5;osr;has an interface with;f23;la_mh;
f5;osr;has an interface with;f30;la_uh;
f6;cs;has an interface with;f61;lg;
f10;lv;has an interface with;f61;lg;
f1;o;has an interface with;f61;lg;
f2;ob;has an interface with;f61;lg;
f33;c_lc;has an interface with;f64;lm;
f36;c_uc;has an interface with;f64;lm;
f6;cs;has an interface with;f64;lm;
f11;eps;has an interface with;f64;lm;
f7;es;has an interface with;f64;lm;
f12;h_lh;has an interface with;f64;lm;
f19;h_mh;has an interface with;f64;lm;
f26;h_uh;has an interface with;f64;lm;
f10;lv;has an interface with;f64;lm;
f1;o;has an interface with;f64;lm;
f2;ob;has an interface with;f64;lm;
f3;ose;has an interface with;f64;lm;
f4;osm;has an interface with;f64;lm;
f5;osr;has an interface with;f64;lm;
f13;g_lh;has an interface with;f57;lp;
f20;g_mh;has an interface with;f57;lp;
f27;g_uh;has an interface with;f57;lp;
f12;h_lh;has an interface with;f57;lp;
f19;h_mh;has an interface with;f57;lp;
f26;h_uh;has an interface with;f57;lp;
f2;ob;has an interface with;f57;lp;
f65;bi;has an interface with;f10;lv;
f56;ci;has an interface with;f10;lv;
f6;cs;has an interface with;f10;lv;
f66;ep;has an interface with;f10;lv;
f11;eps;has an interface with;f10;lv;
f7;es;has an interface with;f10;lv;
f58;fd;has an interface with;f10;lv;
f12;h_lh;has an interface with;f10;lv;
f19;h_mh;has an interface with;f10;lv;
f26;h_uh;has an interface with;f10;lv;
f9;hv;has an interface with;f10;lv;
f59;ii;has an interface with;f10;lv;
f60;is;has an interface with;f10;lv;
f61;lg;has an interface with;f10;lv;
f64;lm;has an interface with;f10;lv;
f2;ob;has an interface with;f10;lv;
f55;ol;has an interface with;f10;lv;
f3;ose;has an interface with;f10;lv;
f4;osm;has an interface with;f10;lv;
f5;osr;has an interface with;f10;lv;
f67;ri;has an interface with;f10;lv;
f70;se;has an interface with;f10;lv;
f45;ss_lh;has an interface with;f10;lv;
f53;ss_uh;has an interface with;f10;lv;
f69;t;has an interface with;f10;lv;
f8;uc;has an interface with;f10;lv;
f62;vi;has an interface with;f10;lv;
f68;vs;has an interface with;f10;lv;
f63;wm;has an interface with;f10;lv;
f65;bi;has an interface with;f1;o;
f56;ci;has an interface with;f1;o;
f6;cs;has an interface with;f1;o;
f66;ep;has an interface with;f1;o;
f7;es;has an interface with;f1;o;
f58;fd;has an interface with;f1;o;
f14;ga_lh;has an interface with;f1;o;
f21;ga_mh;has an interface with;f1;o;
f28;ga_uh;has an interface with;f1;o;
f59;ii;has an interface with;f1;o;
f60;is;has an interface with;f1;o;
f16;la_lh;has an interface with;f1;o;
f23;la_mh;has an interface with;f1;o;
f30;la_uh;has an interface with;f1;o;
f61;lg;has an interface with;f1;o;
f64;lm;has an interface with;f1;o;
f2;ob;has an interface with;f1;o;
f3;ose;has an interface with;f1;o;
f4;osm;has an interface with;f1;o;
f5;osr;has an interface with;f1;o;
f67;ri;has an interface with;f1;o;
f69;t;has an interface with;f1;o;
f62;vi;has an interface with;f1;o;
f63;wm;has an interface with;f1;o;
f65;bi;has an interface with;f2;ob;
f56;ci;has an interface with;f2;ob;
f6;cs;has an interface with;f2;ob;
f66;ep;has an interface with;f2;ob;
f11;eps;has an interface with;f2;ob;
f7;es;has an interface with;f2;ob;
f58;fd;has an interface with;f2;ob;
f9;hv;has an interface with;f2;ob;
f17;i_lh;has an interface with;f2;ob;
f24;i_mh;has an interface with;f2;ob;
f31;i_uh;has an interface with;f2;ob;
f59;ii;has an interface with;f2;ob;
f60;is;has an interface with;f2;ob;
f61;lg;has an interface with;f2;ob;
f64;lm;has an interface with;f2;ob;
f57;lp;has an interface with;f2;ob;
f10;lv;has an interface with;f2;ob;
f1;o;has an interface with;f2;ob;
f55;ol;has an interface with;f2;ob;
f3;ose;has an interface with;f2;ob;
f4;osm;has an interface with;f2;ob;
f5;osr;has an interface with;f2;ob;
f67;ri;has an interface with;f2;ob;
f69;t;has an interface with;f2;ob;
f8;uc;has an interface with;f2;ob;
f62;vi;has an interface with;f2;ob;
f63;wm;has an interface with;f2;ob;
f56;ci;has an interface with;f55;ol;
f6;cs;has an interface with;f55;ol;
f13;g_lh;has an interface with;f55;ol;
f20;g_mh;has an interface with;f55;ol;
f27;g_uh;has an interface with;f55;ol;
f12;h_lh;has an interface with;f55;ol;
f19;h_mh;has an interface with;f55;ol;
f26;h_uh;has an interface with;f55;ol;
f39;j_lh;has an interface with;f55;ol;
f47;j_uh;has an interface with;f55;ol;
f10;lv;has an interface with;f55;ol;
f2;ob;has an interface with;f55;ol;
f42;pa_lh;has an interface with;f55;ol;
f50;pa_uh;has an interface with;f55;ol;
f44;wa_lh;has an interface with;f55;ol;
f52;wa_uh;has an interface with;f55;ol;
f6;cs;has an interface with;f3;ose;
f11;eps;has an interface with;f3;ose;
f7;es;has an interface with;f3;ose;
f14;ga_lh;has an interface with;f3;ose;
f21;ga_mh;has an interface with;f3;ose;
f28;ga_uh;has an interface with;f3;ose;
f12;h_lh;has an interface with;f3;ose;
f19;h_mh;has an interface with;f3;ose;
f26;h_uh;has an interface with;f3;ose;
f16;la_lh;has an interface with;f3;ose;
f23;la_mh;has an interface with;f3;ose;
f30;la_uh;has an interface with;f3;ose;
f64;lm;has an interface with;f3;ose;
f10;lv;has an interface with;f3;ose;
f1;o;has an interface with;f3;ose;
f2;ob;has an interface with;f3;ose;
f6;cs;has an interface with;f4;osm;
f11;eps;has an interface with;f4;osm;
f7;es;has an interface with;f4;osm;
f14;ga_lh;has an interface with;f4;osm;
f21;ga_mh;has an interface with;f4;osm;
f28;ga_uh;has an interface with;f4;osm;
f12;h_lh;has an interface with;f4;osm;
f19;h_mh;has an interface with;f4;osm;
f26;h_uh;has an interface with;f4;osm;
f16;la_lh;has an interface with;f4;osm;
f23;la_mh;has an interface with;f4;osm;
f30;la_uh;has an interface with;f4;osm;
f64;lm;has an interface with;f4;osm;
f10;lv;has an interface with;f4;osm;
f1;o;has an interface with;f4;osm;
f2;ob;has an interface with;f4;osm;
f5;osr;has an interface with;f4;osm;
f6;cs;has an interface with;f5;osr;
f11;eps;has an interface with;f5;osr;
f7;es;has an interface with;f5;osr;
f14;ga_lh;has an interface with;f5;osr;
f21;ga_mh;has an interface with;f5;osr;
f28;ga_uh;has an interface with;f5;osr;
f12;h_lh;has an interface with;f5;osr;
f19;h_mh;has an interface with;f5;osr;
f26;h_uh;has an interface with;f5;osr;
f16;la_lh;has an interface with;f5;osr;
f23;la_mh;has an interface with;f5;osr;
f30;la_uh;has an interface with;f5;osr;
f64;lm;has an interface with;f5;osr;
f10;lv;has an interface with;f5;osr;
f1;o;has an interface with;f5;osr;
f2;ob;has an interface with;f5;osr;
f4;osm;has an interface with;f5;osr;
f41;bp_lh;has an interface with;f42;pa_lh;
f49;bp_uh;has an interface with;f50;pa_uh;
f39;j_lh;has an interface with;f42;pa_lh;
f47;j_uh;has an interface with;f50;pa_uh;
f55;ol;has an interface with;f42;pa_lh;
f55;ol;has an interface with;f50;pa_uh;
f40;sp_lh;has an interface with;f42;pa_lh;
f48;sp_uh;has an interface with;f50;pa_uh;
f45;ss_lh;has an interface with;f42;pa_lh;
f53;ss_uh;has an interface with;f50;pa_uh;
f44;wa_lh;has an interface with;f42;pa_lh;
f52;wa_uh;has an interface with;f50;pa_uh;
f6;cs;has an interface with;f67;ri;
f11;eps;has an interface with;f67;ri;
f10;lv;has an interface with;f67;ri;
f1;o;has an interface with;f67;ri;
f2;ob;has an interface with;f67;ri;
f45;ss_lh;has an interface with;f43;rz_lh;
f53;ss_uh;has an interface with;f51;rz_uh;
f44;wa_lh;has an interface with;f43;rz_lh;
f52;wa_uh;has an interface with;f51;rz_uh;
f12;h_lh;has an interface with;f46;sc_lh;
f26;h_uh;has an interface with;f54;sc_uh;
f40;sp_lh;has an interface with;f46;sc_lh;
f48;sp_uh;has an interface with;f54;sc_uh;
f6;cs;has an interface with;f70;se;
f13;g_lh;has an interface with;f70;se;
f20;g_mh;has an interface with;f70;se;
f27;g_uh;has an interface with;f70;se;
f10;lv;has an interface with;f70;se;
f41;bp_lh;has an interface with;f40;sp_lh;
f49;bp_uh;has an interface with;f48;sp_uh;
f12;h_lh;has an interface with;f40;sp_lh;
f26;h_uh;has an interface with;f48;sp_uh;
f39;j_lh;has an interface with;f40;sp_lh;
f47;j_uh;has an interface with;f48;sp_uh;
f42;pa_lh;has an interface with;f40;sp_lh;
f50;pa_uh;has an interface with;f48;sp_uh;
f46;sc_lh;has an interface with;f40;sp_lh;
f54;sc_uh;has an interface with;f48;sp_uh;
f44;wa_lh;has an interface with;f40;sp_lh;
f52;wa_uh;has an interface with;f48;sp_uh;
f33;c_lc;has an interface with;f34;spc_lc;
f36;c_uc;has an interface with;f37;spc_uc;
f12;h_lh;has an interface with;f34;spc_lc;
f12;h_lh;has an interface with;f37;spc_uc;
f19;h_mh;has an interface with;f34;spc_lc;
f19;h_mh;has an interface with;f37;spc_uc;
f26;h_uh;has an interface with;f34;spc_lc;
f26;h_uh;has an interface with;f37;spc_uc;
f33;c_lc;has an interface with;f45;ss_lh;
f33;c_lc;has an interface with;f53;ss_uh;
f36;c_uc;has an interface with;f45;ss_lh;
f36;c_uc;has an interface with;f53;ss_uh;
f11;eps;has an interface with;f45;ss_lh;
f11;eps;has an interface with;f53;ss_uh;
f12;h_lh;has an interface with;f45;ss_lh;
f26;h_uh;has an interface with;f53;ss_uh;
f10;lv;has an interface with;f45;ss_lh;
f10;lv;has an interface with;f53;ss_uh;
f42;pa_lh;has an interface with;f45;ss_lh;
f50;pa_uh;has an interface with;f53;ss_uh;
f43;rz_lh;has an interface with;f45;ss_lh;
f51;rz_uh;has an interface with;f53;ss_uh;
f44;wa_lh;has an interface with;f45;ss_lh;
f52;wa_uh;has an interface with;f53;ss_uh;
f11;eps;has an interface with;f69;t;
f10;lv;has an interface with;f69;t;
f1;o;has an interface with;f69;t;
f2;ob;has an interface with;f69;t;
f11;eps;has an interface with;f8;uc;
f9;hv;has an interface with;f8;uc;
f10;lv;has an interface with;f8;uc;
f2;ob;has an interface with;f8;uc;
f11;eps;has an interface with;f62;vi;
f10;lv;has an interface with;f62;vi;
f1;o;has an interface with;f62;vi;
f2;ob;has an interface with;f62;vi;
f6;cs;has an interface with;f68;vs;
f11;eps;has an interface with;f68;vs;
f12;h_lh;has an interface with;f68;vs;
f26;h_uh;has an interface with;f68;vs;
f19;h_mh;has an interface with;f68;vs;
f10;lv;has an interface with;f68;vs;
f41;bp_lh;has an interface with;f44;wa_lh;
f49;bp_uh;has an interface with;f52;wa_uh;
f55;ol;has an interface with;f44;wa_lh;
f55;ol;has an interface with;f52;wa_uh;
f42;pa_lh;has an interface with;f44;wa_lh;
f50;pa_uh;has an interface with;f52;wa_uh;
f43;rz_lh;has an interface with;f44;wa_lh;
f51;rz_uh;has an interface with;f52;wa_uh;
f40;sp_lh;has an interface with;f44;wa_lh;
f48;sp_uh;has an interface with;f52;wa_uh;
f45;ss_lh;has an interface with;f44;wa_lh;
f53;ss_uh;has an interface with;f52;wa_uh;
f6;cs;has an interface with;f63;wm;
f10;lv;has an interface with;f63;wm;
f1;o;has an interface with;f63;wm;
f2;ob;has an interface with;f63;wm;
f18;sf_lh;has an interface with;f12;h_lh;
f25;sf_mh;has an interface with;f19;h_mh;
f32;sf_uh;has an interface with;f26;h_uh;
f18;sf_lh;has an interface with;f17;i_lh;
f25;sf_mh;has an interface with;f24;i_mh;
f32;sf_uh;has an interface with;f31;i_uh;
f18;sf_lh;has an interface with;f15;l_lh;
f25;sf_mh;has an interface with;f22;l_mh;
f32;sf_uh;has an interface with;f29;l_uh;
f18;sf_lh;has an interface with;f13;g_lh;
f25;sf_mh;has an interface with;f20;g_mh;
f32;sf_uh;has an interface with;f27;g_uh;
f18;sf_lh;has an interface with;f10;lv;
f25;sf_mh;has an interface with;f10;lv;
f32;sf_uh;has an interface with;f10;lv;
f18;sf_lh;has an interface with;f6;cs;
f25;sf_mh;has an interface with;f6;cs;
f32;sf_uh;has an interface with;f6;cs;
f12;h_lh;has an interface with;f18;sf_lh;
f19;h_mh;has an interface with;f25;sf_mh;
f26;h_uh;has an interface with;f32;sf_uh;
f17;i_lh;has an interface with;f18;sf_lh;
f24;i_mh;has an interface with;f25;sf_mh;
f31;i_uh;has an interface with;f32;sf_uh;
f15;l_lh;has an interface with;f18;sf_lh;
f22;l_mh;has an interface with;f25;sf_mh;
f29;l_uh;has an interface with;f32;sf_uh;
f13;g_lh;has an interface with;f18;sf_lh;
f20;g_mh;has an interface with;f25;sf_mh;
f27;g_uh;has an interface with;f32;sf_uh;
f10;lv;has an interface with;f18;sf_lh;
f10;lv;has an interface with;f25;sf_mh;
f10;lv;has an interface with;f32;sf_uh;
f6;cs;has an interface with;f18;sf_lh;
f6;cs;has an interface with;f25;sf_mh;
f6;cs;has an interface with;f32;sf_uh;
f39;j_lh;has an interface with;f45;ss_lh;
f47;j_uh;has an interface with;f53;ss_uh;
