{
    "edges": {
        "0": {
            "annotations": {
                "esl_info": {
                    "reason": {
                        "function_specifications": [
                            "world.provide-real"
                        ]
                    }
                }
            },
            "kind": "functional_dependency",
            "labels": [
                "real"
            ],
            "source": "world.foo",
            "target": "world.faa",
            "weights": {
                "default": 1
            }
        },
        "1": {
            "annotations": {
                "esl_info": {
                    "reason": {
                        "function_specifications": [
                            "world.provide-real"
                        ]
                    }
                }
            },
            "kind": "functional_dependency",
            "labels": [
                "real"
            ],
            "source": "world.faa",
            "target": "world.foo",
            "weights": {
                "default": 1
            }
        },
        "2": {
            "annotations": {},
            "kind": "mapping_dependency",
            "labels": [
                "real"
            ],
            "source": "world.foo",
            "target": "world.provide-real",
            "weights": {
                "default": 1
            }
        },
        "3": {
            "annotations": {},
            "kind": "mapping_dependency",
            "labels": [
                "real"
            ],
            "source": "world.faa",
            "target": "world.provide-real",
            "weights": {
                "default": 1
            }
        },
        "4": {
            "annotations": {
                "esl_info": {
                    "reason": {
                        "function_specifications": [
                            "world.provide-real"
                        ]
                    }
                }
            },
            "kind": "mapping_dependency",
            "labels": [
                "real"
            ],
            "source": "world.foo",
            "target": "world.b.r",
            "weights": {
                "default": 1
            }
        },
        "5": {
            "annotations": {
                "esl_info": {
                    "reason": {
                        "function_specifications": [
                            "world.provide-real"
                        ]
                    }
                }
            },
            "kind": "mapping_dependency",
            "labels": [
                "real"
            ],
            "source": "world.faa",
            "target": "world.b.r",
            "weights": {
                "default": 1
            }
        },
        "6": {
            "annotations": {},
            "kind": "mapping_dependency",
            "labels": [
                "real"
            ],
            "source": "world.provide-real",
            "target": "world.b.r",
            "weights": {
                "default": 1
            }
        },
        "7": {
            "annotations": {},
            "kind": "mapping_dependency",
            "labels": [
                "mapping"
            ],
            "source": "world.b.r",
            "target": "world.c1",
            "weights": {
                "default": 1
            }
        },
        "8": {
            "annotations": {},
            "kind": "mapping_dependency",
            "labels": [
                "mapping"
            ],
            "source": "world.b.s",
            "target": "world.c2",
            "weights": {
                "default": 1
            }
        }
    },
    "nodes": {
        "boolean": {
            "annotations": {
                "esl_info": {
                    "domain": null,
                    "units": []
                }
            },
            "children": [],
            "is_bus": false,
            "kind": "variable_type",
            "labels": [
                "default"
            ],
            "name": "boolean",
            "parent": null,
            "weights": {
                "default": 1
            }
        },
        "integer": {
            "annotations": {
                "esl_info": {
                    "domain": null,
                    "units": []
                }
            },
            "children": [],
            "is_bus": false,
            "kind": "variable_type",
            "labels": [
                "default"
            ],
            "name": "integer",
            "parent": null,
            "weights": {
                "default": 1
            }
        },
        "real": {
            "annotations": {
                "esl_info": {
                    "domain": null,
                    "units": []
                }
            },
            "children": [],
            "is_bus": false,
            "kind": "variable_type",
            "labels": [
                "default"
            ],
            "name": "real",
            "parent": null,
            "weights": {
                "default": 1
            }
        },
        "string": {
            "annotations": {
                "esl_info": {
                    "domain": null,
                    "units": []
                }
            },
            "children": [],
            "is_bus": false,
            "kind": "variable_type",
            "labels": [
                "default"
            ],
            "name": "string",
            "parent": null,
            "weights": {
                "default": 1
            }
        },
        "world": {
            "annotations": {
                "esl_info": {
                    "comments": [],
                    "definition_name": "world",
                    "property_variables": []
                }
            },
            "children": [
                "world.foo",
                "world.faa"
            ],
            "is_bus": false,
            "kind": "component",
            "labels": [
                "default"
            ],
            "name": "world",
            "parent": null,
            "weights": {
                "default": 1
            }
        },
        "world.a": {
            "annotations": {
                "esl_info": {
                    "comments": [],
                    "is_property": false,
                    "type_ref": "real"
                }
            },
            "children": [],
            "is_bus": false,
            "kind": "variable",
            "labels": [
                "default"
            ],
            "name": "world.a",
            "parent": null,
            "weights": {
                "default": 1
            }
        },
        "world.b.r": {
            "annotations": {
                "esl_info": {
                    "comments": [],
                    "is_property": false,
                    "type_ref": "real"
                }
            },
            "children": [],
            "is_bus": false,
            "kind": "variable",
            "labels": [
                "default"
            ],
            "name": "world.b.r",
            "parent": null,
            "weights": {
                "default": 1
            }
        },
        "world.b.s": {
            "annotations": {
                "esl_info": {
                    "comments": [],
                    "is_property": false,
                    "type_ref": "string"
                }
            },
            "children": [],
            "is_bus": false,
            "kind": "variable",
            "labels": [
                "default"
            ],
            "name": "world.b.s",
            "parent": null,
            "weights": {
                "default": 1
            }
        },
        "world.c1": {
            "annotations": {
                "esl_info": {
                    "comments": [],
                    "subject": "world.b.r",
                    "text": "must be a real real"
                }
            },
            "children": [],
            "is_bus": false,
            "kind": "need",
            "labels": [
                "default"
            ],
            "name": "world.c1",
            "parent": null,
            "weights": {
                "default": 1
            }
        },
        "world.c2": {
            "annotations": {
                "esl_info": {
                    "comments": [],
                    "subject": "world.b.s",
                    "text": "could have a real"
                }
            },
            "children": [],
            "is_bus": false,
            "kind": "need",
            "labels": [
                "default"
            ],
            "name": "world.c2",
            "parent": null,
            "weights": {
                "default": 1
            }
        },
        "world.faa": {
            "annotations": {
                "esl_info": {
                    "comments": [],
                    "definition_name": "blob",
                    "property_variables": []
                }
            },
            "children": [],
            "is_bus": false,
            "kind": "component",
            "labels": [
                "default"
            ],
            "name": "world.faa",
            "parent": "world",
            "weights": {
                "default": 1
            }
        },
        "world.foo": {
            "annotations": {
                "esl_info": {
                    "comments": [],
                    "definition_name": "blob",
                    "property_variables": []
                }
            },
            "children": [],
            "is_bus": false,
            "kind": "component",
            "labels": [
                "default"
            ],
            "name": "world.foo",
            "parent": "world",
            "weights": {
                "default": 1
            }
        },
        "world.provide-real": {
            "annotations": {
                "esl_info": {
                    "body": {
                        "active": "world.foo",
                        "auxiliary": "must",
                        "passive": "world.faa",
                        "preposition": "to",
                        "subclauses": [],
                        "variables": [
                            "world.b.r"
                        ],
                        "verb": "provide"
                    },
                    "comments": [],
                    "form": "requirement",
                    "sub_kind": "goal"
                }
            },
            "children": [],
            "is_bus": false,
            "kind": "function_spec",
            "labels": [
                "default"
            ],
            "name": "world.provide-real",
            "parent": null,
            "weights": {
                "default": 1
            }
        }
    }
}