<?xml version="1.0" encoding="UTF-8"?>
<svg version="1.1" viewBox="0 0 1323.6 244.43" xmlns="http://www.w3.org/2000/svg">
  <path class="foreground" d="m78.17 60.46v27.31c-28.06 0-50.82 22.73-50.87 50.79v0.08c-0.07 1.29-0.1 2.62-0.1 3.99v96.38h-27.2v-98.76c0-0.54 0-1.08 0.01-1.61h-0.01c0-43.18 35.01-78.18 78.18-78.18z"/>
  <path class="foreground" d="m249.39 65.85v12.49c0 8.77 0.34 13.5 0.68 18.57h-0.68c-7.76-18.91-32.4-36.46-66.83-36.46-53.66 0-90.8 39.15-90.8 91.8 0 52.65 35.11 92.14 90.13 92.14 33.41-0.34 59.06-17.56 67.5-40.16h0.68c-0.34 5.4-0.68 11.14-0.68 18.9v15.86h25.32v-173.15h-25.32zm-65.81 154.25c-36.79 0-64.47-29.03-64.47-67.84s27.68-67.84 64.47-67.84 65.14 28.69 65.14 67.84-27 67.84-65.14 67.84z"/>
  <path class="foreground" d="m416.78 89.48v-23.63h-58.05v-46.24h-27.01v46.24h-20.92v23.63h20.92v91.46c0 39.49 22.28 61.43 61.43 61.43 7.42 0 14.51-1.35 19.58-3.38v-23.63c-4.39 1.68-9.79 2.36-15.53 2.36-23.96 0-38.47-13.15-38.47-39.48v-88.77h58.05z"/>
  <rect class="foreground" x="449.5" y="65.85" width="27.01" height="173.15"/>
  <circle class="accent" cx="463" cy="19.61" r="19.61"/>
  <path class="foreground" d="m672.52 158.22c-2.68 35.76-28.77 61.83-63.96 61.83-37.16 0-63.86-29.07-63.86-67.92s23.79-64.68 57.75-67.64v-24.04c-49.28 2.9-85.45 41.07-85.45 91.68s38.51 92.23 91.56 92.23 88.5-36.54 91.38-86.15h-27.42z"/>
  <path class="accent" d="m699.94 145.25h-27.17c-2.48-33.6-25.53-58.19-57.32-60.97v-23.82c46.82 2.75 81.74 37.67 84.49 84.79z"/>
  <path class="accent" d="m884.51 103.26c-13.64-19.29-36.22-31.52-61.87-31.52-43.99 0-77.15 34.81-77.15 80.68s33.17 80.45 77.15 80.45c25.64 0 47.52-12.23 61.39-30.81l8.47 7.29c-15.53 21.41-40.23 35.05-69.86 35.05-51.75 0-90.09-39.75-90.09-91.97s39.05-91.97 90.09-91.97c29.88 0 55.04 13.88 70.57 35.52l-8.7 7.29z"/>
  <path class="accent" d="m1031.3 196.36h-85.55l-17.21 46.25h-12.59l66.28-176.24h12.85l66.03 176.24h-12.59l-17.21-46.25zm-3.6-9.76-39.05-105.08-39.31 105.08z"/>
  <path class="accent" d="m1111.7 238.24c-8.73-4.11-15.54-9.68-20.42-16.7s-7.67-14.81-8.35-23.38h12.08c1.37 9.42 5.78 17.82 13.23 25.18 7.45 7.37 18.79 11.05 34.04 11.05 8.91 0 16.66-1.63 23.25-4.88s11.69-7.71 15.29-13.36 5.39-11.9 5.39-18.75c0-8.74-2.1-15.67-6.3-20.81s-9.42-8.99-15.67-11.56-14.69-5.31-25.31-8.22c-11.65-3.09-21.03-6.17-28.13-9.25-7.11-3.08-13.1-7.84-17.98-14.26s-7.32-15.2-7.32-26.33c0-8.56 2.27-16.4 6.81-23.5 4.54-7.11 11-12.72 19.4-16.83 8.39-4.11 18.07-6.17 29.03-6.17 15.93 0 28.78 3.94 38.54 11.82s15.58 17.56 17.47 29.03h-12.33c-1.03-4.63-3.3-9.33-6.81-14.13-3.51-4.79-8.48-8.77-14.9-11.95-6.42-3.17-14.09-4.75-22.99-4.75-11.99 0-22.09 3.3-30.32 9.89-8.22 6.6-12.33 15.37-12.33 26.33 0 8.73 2.14 15.72 6.43 20.94 4.28 5.23 9.54 9.16 15.8 11.82 6.25 2.66 14.69 5.36 25.31 8.09 11.82 3.26 21.2 6.38 28.13 9.38 6.94 3 12.85 7.71 17.72 14.13 4.88 6.42 7.32 15.12 7.32 26.08 0 8.05-2.14 15.67-6.42 22.87-4.28 7.19-10.58 13.06-18.88 17.6-8.31 4.54-18.37 6.81-30.19 6.81s-21.84-2.06-30.57-6.17z"/>
  <path class="accent" d="m1244 72.02v75.28h71.94v9.76h-71.94v75.79h79.64v9.76h-91.2v-180.35h91.2v9.76z"/>
</svg>
