<?xml version="1.0" encoding="UTF-8"?>
<svg version="1.1" viewBox="0 0 1776.5 316.06" xmlns="http://www.w3.org/2000/svg">
  <path d="m0 0v316.06h316.06v-316.06zm201.38 265.1c0-29.77-11.86-56.8-31.1-76.63-14.55 14.47-34.61 23.44-56.77 23.44v-54.71c-7.21-1.49-14.67-2.28-22.32-2.28v-23.49c7.6 0 15.06 0.63 22.32 1.87v-82.35c44.45 0 80.47 36.04 80.47 80.48 0 13.75-3.43 26.69-9.52 38 24.92 24.29 40.41 58.21 40.41 95.67zm-87.87-131.8v23.9c22.03 4.54 41.68 15.69 56.77 31.27 5.62-5.59 10.41-12 14.18-19.04-19.05-18.57-43.61-31.52-70.95-36.13z"/>
  <path d="m1254.6 261.17c-45.83 0-80.38-36.02-80.38-83.81s34.55-84.05 80.38-84.05c26.72 0 50.24 12.74 64.45 32.83l9.07-7.59c-16.17-22.55-42.39-37.01-73.52-37.01-53.18 0-93.85 41.17-93.85 95.82s39.94 95.82 93.85 95.82c30.88 0 56.61-14.21 72.79-36.51l-8.83-7.6c-14.46 19.36-37.24 32.1-63.96 32.1z"/>
  <path d="m1434.2 87.7h-13.39l-69.05 183.61h13.11l17.94-48.18h89.13l17.93 48.18h13.11zm-47.65 125.26 40.96-109.47 40.68 109.47z"/>
  <path d="m1637.7 196.77c-5.08-6.7-11.23-11.6-18.46-14.73-7.23-3.11-17-6.37-29.31-9.76-11.06-2.86-19.85-5.67-26.37-8.44-6.51-2.76-11.99-6.86-16.45-12.31-4.47-5.44-6.7-12.71-6.7-21.81 0-11.42 4.29-20.56 12.85-27.44 8.57-6.86 19.09-10.3 31.59-10.3 9.27 0 17.26 1.65 23.95 4.95 6.69 3.31 11.86 7.46 15.52 12.45 3.66 5 6.03 9.9 7.1 14.72h12.84c-1.96-11.95-8.03-22.04-18.2-30.25-10.17-8.2-23.55-12.31-40.14-12.31-11.43 0-21.51 2.14-30.25 6.43-8.74 4.28-15.48 10.12-20.21 17.53-4.73 7.4-7.09 15.56-7.09 24.49 0 11.6 2.54 20.74 7.63 27.43 5.08 6.69 11.33 11.64 18.73 14.86 7.41 3.21 17.17 6.42 29.31 9.63 11.06 3.04 19.85 5.89 26.36 8.57 6.52 2.67 11.96 6.69 16.33 12.04s6.56 12.58 6.56 21.68c0 7.14-1.87 13.65-5.62 19.54s-9.06 10.53-15.92 13.92c-6.88 3.39-14.95 5.08-24.23 5.08-15.88 0-27.7-3.83-35.46-11.51-7.76-7.67-12.36-16.41-13.79-26.23h-12.58c0.72 8.93 3.62 17.04 8.7 24.36 5.09 7.32 12.18 13.12 21.28 17.4s19.71 6.42 31.85 6.42 22.79-2.36 31.45-7.09c8.65-4.73 15.21-10.84 19.67-18.34 4.46-7.49 6.69-15.43 6.69-23.82 0-11.41-2.54-20.47-7.63-27.16z"/>
  <path d="m1776.5 93.59v-10.17h-95.02v187.89h95.02v-10.18h-82.97v-78.95h74.94v-10.17h-74.94v-78.42z"/>
  <path d="m657.32 87.17v13.01c0 9.14 0.36 14.06 0.71 19.34h-0.71c-8.08-19.69-33.75-37.98-69.62-37.98-55.9 0-94.59 40.79-94.59 95.64s36.58 96 93.89 96c34.81-0.35 61.54-18.29 70.32-41.84h0.71c-0.35 5.62-0.71 11.6-0.71 19.69v16.53h26.38v-180.39zm-68.56 160.7c-38.33 0-67.17-30.25-67.17-70.69s28.84-70.68 67.17-70.68 67.86 29.9 67.86 70.68-28.13 70.69-67.86 70.69z"/>
  <path d="m831.71 111.78v-24.61h-60.48v-48.18h-28.14v48.18h-21.79v24.61h21.79v95.29c0 41.14 23.22 64 64.01 64 7.73 0 15.11-1.41 20.39-3.51v-24.62c-4.57 1.76-10.2 2.46-16.18 2.46-24.96 0-40.08-13.71-40.08-41.14v-92.48z"/>
  <rect x="865.79" y="87.17" width="28.14" height="180.39"/>
  <circle cx="879.86" cy="38.99" r="20.43"/>
  <path d="m478.93 81.54v28.45c-29.23 0-52.94 23.68-52.99 52.91v0.09c-0.07 1.35-0.11 2.73-0.11 4.15v100.41h-28.34v-102.89c0-0.56 0-1.12 0.01-1.67h-0.01c0-44.99 36.47-81.45 81.45-81.45z"/>
  <path d="m1098 183.52c-2.79 37.22-29.95 64.35-66.57 64.35-38.68 0-66.47-30.26-66.47-70.69s24.77-67.32 60.11-70.4v-25.02c-51.3 3.02-88.93 42.74-88.93 95.42s40.08 96 95.29 96 92.12-38.03 95.12-89.66z"/>
  <path d="m1126.6 170.01h-28.28c-2.58-34.97-26.58-60.57-59.66-63.46v-24.79c48.74 2.87 85.08 39.21 87.94 88.25z"/>
</svg>
