<svg width="49" height="40" viewBox="0 0 49 40" fill="none" xmlns="http://www.w3.org/2000/svg">
<path d="M17.0447 0.835997H0.52516V39H9.3574V28.4776H17.0447C27.24 28.4776 33.6188 23.1892 33.6188 14.6841C33.6188 6.12444 27.24 0.835997 17.0447 0.835997ZM16.554 21.281H9.3574V8.03264H16.554C21.9515 8.03264 24.6775 10.486 24.6775 14.6841C24.6775 18.8276 21.9515 21.281 16.554 21.281Z" fill="white"/>
<path d="M42.9424 39.4281C45.8324 39.4281 48.1337 37.2339 48.1337 34.1834C48.1337 31.0794 45.8324 29.0457 42.9424 29.0457C40.0525 29.0457 37.7512 31.0794 37.7512 34.1834C37.7512 37.2339 40.0525 39.4281 42.9424 39.4281Z" fill="#BC475D"/>
</svg>
