0 0.02734375 0.03125 0.0546875 0.0625
0 0.02734375 0.033854166666666664 0.0546875 0.06770833333333333
0 0.01953125 0.020833333333333332 0.0390625 0.041666666666666664
0 0.01953125 0.0234375 0.0390625 0.046875
0 0.01953125 0.020833333333333332 0.0390625 0.041666666666666664
0 0.017578125 0.018229166666666668 0.03515625 0.036458333333333336
0 0.017578125 0.015625 0.03515625 0.03125
0 0.01171875 0.013020833333333334 0.0234375 0.026041666666666668
1 0.015625 0.03125 0.03125 0.0625
