0 0.048828125 0.0625 0.09765625 0.125
0 0.03125 0.036458333333333336 0.0625 0.07291666666666667
0 0.0234375 0.03125 0.046875 0.0625
0 0.05078125 0.041666666666666664 0.1015625 0.08333333333333333
0 0.03125 0.03125 0.0625 0.0625
0 0.01953125 0.018229166666666668 0.0390625 0.036458333333333336
0 0.01953125 0.018229166666666668 0.0390625 0.036458333333333336
0 0.015625 0.015625 0.03125 0.03125
0 0.0390625 0.036458333333333336 0.078125 0.07291666666666667
2 0.0546875 0.049479166666666664 0.109375 0.09895833333333333
1 0.0234375 0.041666666666666664 0.046875 0.08333333333333333
1 0.017578125 0.0390625 0.03515625 0.078125
1 0.021484375 0.03125 0.04296875 0.0625
1 0.017578125 0.026041666666666668 0.03515625 0.052083333333333336
1 0.01171875 0.0234375 0.0234375 0.046875
