0 0.03515625 0.03125 0.0703125 0.0625
0 0.025390625 0.026041666666666668 0.05078125 0.052083333333333336
0 0.01953125 0.020833333333333332 0.0390625 0.041666666666666664
0 0.01953125 0.0234375 0.0390625 0.046875
0 0.01171875 0.010416666666666666 0.0234375 0.020833333333333332
0 0.015625 0.018229166666666668 0.03125 0.036458333333333336
1 0.0234375 0.057291666666666664 0.046875 0.11458333333333333
1 0.013671875 0.036458333333333336 0.02734375 0.07291666666666667
1 0.021484375 0.046875 0.04296875 0.09375
1 0.017578125 0.041666666666666664 0.03515625 0.08333333333333333
1 0.005859375 0.020833333333333332 0.01171875 0.041666666666666664
1 0.005859375 0.018229166666666668 0.01171875 0.036458333333333336
1 0.005859375 0.013020833333333334 0.01171875 0.026041666666666668
1 0.005859375 0.015625 0.01171875 0.03125
1 0.009765625 0.026041666666666668 0.01953125 0.052083333333333336
0 0.064453125 0.044270833333333336 0.12890625 0.08854166666666667
