0 0.03125 0.0625 0.0625 0.125
0 0.03125 0.044270833333333336 0.0625 0.08854166666666667
0 0.0234375 0.028645833333333332 0.046875 0.057291666666666664
0 0.021484375 0.026041666666666668 0.04296875 0.052083333333333336
0 0.015625 0.020833333333333332 0.03125 0.041666666666666664
0 0.013671875 0.015625 0.02734375 0.03125
0 0.013671875 0.015625 0.02734375 0.03125
0 0.04296875 0.0390625 0.0859375 0.078125
0 0.01171875 0.013020833333333334 0.0234375 0.026041666666666668
0 0.01171875 0.015625 0.0234375 0.03125
1 0.01171875 0.033854166666666664 0.0234375 0.06770833333333333
1 0.009765625 0.0234375 0.01953125 0.046875
1 0.01171875 0.020833333333333332 0.0234375 0.041666666666666664
1 0.0078125 0.015625 0.015625 0.03125
