0 0.037109375 0.059895833333333336 0.07421875 0.11979166666666667
0 0.03125 0.036458333333333336 0.0625 0.07291666666666667
0 0.0234375 0.03125 0.046875 0.0625
0 0.017578125 0.0234375 0.03515625 0.046875
0 0.01171875 0.013020833333333334 0.0234375 0.026041666666666668
0 0.044921875 0.041666666666666664 0.08984375 0.08333333333333333
0 0.025390625 0.020833333333333332 0.05078125 0.041666666666666664
0 0.013671875 0.018229166666666668 0.02734375 0.036458333333333336
1 0.01171875 0.026041666666666668 0.0234375 0.052083333333333336
1 0.01171875 0.0234375 0.0234375 0.046875
1 0.033203125 0.0546875 0.06640625 0.109375
