0 0.0234375 0.033854166666666664 0.046875 0.06770833333333333
0 0.0234375 0.033854166666666664 0.046875 0.06770833333333333
0 0.017578125 0.020833333333333332 0.03515625 0.041666666666666664
0 0.013671875 0.018229166666666668 0.02734375 0.036458333333333336
0 0.052734375 0.046875 0.10546875 0.09375
0 0.033203125 0.033854166666666664 0.06640625 0.06770833333333333
0 0.01953125 0.020833333333333332 0.0390625 0.041666666666666664
0 0.017578125 0.0234375 0.03515625 0.046875
1 0.03125 0.06770833333333333 0.0625 0.13541666666666666
1 0.01953125 0.036458333333333336 0.0390625 0.07291666666666667
1 0.009765625 0.0234375 0.01953125 0.046875
