<?xml version="1.0"?>
<opencv_storage>
<stage18>
  <maxWeakCount>9</maxWeakCount>
  <stageThreshold>-1.6070514917373657e+00</stageThreshold>
  <weakClassifiers>
    <_>
      <internalNodes>
        0 -1 67644 3.1065517663955688e-01</internalNodes>
      <leafValues>
        -6.6470587253570557e-01 6.7741936445236206e-01</leafValues></_>
    <_>
      <internalNodes>
        0 -1 114413 5.4550817003473639e-04</internalNodes>
      <leafValues>
        -4.0278974175453186e-01 3.6355349421501160e-01</leafValues></_>
    <_>
      <internalNodes>
        0 -1 135504 2.6823724620044231e-03</internalNodes>
      <leafValues>
        -2.0533509552478790e-01 5.3291815519332886e-01</leafValues></_>
    <_>
      <internalNodes>
        0 -1 125052 -1.0252110951114446e-04</internalNodes>
      <leafValues>
        -6.3848721981048584e-01 1.9362767040729523e-01</leafValues></_>
    <_>
      <internalNodes>
        0 -1 135804 2.5345468893647194e-03</internalNodes>
      <leafValues>
        -1.7260742187500000e-01 6.2352192401885986e-01</leafValues></_>
    <_>
      <internalNodes>
        0 -1 140372 -3.4752758219838142e-03</internalNodes>
      <leafValues>
        5.5645966529846191e-01 -2.0805118978023529e-01</leafValues></_>
    <_>
      <internalNodes>
        0 -1 159717 2.8704563737846911e-04</internalNodes>
      <leafValues>
        -3.4686589241027832e-01 3.4843245148658752e-01</leafValues></_>
    <_>
      <internalNodes>
        0 -1 113947 7.4661069083958864e-04</internalNodes>
      <leafValues>
        -2.0615023374557495e-01 5.6777006387710571e-01</leafValues></_>
    <_>
      <internalNodes>
        0 -1 83573 -2.2394140250980854e-04</internalNodes>
      <leafValues>
        3.4782961010932922e-01 -3.2453134655952454e-01</leafValues></_></weakClassifiers></stage18>
</opencv_storage>
