0 0.017578125 0.020833333333333332 0.03515625 0.041666666666666664
1 0.01171875 0.026041666666666668 0.0234375 0.052083333333333336
1 0.0078125 0.015625 0.015625 0.03125
1 0.0078125 0.018229166666666668 0.015625 0.036458333333333336
0 0.017578125 0.03125 0.03515625 0.0625
0 0.01171875 0.015625 0.0234375 0.03125
