0 0.03515625 0.041666666666666664 0.0703125 0.08333333333333333
0 0.033203125 0.044270833333333336 0.06640625 0.08854166666666667
0 0.0234375 0.026041666666666668 0.046875 0.052083333333333336
0 0.0234375 0.026041666666666668 0.046875 0.052083333333333336
0 0.01953125 0.020833333333333332 0.0390625 0.041666666666666664
0 0.015625 0.020833333333333332 0.03125 0.041666666666666664
0 0.015625 0.018229166666666668 0.03125 0.036458333333333336
0 0.013671875 0.018229166666666668 0.02734375 0.036458333333333336
0 0.052734375 0.049479166666666664 0.10546875 0.09895833333333333
0 0.01953125 0.020833333333333332 0.0390625 0.041666666666666664
0 0.017578125 0.020833333333333332 0.03515625 0.041666666666666664
