0 0.015625 0.0234375 0.03125 0.046875
1 0.005859375 0.015625 0.01171875 0.03125
1 0.009765625 0.015625 0.01953125 0.03125
1 0.01171875 0.026041666666666668 0.0234375 0.052083333333333336
1 0.005859375 0.013020833333333334 0.01171875 0.026041666666666668
0 0.01171875 0.013020833333333334 0.0234375 0.026041666666666668
0 0.013671875 0.015625 0.02734375 0.03125
0 0.017578125 0.015625 0.03515625 0.03125
0 0.009765625 0.013020833333333334 0.01953125 0.026041666666666668
0 0.05859375 0.057291666666666664 0.1171875 0.11458333333333333
