0 0.060546875 0.06510416666666667 0.12109375 0.13020833333333334
0 0.0234375 0.03125 0.046875 0.0625
0 0.0234375 0.033854166666666664 0.046875 0.06770833333333333
0 0.021484375 0.028645833333333332 0.04296875 0.057291666666666664
0 0.015625 0.0234375 0.03125 0.046875
0 0.01953125 0.018229166666666668 0.0390625 0.036458333333333336
0 0.015625 0.015625 0.03125 0.03125
1 0.03125 0.041666666666666664 0.0625 0.08333333333333333
1 0.01953125 0.036458333333333336 0.0390625 0.07291666666666667
1 0.0078125 0.020833333333333332 0.015625 0.041666666666666664
1 0.0078125 0.018229166666666668 0.015625 0.036458333333333336
