0 0.02734375 0.0390625 0.0546875 0.078125
0 0.0234375 0.036458333333333336 0.046875 0.07291666666666667
0 0.017578125 0.028645833333333332 0.03515625 0.057291666666666664
0 0.03515625 0.0234375 0.0703125 0.046875
0 0.0234375 0.0234375 0.046875 0.046875
0 0.015625 0.020833333333333332 0.03125 0.041666666666666664
0 0.017578125 0.015625 0.03515625 0.03125
0 0.033203125 0.03125 0.06640625 0.0625
0 0.01953125 0.015625 0.0390625 0.03125
2 0.05078125 0.041666666666666664 0.1015625 0.08333333333333333
0 0.015625 0.020833333333333332 0.03125 0.041666666666666664
1 0.009765625 0.03125 0.01953125 0.0625
0 0.015625 0.018229166666666668 0.03125 0.036458333333333336
