0 0.033203125 0.057291666666666664 0.06640625 0.11458333333333333
0 0.0234375 0.028645833333333332 0.046875 0.057291666666666664
0 0.025390625 0.028645833333333332 0.05078125 0.057291666666666664
0 0.046875 0.0390625 0.09375 0.078125
0 0.037109375 0.036458333333333336 0.07421875 0.07291666666666667
0 0.021484375 0.0234375 0.04296875 0.046875
0 0.01953125 0.020833333333333332 0.0390625 0.041666666666666664
0 0.013671875 0.015625 0.02734375 0.03125
0 0.017578125 0.03125 0.03515625 0.0625
0 0.01171875 0.015625 0.0234375 0.03125
0 0.013671875 0.015625 0.02734375 0.03125
1 0.0078125 0.015625 0.015625 0.03125
1 0.0078125 0.015625 0.015625 0.03125
1 0.01953125 0.028645833333333332 0.0390625 0.057291666666666664
1 0.017578125 0.03125 0.03515625 0.0625
1 0.02734375 0.026041666666666668 0.0546875 0.052083333333333336
