1 0.017578125 0.046875 0.03515625 0.09375
1 0.0234375 0.036458333333333336 0.046875 0.07291666666666667
0 0.044921875 0.06510416666666667 0.08984375 0.13020833333333334
0 0.03515625 0.052083333333333336 0.0703125 0.10416666666666667
0 0.021484375 0.0234375 0.04296875 0.046875
0 0.01171875 0.018229166666666668 0.0234375 0.036458333333333336
0 0.015625 0.018229166666666668 0.03125 0.036458333333333336
0 0.01953125 0.018229166666666668 0.0390625 0.036458333333333336
1 0.009765625 0.020833333333333332 0.01953125 0.041666666666666664
1 0.0078125 0.015625 0.015625 0.03125
2 0.060546875 0.06510416666666667 0.12109375 0.13020833333333334
