0 0.052734375 0.06510416666666667 0.10546875 0.13020833333333334
0 0.03515625 0.049479166666666664 0.0703125 0.09895833333333333
0 0.029296875 0.041666666666666664 0.05859375 0.08333333333333333
0 0.021484375 0.026041666666666668 0.04296875 0.052083333333333336
0 0.021484375 0.026041666666666668 0.04296875 0.052083333333333336
0 0.04296875 0.0390625 0.0859375 0.078125
0 0.013671875 0.020833333333333332 0.02734375 0.041666666666666664
0 0.015625 0.018229166666666668 0.03125 0.036458333333333336
0 0.015625 0.015625 0.03125 0.03125
0 0.015625 0.015625 0.03125 0.03125
1 0.0234375 0.041666666666666664 0.046875 0.08333333333333333
1 0.009765625 0.0234375 0.01953125 0.046875
