0 0.0390625 0.0703125 0.078125 0.140625
0 0.044921875 0.059895833333333336 0.08984375 0.11979166666666667
0 0.025390625 0.036458333333333336 0.05078125 0.07291666666666667
0 0.0234375 0.026041666666666668 0.046875 0.052083333333333336
0 0.02734375 0.026041666666666668 0.0546875 0.052083333333333336
0 0.017578125 0.0234375 0.03515625 0.046875
