1 0.017578125 0.036458333333333336 0.03515625 0.07291666666666667
1 0.009765625 0.0234375 0.01953125 0.046875
1 0.029296875 0.07291666666666667 0.05859375 0.14583333333333334
0 0.025390625 0.036458333333333336 0.05078125 0.07291666666666667
0 0.02734375 0.026041666666666668 0.0546875 0.052083333333333336
0 0.01953125 0.0234375 0.0390625 0.046875
0 0.013671875 0.020833333333333332 0.02734375 0.041666666666666664
0 0.01171875 0.013020833333333334 0.0234375 0.026041666666666668
0 0.0390625 0.028645833333333332 0.078125 0.057291666666666664
