0 0.033203125 0.0390625 0.06640625 0.078125
0 0.025390625 0.033854166666666664 0.05078125 0.06770833333333333
0 0.025390625 0.020833333333333332 0.05078125 0.041666666666666664
0 0.017578125 0.0234375 0.03515625 0.046875
