1 0.02734375 0.033854166666666664 0.0546875 0.06770833333333333
1 0.015625 0.026041666666666668 0.03125 0.052083333333333336
0 0.029296875 0.028645833333333332 0.05859375 0.057291666666666664
0 0.04296875 0.028645833333333332 0.0859375 0.057291666666666664
0 0.0234375 0.0234375 0.046875 0.046875
1 0.01171875 0.020833333333333332 0.0234375 0.041666666666666664
0 0.0234375 0.026041666666666668 0.046875 0.052083333333333336
0 0.021484375 0.0234375 0.04296875 0.046875
1 0.01171875 0.0234375 0.0234375 0.046875
0 0.041015625 0.052083333333333336 0.08203125 0.10416666666666667
0 0.017578125 0.018229166666666668 0.03515625 0.036458333333333336
