1 0.01171875 0.0390625 0.0234375 0.078125
1 0.017578125 0.026041666666666668 0.03515625 0.052083333333333336
1 0.0078125 0.020833333333333332 0.015625 0.041666666666666664
1 0.009765625 0.020833333333333332 0.01953125 0.041666666666666664
0 0.0390625 0.059895833333333336 0.078125 0.11979166666666667
0 0.025390625 0.041666666666666664 0.05078125 0.08333333333333333
0 0.033203125 0.041666666666666664 0.06640625 0.08333333333333333
0 0.017578125 0.0234375 0.03515625 0.046875
0 0.015625 0.020833333333333332 0.03125 0.041666666666666664
0 0.046875 0.033854166666666664 0.09375 0.06770833333333333
0 0.021484375 0.0234375 0.04296875 0.046875
1 0.0390625 0.08333333333333333 0.078125 0.16666666666666666
