0 0.05078125 0.08072916666666667 0.1015625 0.16145833333333334
0 0.0390625 0.046875 0.078125 0.09375
0 0.0546875 0.059895833333333336 0.109375 0.11979166666666667
0 0.05078125 0.03125 0.1015625 0.0625
0 0.029296875 0.028645833333333332 0.05859375 0.057291666666666664
0 0.02734375 0.03125 0.0546875 0.0625
1 0.029296875 0.0625 0.05859375 0.125
1 0.0234375 0.059895833333333336 0.046875 0.11979166666666667
0 0.048828125 0.049479166666666664 0.09765625 0.09895833333333333
