0 0.041015625 0.033854166666666664 0.08203125 0.06770833333333333
0 0.03515625 0.03125 0.0703125 0.0625
0 0.0234375 0.036458333333333336 0.046875 0.07291666666666667
0 0.01953125 0.020833333333333332 0.0390625 0.041666666666666664
0 0.025390625 0.036458333333333336 0.05078125 0.07291666666666667
0 0.0234375 0.036458333333333336 0.046875 0.07291666666666667
0 0.015625 0.020833333333333332 0.03125 0.041666666666666664
0 0.013671875 0.015625 0.02734375 0.03125
0 0.01171875 0.015625 0.0234375 0.03125
1 0.015625 0.028645833333333332 0.03125 0.057291666666666664
1 0.01953125 0.026041666666666668 0.0390625 0.052083333333333336
1 0.005859375 0.018229166666666668 0.01171875 0.036458333333333336
1 0.01171875 0.020833333333333332 0.0234375 0.041666666666666664
1 0.0078125 0.015625 0.015625 0.03125
1 0.025390625 0.026041666666666668 0.05078125 0.052083333333333336
2 0.021484375 0.033854166666666664 0.04296875 0.06770833333333333
2 0.0546875 0.044270833333333336 0.109375 0.08854166666666667
