1 0.033203125 0.052083333333333336 0.06640625 0.10416666666666667
1 0.02734375 0.049479166666666664 0.0546875 0.09895833333333333
1 0.013671875 0.036458333333333336 0.02734375 0.07291666666666667
0 0.025390625 0.036458333333333336 0.05078125 0.07291666666666667
0 0.052734375 0.046875 0.10546875 0.09375
0 0.03125 0.033854166666666664 0.0625 0.06770833333333333
0 0.025390625 0.033854166666666664 0.05078125 0.06770833333333333
0 0.017578125 0.020833333333333332 0.03515625 0.041666666666666664
