0 0.0390625 0.041666666666666664 0.078125 0.08333333333333333
0 0.033203125 0.03125 0.06640625 0.0625
0 0.05859375 0.044270833333333336 0.1171875 0.08854166666666667
0 0.015625 0.015625 0.03125 0.03125
0 0.017578125 0.015625 0.03515625 0.03125
1 0.01171875 0.020833333333333332 0.0234375 0.041666666666666664
