0 0.0546875 0.041666666666666664 0.109375 0.08333333333333333
0 0.0546875 0.06770833333333333 0.109375 0.13541666666666666
1 0.009765625 0.03125 0.01953125 0.0625
1 0.01171875 0.0234375 0.0234375 0.046875
0 0.033203125 0.033854166666666664 0.06640625 0.06770833333333333
0 0.0390625 0.018229166666666668 0.078125 0.036458333333333336
0 0.03515625 0.033854166666666664 0.0703125 0.06770833333333333
0 0.0234375 0.026041666666666668 0.046875 0.052083333333333336
1 0.013671875 0.0234375 0.02734375 0.046875
1 0.0078125 0.020833333333333332 0.015625 0.041666666666666664
2 0.052734375 0.049479166666666664 0.10546875 0.09895833333333333
0 0.021484375 0.018229166666666668 0.04296875 0.036458333333333336
0 0.013671875 0.020833333333333332 0.02734375 0.041666666666666664
0 0.025390625 0.020833333333333332 0.05078125 0.041666666666666664
