2 0.048828125 0.0390625 0.09765625 0.078125
0 0.033203125 0.036458333333333336 0.06640625 0.07291666666666667
0 0.0390625 0.0390625 0.078125 0.078125
0 0.02734375 0.018229166666666668 0.0546875 0.036458333333333336
0 0.0234375 0.0234375 0.046875 0.046875
0 0.015625 0.018229166666666668 0.03125 0.036458333333333336
1 0.01171875 0.028645833333333332 0.0234375 0.057291666666666664
1 0.01171875 0.0234375 0.0234375 0.046875
1 0.009765625 0.0234375 0.01953125 0.046875
