1 0.017578125 0.0546875 0.03515625 0.109375
1 0.01171875 0.03125 0.0234375 0.0625
1 0.015625 0.0234375 0.03125 0.046875
0 0.02734375 0.033854166666666664 0.0546875 0.06770833333333333
0 0.0234375 0.028645833333333332 0.046875 0.057291666666666664
0 0.017578125 0.026041666666666668 0.03515625 0.052083333333333336
0 0.0546875 0.041666666666666664 0.109375 0.08333333333333333
0 0.04296875 0.036458333333333336 0.0859375 0.07291666666666667
0 0.02734375 0.026041666666666668 0.0546875 0.052083333333333336
0 0.025390625 0.026041666666666668 0.05078125 0.052083333333333336
0 0.03515625 0.036458333333333336 0.0703125 0.07291666666666667
2 0.048828125 0.0390625 0.09765625 0.078125
