1 0.005859375 0.015625 0.01171875 0.03125
1 0.005859375 0.013020833333333334 0.01171875 0.026041666666666668
1 0.0078125 0.018229166666666668 0.015625 0.036458333333333336
0 0.0546875 0.09114583333333333 0.109375 0.18229166666666666
0 0.025390625 0.0390625 0.05078125 0.078125
0 0.025390625 0.026041666666666668 0.05078125 0.052083333333333336
0 0.017578125 0.020833333333333332 0.03515625 0.041666666666666664
0 0.021484375 0.026041666666666668 0.04296875 0.052083333333333336
0 0.056640625 0.041666666666666664 0.11328125 0.08333333333333333
0 0.025390625 0.018229166666666668 0.05078125 0.036458333333333336
0 0.01171875 0.015625 0.0234375 0.03125
