1 0.009765625 0.026041666666666668 0.01953125 0.052083333333333336
1 0.0078125 0.020833333333333332 0.015625 0.041666666666666664
1 0.0078125 0.020833333333333332 0.015625 0.041666666666666664
1 0.005859375 0.013020833333333334 0.01171875 0.026041666666666668
1 0.00390625 0.010416666666666666 0.0078125 0.020833333333333332
0 0.064453125 0.078125 0.12890625 0.15625
0 0.037109375 0.046875 0.07421875 0.09375
0 0.02734375 0.036458333333333336 0.0546875 0.07291666666666667
0 0.017578125 0.020833333333333332 0.03515625 0.041666666666666664
0 0.02734375 0.0234375 0.0546875 0.046875
0 0.015625 0.015625 0.03125 0.03125
0 0.013671875 0.018229166666666668 0.02734375 0.036458333333333336
