0 0.044921875 0.041666666666666664 0.08984375 0.08333333333333333
0 0.02734375 0.033854166666666664 0.0546875 0.06770833333333333
0 0.021484375 0.0234375 0.04296875 0.046875
0 0.015625 0.020833333333333332 0.03125 0.041666666666666664
0 0.017578125 0.020833333333333332 0.03515625 0.041666666666666664
1 0.021484375 0.0546875 0.04296875 0.109375
1 0.015625 0.0390625 0.03125 0.078125
1 0.015625 0.033854166666666664 0.03125 0.06770833333333333
1 0.009765625 0.03125 0.01953125 0.0625
1 0.0078125 0.018229166666666668 0.015625 0.036458333333333336
