0 0.046875 0.041666666666666664 0.09375 0.08333333333333333
0 0.052734375 0.07552083333333333 0.10546875 0.15104166666666666
0 0.021484375 0.03125 0.04296875 0.0625
0 0.01171875 0.013020833333333334 0.0234375 0.026041666666666668
1 0.021484375 0.052083333333333336 0.04296875 0.10416666666666667
1 0.015625 0.0390625 0.03125 0.078125
1 0.013671875 0.033854166666666664 0.02734375 0.06770833333333333
1 0.015625 0.036458333333333336 0.03125 0.07291666666666667
1 0.009765625 0.020833333333333332 0.01953125 0.041666666666666664
1 0.005859375 0.015625 0.01171875 0.03125
1 0.005859375 0.015625 0.01171875 0.03125
0 0.015625 0.0234375 0.03125 0.046875
0 0.013671875 0.020833333333333332 0.02734375 0.041666666666666664
