0 0.01953125 0.028645833333333332 0.0390625 0.057291666666666664
0 0.029296875 0.03125 0.05859375 0.0625
1 0.01171875 0.026041666666666668 0.0234375 0.052083333333333336
1 0.013671875 0.0234375 0.02734375 0.046875
1 0.0078125 0.020833333333333332 0.015625 0.041666666666666664
1 0.009765625 0.018229166666666668 0.01953125 0.036458333333333336
1 0.0078125 0.015625 0.015625 0.03125
1 0.0078125 0.015625 0.015625 0.03125
0 0.01171875 0.015625 0.0234375 0.03125
