1 0.017578125 0.052083333333333336 0.03515625 0.10416666666666667
1 0.021484375 0.049479166666666664 0.04296875 0.09895833333333333
1 0.015625 0.036458333333333336 0.03125 0.07291666666666667
1 0.0234375 0.041666666666666664 0.046875 0.08333333333333333
1 0.01953125 0.03125 0.0390625 0.0625
2 0.03125 0.046875 0.0625 0.09375
2 0.05078125 0.044270833333333336 0.1015625 0.08854166666666667
0 0.056640625 0.0546875 0.11328125 0.109375
0 0.02734375 0.0234375 0.0546875 0.046875
0 0.04296875 0.020833333333333332 0.0859375 0.041666666666666664
0 0.03125 0.041666666666666664 0.0625 0.08333333333333333
0 0.01953125 0.0234375 0.0390625 0.046875
