0 0.0390625 0.07291666666666667 0.078125 0.14583333333333334
0 0.025390625 0.033854166666666664 0.05078125 0.06770833333333333
0 0.033203125 0.0390625 0.06640625 0.078125
0 0.0234375 0.03125 0.046875 0.0625
0 0.017578125 0.0234375 0.03515625 0.046875
0 0.017578125 0.020833333333333332 0.03515625 0.041666666666666664
0 0.01953125 0.020833333333333332 0.0390625 0.041666666666666664
0 0.015625 0.015625 0.03125 0.03125
1 0.013671875 0.03125 0.02734375 0.0625
1 0.0078125 0.015625 0.015625 0.03125
