0 0.03515625 0.057291666666666664 0.0703125 0.11458333333333333
0 0.04296875 0.052083333333333336 0.0859375 0.10416666666666667
0 0.02734375 0.036458333333333336 0.0546875 0.07291666666666667
0 0.0234375 0.03125 0.046875 0.0625
0 0.01953125 0.0234375 0.0390625 0.046875
0 0.015625 0.018229166666666668 0.03125 0.036458333333333336
0 0.05859375 0.046875 0.1171875 0.09375
0 0.03125 0.026041666666666668 0.0625 0.052083333333333336
0 0.021484375 0.018229166666666668 0.04296875 0.036458333333333336
0 0.021484375 0.020833333333333332 0.04296875 0.041666666666666664
0 0.013671875 0.013020833333333334 0.02734375 0.026041666666666668
2 0.05078125 0.057291666666666664 0.1015625 0.11458333333333333
0 0.033203125 0.0390625 0.06640625 0.078125
1 0.015625 0.036458333333333336 0.03125 0.07291666666666667
1 0.025390625 0.036458333333333336 0.05078125 0.07291666666666667
1 0.01953125 0.026041666666666668 0.0390625 0.052083333333333336
1 0.01171875 0.0234375 0.0234375 0.046875
