0 0.025390625 0.028645833333333332 0.05078125 0.057291666666666664
0 0.015625 0.026041666666666668 0.03125 0.052083333333333336
0 0.015625 0.020833333333333332 0.03125 0.041666666666666664
0 0.048828125 0.044270833333333336 0.09765625 0.08854166666666667
0 0.01171875 0.015625 0.0234375 0.03125
0 0.009765625 0.013020833333333334 0.01953125 0.026041666666666668
1 0.03125 0.059895833333333336 0.0625 0.11979166666666667
1 0.037109375 0.0703125 0.07421875 0.140625
1 0.029296875 0.049479166666666664 0.05859375 0.09895833333333333
1 0.01171875 0.026041666666666668 0.0234375 0.052083333333333336
1 0.009765625 0.020833333333333332 0.01953125 0.041666666666666664
1 0.0078125 0.0234375 0.015625 0.046875
1 0.005859375 0.020833333333333332 0.01171875 0.041666666666666664
1 0.009765625 0.0234375 0.01953125 0.046875
