0 0.02734375 0.041666666666666664 0.0546875 0.08333333333333333
0 0.0234375 0.028645833333333332 0.046875 0.057291666666666664
1 0.0078125 0.013020833333333334 0.015625 0.026041666666666668
1 0.0078125 0.018229166666666668 0.015625 0.036458333333333336
0 0.017578125 0.026041666666666668 0.03515625 0.052083333333333336
0 0.015625 0.020833333333333332 0.03125 0.041666666666666664
2 0.052734375 0.044270833333333336 0.10546875 0.08854166666666667
