0 0.046875 0.041666666666666664 0.09375 0.08333333333333333
0 0.0234375 0.044270833333333336 0.046875 0.08854166666666667
0 0.03125 0.036458333333333336 0.0625 0.07291666666666667
0 0.017578125 0.020833333333333332 0.03515625 0.041666666666666664
0 0.015625 0.018229166666666668 0.03125 0.036458333333333336
1 0.029296875 0.0703125 0.05859375 0.140625
1 0.015625 0.0390625 0.03125 0.078125
1 0.013671875 0.033854166666666664 0.02734375 0.06770833333333333
1 0.013671875 0.026041666666666668 0.02734375 0.052083333333333336
1 0.0078125 0.018229166666666668 0.015625 0.036458333333333336
1 0.0078125 0.018229166666666668 0.015625 0.036458333333333336
1 0.0078125 0.020833333333333332 0.015625 0.041666666666666664
1 0.005859375 0.010416666666666666 0.01171875 0.020833333333333332
