filename,width,height,class,xmin,ymin,xmax,ymax
pideo7-1.jpg,640,480,car,276,341,330,417
pideo7-1.jpg,640,480,car,302,298,333,327
pideo7-1.jpg,640,480,car,283,278,309,300
pideo7-1.jpg,640,480,car,300,265,322,283
pideo7-1.jpg,640,480,motorbike,347,276,372,294
pideo7-1.jpg,640,480,truck,552,280,605,330
pideo7-1.jpg,640,480,truck,488,282,553,332
pideo7-1.jpg,640,480,car,385,259,421,288
pideo7-1.jpg,640,480,motorbike,329,265,337,280
pideo7-10.jpg,640,480,car,249,357,316,444
pideo7-10.jpg,640,480,motorbike,386,344,412,394
pideo7-10.jpg,640,480,motorbike,438,327,466,371
pideo7-10.jpg,640,480,motorbike,360,279,374,301
pideo7-10.jpg,640,480,car,311,304,348,348
pideo7-10.jpg,640,480,car,297,263,314,275
pideo7-10.jpg,640,480,truck,483,286,557,332
pideo7-10.jpg,640,480,truck,553,287,603,327
pideo7-11.jpg,640,480,motorbike,397,380,437,452
pideo7-11.jpg,640,480,motorbike,457,339,489,389
pideo7-11.jpg,640,480,car,313,317,356,367
pideo7-11.jpg,640,480,car,233,383,318,480
pideo7-11.jpg,640,480,car,80,322,150,365
pideo7-11.jpg,640,480,motorbike,365,279,385,309
pideo7-11.jpg,640,480,car,298,261,316,278
pideo7-11.jpg,640,480,car,183,275,212,296
pideo7-11.jpg,640,480,motorbike,209,274,225,295
pideo7-11.jpg,640,480,truck,486,283,556,330
pideo7-12.jpg,640,480,car,311,332,362,394
pideo7-12.jpg,640,480,motorbike,484,356,519,415
pideo7-12.jpg,640,480,motorbike,13,348,48,389
pideo7-12.jpg,640,480,car,93,313,160,361
pideo7-12.jpg,640,480,motorbike,372,287,387,314
pideo7-12.jpg,640,480,car,296,263,322,281
pideo7-12.jpg,640,480,car,189,274,216,294
pideo7-12.jpg,640,480,motorbike,213,272,228,295
pideo7-13.jpg,640,480,car,311,350,379,420
pideo7-13.jpg,640,480,motorbike,506,377,567,446
pideo7-13.jpg,640,480,motorbike,376,286,404,320
pideo7-13.jpg,640,480,car,110,308,173,350
pideo7-13.jpg,640,480,motorbike,54,333,78,370
pideo7-13.jpg,640,480,car,193,270,220,291
pideo7-13.jpg,640,480,motorbike,220,267,229,284
pideo7-13.jpg,640,480,car,301,262,321,281
pideo7-13.jpg,640,480,car,202,259,223,276
pideo7-14.jpg,640,480,car,310,380,389,477
pideo7-14.jpg,640,480,motorbike,557,417,601,480
pideo7-14.jpg,640,480,motorbike,391,296,409,331
pideo7-14.jpg,640,480,car,121,311,183,346
pideo7-14.jpg,640,480,car,1,365,53,428
pideo7-14.jpg,640,480,motorbike,78,322,106,358
pideo7-14.jpg,640,480,car,200,269,222,289
pideo7-14.jpg,640,480,motorbike,222,266,233,286
pideo7-14.jpg,640,480,car,302,267,322,285
pideo7-14.jpg,640,480,car,330,257,348,275
pideo7-15.jpg,640,480,motorbike,402,304,423,341
pideo7-15.jpg,640,480,car,1,353,80,405
pideo7-15.jpg,640,480,car,130,309,192,344
pideo7-15.jpg,640,480,car,303,269,323,288
pideo7-15.jpg,640,480,car,203,267,224,287
pideo7-15.jpg,640,480,car,283,261,298,273
pideo7-15.jpg,640,480,car,309,257,326,270
pideo7-15.jpg,640,480,motorbike,108,314,124,346
pideo7-15.jpg,640,480,motorbike,225,265,235,282
pideo7-16.jpg,640,480,motorbike,415,315,437,356
pideo7-16.jpg,640,480,motorbike,129,302,143,338
pideo7-16.jpg,640,480,motorbike,226,264,235,280
pideo7-16.jpg,640,480,motorbike,277,265,285,281
pideo7-16.jpg,640,480,car,305,271,324,292
pideo7-16.jpg,640,480,car,28,339,102,392
pideo7-16.jpg,640,480,car,143,306,206,339
pideo7-16.jpg,640,480,car,205,267,225,285
pideo7-16.jpg,640,480,car,282,259,300,275
pideo7-16.jpg,640,480,car,310,256,325,271
pideo7-16.jpg,640,480,car,329,257,347,272
pideo7-17.jpg,640,480,motorbike,428,326,461,375
pideo7-17.jpg,640,480,motorbike,227,263,236,277
pideo7-17.jpg,640,480,motorbike,145,299,159,323
pideo7-17.jpg,640,480,motorbike,275,265,284,285
pideo7-17.jpg,640,480,car,57,328,117,376
pideo7-17.jpg,640,480,car,150,304,211,335
pideo7-17.jpg,640,480,car,304,272,325,301
pideo7-17.jpg,640,480,car,208,266,225,281
pideo7-18.jpg,640,480,car,79,319,139,358
pideo7-18.jpg,640,480,car,153,300,221,330
pideo7-18.jpg,640,480,car,210,264,226,281
pideo7-18.jpg,640,480,car,305,281,328,300
pideo7-18.jpg,640,480,car,288,260,302,276
pideo7-18.jpg,640,480,car,273,257,290,269
pideo7-18.jpg,640,480,motorbike,453,342,481,398
pideo7-18.jpg,640,480,motorbike,273,266,284,285
pideo7-18.jpg,640,480,motorbike,163,292,174,310
pideo7-18.jpg,640,480,motorbike,226,261,240,277
pideo7-19.jpg,640,480,motorbike,482,362,515,428
pideo7-19.jpg,640,480,motorbike,273,267,284,286
pideo7-19.jpg,640,480,motorbike,175,288,187,304
pideo7-19.jpg,640,480,motorbike,228,260,240,273
pideo7-19.jpg,640,480,car,100,309,151,346
pideo7-19.jpg,640,480,car,306,281,328,308
pideo7-19.jpg,640,480,car,211,264,229,279
pideo7-19.jpg,640,480,car,289,263,308,279
pideo7-19.jpg,640,480,car,275,258,291,270
pideo7-19.jpg,640,480,car,315,258,330,273
pideo7-2.jpg,640,480,car,261,362,329,457
pideo7-2.jpg,640,480,car,300,304,338,339
pideo7-2.jpg,640,480,car,283,281,306,309
pideo7-2.jpg,640,480,car,302,268,322,284
pideo7-2.jpg,640,480,car,137,290,178,319
pideo7-2.jpg,640,480,car,191,273,213,295
pideo7-2.jpg,640,480,motorbike,360,276,370,298
pideo7-2.jpg,640,480,motorbike,335,266,344,284
pideo7-2.jpg,640,480,motorbike,113,312,136,342
pideo7-2.jpg,640,480,motorbike,219,261,230,275
pideo7-20.jpg,640,480,car,303,287,334,319
pideo7-20.jpg,640,480,car,176,299,240,330
pideo7-20.jpg,640,480,car,120,304,166,335
pideo7-20.jpg,640,480,car,291,264,307,279
pideo7-20.jpg,640,480,car,276,259,293,275
pideo7-20.jpg,640,480,car,316,259,333,275
pideo7-20.jpg,640,480,car,214,265,228,279
pideo7-20.jpg,640,480,motorbike,518,393,568,476
pideo7-20.jpg,640,480,motorbike,230,260,239,273
pideo7-20.jpg,640,480,motorbike,273,270,280,288
pideo7-21.jpg,640,480,car,304,294,333,325
pideo7-21.jpg,640,480,car,182,299,246,330
pideo7-21.jpg,640,480,car,135,297,180,329
pideo7-21.jpg,640,480,car,277,259,293,277
pideo7-21.jpg,640,480,car,291,264,310,281
pideo7-21.jpg,640,480,car,317,260,334,276
pideo7-21.jpg,640,480,motorbike,271,272,280,290
pideo7-21.jpg,640,480,motorbike,198,281,208,301
pideo7-21.jpg,640,480,car,215,264,230,277
pideo7-22.jpg,640,480,car,300,301,339,337
pideo7-22.jpg,640,480,car,150,292,190,320
pideo7-22.jpg,640,480,car,190,295,252,326
pideo7-22.jpg,640,480,motorbike,205,276,216,295
pideo7-22.jpg,640,480,car,217,261,233,275
pideo7-22.jpg,640,480,car,293,265,309,286
pideo7-22.jpg,640,480,car,277,261,296,279
pideo7-22.jpg,640,480,truck,487,284,554,328
pideo7-23.jpg,640,480,car,299,309,340,352
pideo7-23.jpg,640,480,car,166,288,200,317
pideo7-23.jpg,640,480,car,197,296,260,326
pideo7-23.jpg,640,480,car,293,270,311,287
pideo7-23.jpg,640,480,car,278,263,295,283
pideo7-23.jpg,640,480,car,320,262,339,278
pideo7-23.jpg,640,480,car,217,260,232,277
pideo7-23.jpg,640,480,motorbike,212,272,222,296
pideo7-23.jpg,640,480,motorbike,315,266,324,284
pideo7-24.jpg,640,480,car,297,322,341,371
pideo7-24.jpg,640,480,car,1,346,70,414
pideo7-24.jpg,640,480,car,202,296,267,326
pideo7-24.jpg,640,480,car,175,284,213,309
pideo7-24.jpg,640,480,car,293,268,311,290
pideo7-24.jpg,640,480,car,278,263,298,284
pideo7-24.jpg,640,480,car,326,264,340,281
pideo7-24.jpg,640,480,car,220,262,235,276
pideo7-24.jpg,640,480,motorbike,320,269,329,285
pideo7-24.jpg,640,480,motorbike,218,274,227,287
pideo7-25.jpg,640,480,car,294,337,346,396
pideo7-25.jpg,640,480,car,27,336,96,387
pideo7-25.jpg,640,480,car,207,294,270,327
pideo7-25.jpg,640,480,car,189,280,221,302
pideo7-25.jpg,640,480,car,221,260,239,274
pideo7-25.jpg,640,480,car,297,271,313,291
pideo7-25.jpg,640,480,car,280,265,300,284
pideo7-25.jpg,640,480,car,326,265,347,280
pideo7-25.jpg,640,480,motorbike,324,270,335,287
pideo7-25.jpg,640,480,motorbike,224,269,232,286
pideo7-26.jpg,640,480,car,287,357,350,433
pideo7-26.jpg,640,480,car,58,324,118,370
pideo7-26.jpg,640,480,car,212,295,274,328
pideo7-26.jpg,640,480,car,201,278,228,296
pideo7-26.jpg,640,480,car,296,272,313,291
pideo7-26.jpg,640,480,car,283,265,299,287
pideo7-26.jpg,640,480,car,326,266,346,280
pideo7-26.jpg,640,480,car,224,259,234,273
pideo7-26.jpg,640,480,motorbike,330,272,338,290
pideo7-26.jpg,640,480,motorbike,265,279,272,300
pideo7-27.jpg,640,480,car,280,388,358,480
pideo7-27.jpg,640,480,car,84,315,139,356
pideo7-27.jpg,640,480,car,217,295,280,322
pideo7-27.jpg,640,480,car,209,273,235,292
pideo7-27.jpg,640,480,car,224,258,239,273
pideo7-27.jpg,640,480,car,296,272,313,293
pideo7-27.jpg,640,480,car,279,267,300,289
pideo7-27.jpg,640,480,car,325,266,346,285
pideo7-27.jpg,640,480,motorbike,263,283,270,299
pideo7-27.jpg,640,480,motorbike,335,275,347,292
pideo7-28.jpg,640,480,motorbike,22,339,50,377
pideo7-28.jpg,640,480,motorbike,259,282,269,304
pideo7-28.jpg,640,480,motorbike,343,276,352,295
pideo7-28.jpg,640,480,car,296,274,316,294
pideo7-28.jpg,640,480,car,105,307,151,345
pideo7-28.jpg,640,480,car,224,296,283,324
pideo7-28.jpg,640,480,car,217,270,239,289
pideo7-28.jpg,640,480,car,223,257,237,270
pideo7-28.jpg,640,480,car,282,268,300,290
pideo7-28.jpg,640,480,car,330,267,345,284
pideo7-29.jpg,640,480,car,7,370,92,424
pideo7-29.jpg,640,480,car,122,301,165,336
pideo7-29.jpg,640,480,car,227,295,289,324
pideo7-29.jpg,640,480,car,224,266,244,287
pideo7-29.jpg,640,480,car,297,276,315,298
pideo7-29.jpg,640,480,car,282,270,300,291
pideo7-29.jpg,640,480,car,307,267,327,287
pideo7-29.jpg,640,480,car,332,269,352,285
pideo7-29.jpg,640,480,motorbike,347,280,359,300
pideo7-29.jpg,640,480,motorbike,352,270,364,287
pideo7-29.jpg,640,480,motorbike,49,330,72,366
pideo7-3.jpg,640,480,car,302,314,335,354
pideo7-3.jpg,640,480,car,281,285,310,314
pideo7-3.jpg,640,480,car,143,290,180,315
pideo7-3.jpg,640,480,car,193,276,211,291
pideo7-3.jpg,640,480,car,306,270,322,289
pideo7-3.jpg,640,480,motorbike,132,306,152,333
pideo7-3.jpg,640,480,motorbike,366,281,378,304
pideo7-3.jpg,640,480,motorbike,340,271,349,288
pideo7-3.jpg,640,480,motorbike,331,260,339,276
pideo7-3.jpg,640,480,car,246,395,325,480
pideo7-30.jpg,640,480,car,62,347,130,391
pideo7-30.jpg,640,480,car,139,294,175,326
pideo7-30.jpg,640,480,car,234,294,294,324
pideo7-30.jpg,640,480,car,228,266,248,282
pideo7-30.jpg,640,480,car,227,258,238,268
pideo7-30.jpg,640,480,car,295,275,315,299
pideo7-30.jpg,640,480,car,282,272,302,292
pideo7-30.jpg,640,480,car,307,267,327,288
pideo7-30.jpg,640,480,car,334,269,356,292
pideo7-30.jpg,640,480,motorbike,352,285,363,302
pideo7-30.jpg,640,480,motorbike,358,271,367,293
pideo7-30.jpg,640,480,motorbike,73,319,93,353
pideo7-4.jpg,640,480,car,297,322,339,374
pideo7-4.jpg,640,480,car,281,290,310,325
pideo7-4.jpg,640,480,car,306,270,327,291
pideo7-4.jpg,640,480,car,151,287,186,312
pideo7-4.jpg,640,480,car,193,271,214,289
pideo7-4.jpg,640,480,motorbike,372,284,387,307
pideo7-4.jpg,640,480,motorbike,343,274,356,300
pideo7-4.jpg,640,480,motorbike,150,303,165,323
pideo7-4.jpg,640,480,motorbike,334,260,344,283
pideo7-5.jpg,640,480,car,292,337,342,403
pideo7-5.jpg,640,480,car,276,294,308,333
pideo7-5.jpg,640,480,car,306,275,333,302
pideo7-5.jpg,640,480,car,194,270,214,291
pideo7-5.jpg,640,480,car,154,285,188,308
pideo7-5.jpg,640,480,motorbike,163,296,178,317
pideo7-5.jpg,640,480,motorbike,381,289,395,311
pideo7-5.jpg,640,480,motorbike,350,277,363,301
pideo7-5.jpg,640,480,motorbike,337,264,348,281
pideo7-6.jpg,640,480,car,289,361,351,431
pideo7-6.jpg,640,480,car,273,303,312,345
pideo7-6.jpg,640,480,car,310,279,335,306
pideo7-6.jpg,640,480,motorbike,390,295,403,323
pideo7-6.jpg,640,480,motorbike,356,286,371,310
pideo7-6.jpg,640,480,car,196,269,215,291
pideo7-6.jpg,640,480,car,156,283,192,305
pideo7-6.jpg,640,480,motorbike,176,293,188,313
pideo7-6.jpg,640,480,truck,489,284,552,328
