0 0.025390625 0.0390625 0.05078125 0.078125
0 0.017578125 0.0234375 0.03515625 0.046875
0 0.01953125 0.020833333333333332 0.0390625 0.041666666666666664
0 0.013671875 0.015625 0.02734375 0.03125
0 0.013671875 0.010416666666666666 0.02734375 0.020833333333333332
1 0.01953125 0.044270833333333336 0.0390625 0.08854166666666667
1 0.013671875 0.036458333333333336 0.02734375 0.07291666666666667
1 0.009765625 0.026041666666666668 0.01953125 0.052083333333333336
1 0.009765625 0.026041666666666668 0.01953125 0.052083333333333336
1 0.0078125 0.020833333333333332 0.015625 0.041666666666666664
1 0.0078125 0.020833333333333332 0.015625 0.041666666666666664
1 0.01171875 0.020833333333333332 0.0234375 0.041666666666666664
1 0.0078125 0.018229166666666668 0.015625 0.036458333333333336
