0 0.0625 0.052083333333333336 0.125 0.10416666666666667
1 0.02734375 0.057291666666666664 0.0546875 0.11458333333333333
1 0.017578125 0.049479166666666664 0.03515625 0.09895833333333333
1 0.015625 0.033854166666666664 0.03125 0.06770833333333333
1 0.013671875 0.03125 0.02734375 0.0625
0 0.0234375 0.03125 0.046875 0.0625
