0 0.02734375 0.0390625 0.0546875 0.078125
0 0.041015625 0.0390625 0.08203125 0.078125
0 0.029296875 0.03125 0.05859375 0.0625
0 0.017578125 0.020833333333333332 0.03515625 0.041666666666666664
0 0.03515625 0.03125 0.0703125 0.0625
2 0.05078125 0.0390625 0.1015625 0.078125
