%YAML 1.1
%TAG !u! tag:unity3d.com,2011:
--- !u!114 &11400000
MonoBehaviour:
  m_ObjectHideFlags: 0
  m_CorrespondingSourceObject: {fileID: 0}
  m_PrefabInstance: {fileID: 0}
  m_PrefabAsset: {fileID: 0}
  m_GameObject: {fileID: 0}
  m_Enabled: 1
  m_EditorHideFlags: 0
  m_Script: {fileID: 11500000, guid: 2414cda2bf0add247bcf69603cfbe8db, type: 3}
  m_Name: Level Config
  m_EditorClassIdentifier: 
  levels:
  - id: 
    maxLives: 20
    startingGold: 20
    wavesInterval: 10
    enemyWaves:
    - id: 
      enemies:
      - {fileID: 540993556267286711, guid: 96d338401587bb14eb874b3a8609167f, type: 3}
      - {fileID: 540993556267286711, guid: 96d338401587bb14eb874b3a8609167f, type: 3}
      - {fileID: 1017100021812723116, guid: ed9bfbce83f70ed43b571d6a32ab5a83, type: 3}
      - {fileID: 540993556267286711, guid: 96d338401587bb14eb874b3a8609167f, type: 3}
      - {fileID: 540993556267286711, guid: 96d338401587bb14eb874b3a8609167f, type: 3}
      - {fileID: 1017100021812723116, guid: ed9bfbce83f70ed43b571d6a32ab5a83, type: 3}
      - {fileID: 540993556267286711, guid: 96d338401587bb14eb874b3a8609167f, type: 3}
      - {fileID: 1017100021812723116, guid: ed9bfbce83f70ed43b571d6a32ab5a83, type: 3}
      - {fileID: 540993556267286711, guid: 96d338401587bb14eb874b3a8609167f, type: 3}
      - {fileID: 1017100021812723116, guid: ed9bfbce83f70ed43b571d6a32ab5a83, type: 3}
      interval: 7
      goldPrize: 3
      scorePrize: 1
    - id: 
      enemies:
      - {fileID: 540993556267286711, guid: 96d338401587bb14eb874b3a8609167f, type: 3}
      - {fileID: 1017100021812723116, guid: ed9bfbce83f70ed43b571d6a32ab5a83, type: 3}
      - {fileID: 540993556267286711, guid: 96d338401587bb14eb874b3a8609167f, type: 3}
      - {fileID: 540993556267286711, guid: 96d338401587bb14eb874b3a8609167f, type: 3}
      - {fileID: 1017100021812723116, guid: ed9bfbce83f70ed43b571d6a32ab5a83, type: 3}
      - {fileID: 540993556267286711, guid: 96d338401587bb14eb874b3a8609167f, type: 3}
      - {fileID: 540993556267286711, guid: 96d338401587bb14eb874b3a8609167f, type: 3}
      - {fileID: 540993556267286711, guid: 96d338401587bb14eb874b3a8609167f, type: 3}
      - {fileID: 1017100021812723116, guid: ed9bfbce83f70ed43b571d6a32ab5a83, type: 3}
      - {fileID: 1017100021812723116, guid: ed9bfbce83f70ed43b571d6a32ab5a83, type: 3}
      - {fileID: 540993556267286711, guid: 96d338401587bb14eb874b3a8609167f, type: 3}
      - {fileID: 1017100021812723116, guid: ed9bfbce83f70ed43b571d6a32ab5a83, type: 3}
      - {fileID: 540993556267286711, guid: 96d338401587bb14eb874b3a8609167f, type: 3}
      - {fileID: 540993556267286711, guid: 96d338401587bb14eb874b3a8609167f, type: 3}
      - {fileID: 540993556267286711, guid: 96d338401587bb14eb874b3a8609167f, type: 3}
      - {fileID: 1017100021812723116, guid: ed9bfbce83f70ed43b571d6a32ab5a83, type: 3}
      - {fileID: 540993556267286711, guid: 96d338401587bb14eb874b3a8609167f, type: 3}
      - {fileID: 540993556267286711, guid: 96d338401587bb14eb874b3a8609167f, type: 3}
      - {fileID: 540993556267286711, guid: 96d338401587bb14eb874b3a8609167f, type: 3}
      - {fileID: 540993556267286711, guid: 96d338401587bb14eb874b3a8609167f, type: 3}
      interval: 5
      goldPrize: 3
      scorePrize: 1
    currentLives: 0
    currentWaveIndex: 0
    currentGameSpeed: 0
    currentLevelState: 0
