{
    "name": "TowerDefence.Interactor",
    "rootNamespace": "TowerDefence",
    "references": [
        "GUID:4f166dff52f26394ca4f3e7e43edae7a",
        "GUID:4c3c63a5674f821478ad644ea886f68e",
        "GUID:e214f8fbd2259eb4ab0c4a1e353a9d80",
        "GUID:d0e1a4e7e605c1a44939672e627a7d8e",
        "GUID:16f871fa8abb8fd4f86fbfcc79a485ba",
        "GUID:f97002570b042f74b88f31928b2a6567",
        "GUID:d6db6fa57efe6b741a4053789ab00f49",
        "GUID:0d8beb7f090555447a6cf5ce9e54dbb4"
    ],
    "includePlatforms": [],
    "excludePlatforms": [],
    "allowUnsafeCode": false,
    "overrideReferences": false,
    "precompiledReferences": [],
    "autoReferenced": true,
    "defineConstraints": [],
    "versionDefines": [],
    "noEngineReferences": false
}