%YAML 1.1
%TAG !u! tag:unity3d.com,2011:
--- !u!114 &11400000
MonoBehaviour:
  m_ObjectHideFlags: 0
  m_CorrespondingSourceObject: {fileID: 0}
  m_PrefabInstance: {fileID: 0}
  m_PrefabAsset: {fileID: 0}
  m_GameObject: {fileID: 0}
  m_Enabled: 1
  m_EditorHideFlags: 0
  m_Script: {fileID: 11500000, guid: 27cf09f660814a3985180aa9dd53dbea, type: 3}
  m_Name: Tower Config
  m_EditorClassIdentifier: 
  towerPrefabs:
  - {fileID: 6367739255087059427, guid: 822ebf417fdb9504fb703185d6028cc1, type: 3}
  - {fileID: 3904949210434296418, guid: 128cc72c5f47bd348adeb8098acf664f, type: 3}
