%YAML 1.1
%TAG !u! tag:unity3d.com,2011:
--- !u!114 &11400000
MonoBehaviour:
  m_ObjectHideFlags: 0
  m_CorrespondingSourceObject: {fileID: 0}
  m_PrefabInstance: {fileID: 0}
  m_PrefabAsset: {fileID: 0}
  m_GameObject: {fileID: 0}
  m_Enabled: 1
  m_EditorHideFlags: 0
  m_Script: {fileID: 11500000, guid: 1c6a9aba485f44e58851b4ade5f66e1a, type: 3}
  m_Name: Enemy Soldier Config
  m_EditorClassIdentifier: 
  soldiers:
  - {fileID: 540993556267286711, guid: 96d338401587bb14eb874b3a8609167f, type: 3}
  - {fileID: 1017100021812723116, guid: ed9bfbce83f70ed43b571d6a32ab5a83, type: 3}
