Resources
{

"materials/avt/5e-1.vtf"  "file"
"materials/avt/5e-2.vtf"  "file"
"materials/avt/5e-3.vtf"  "file"
"materials/avt/9e-1.vmt"  "file"
"materials/avt/9e-1.vtf"  "file"
"materials/avt/9e-11.vmt"  "file"
"materials/avt/9e-11.vtf"  "file"
"materials/avt/9e-12.vmt"  "file"
"materials/avt/9e-12.vtf"  "file"
"materials/avt/9e-2.vmt"  "file"
"materials/avt/9e-2.vtf"  "file"
"materials/avt/9e-3.vmt"  "file"
"materials/avt/9e-3.vtf"  "file"
"materials/avt/9e-4.vmt"  "file"
"materials/avt/9e-4.vtf"  "file"
"materials/avt/9e-5.vmt"  "file"
"materials/avt/9e-5.vtf"  "file"
"materials/avt/9e-6.vmt"  "file"
"materials/avt/9e-6.vtf"  "file"
"materials/avt/9e-7.vmt"  "file"
"materials/avt/9e-7.vtf"  "file"
"materials/avt/9e-8.vmt"  "file"
"materials/avt/9e-8.vtf"  "file"
"materials/avt/9e-podval.vmt"  "file"
"materials/avt/9e-podval.vtf"  "file"
"materials/avt/azs.vmt"  "file"
"materials/avt/azs.vtf"  "file"
"materials/avt/dispatchmetro.vmt"  "file"
"materials/avt/dispatchmetro.vtf"  "file"
"materials/avt/doska.vmt"  "file"
"materials/avt/doska.vtf"  "file"
"materials/avt/granit.vmt"  "file"
"materials/avt/granit.vtf"  "file"
"materials/avt/hospital.vmt"  "file"
"materials/avt/hospital.vtf"  "file"
"materials/avt/leninapl.vmt"  "file"
"materials/avt/leninapl.vtf"  "file"
"materials/avt/lift_panel.vmt"  "file"
"materials/avt/lift_panel.vtf"  "file"
"materials/avt/marsh.vmt"  "file"
"materials/avt/marsh.vtf"  "file"
"materials/avt/metromosk.vmt"  "file"
"materials/avt/metromosk.vtf"  "file"
"materials/avt/moskhw.vmt"  "file"
"materials/avt/moskhw.vtf"  "file"
"materials/avt/moskovskay.vmt"  "file"
"materials/avt/moskovskay.vtf"  "file"
"materials/avt/moskovskayshema.vmt"  "file"
"materials/avt/moskovskayshema.vtf"  "file"
"materials/avt/p49.vtf"  "file"
"materials/avt/p49add.vtf"  "file"
"materials/avt/p68balcony.vtf"  "file"
"materials/avt/p68_stena.vtf"  "file"
"materials/avt/p68_torec.vtf"  "file"
"materials/avt/padik.vtf"  "file"
"materials/avt/pllenina.vmt"  "file"
"materials/avt/pllenina.vtf"  "file"
"materials/avt/plleninashema.vmt"  "file"
"materials/avt/plleninashema.vtf"  "file"
"materials/avt/podjem.vmt"  "file"
"materials/avt/podjem.vtf"  "file"
"materials/avt/pohmelhw.vmt"  "file"
"materials/avt/pohmelhw.vtf"  "file"
"materials/avt/police.vmt"  "file"
"materials/avt/police.vtf"  "file"
"materials/avt/rezhim.vmt"  "file"
"materials/avt/rezhim.vtf"  "file"
"materials/avt/rezhimend.vmt"  "file"
"materials/avt/rezhimend.vtf"  "file"
"materials/avt/rozysk.vmt"  "file"
"materials/avt/rozysk.vtf"  "file"
"materials/avt/rtrmhw.vmt"  "file"
"materials/avt/rtrmhw.vtf"  "file"
"materials/avt/sberbank.vmt"  "file"
"materials/avt/sberbank.vtf"  "file"
"materials/avt/shemanew.vmt"  "file"
"materials/avt/shemanew.vtf"  "file"
"materials/avt/shkolka.vmt"  "file"
"materials/avt/shkolka.vtf"  "file"
"materials/avt/street1.vmt"  "file"
"materials/avt/street1.vtf"  "file"
"materials/avt/street10.vmt"  "file"
"materials/avt/street10.vtf"  "file"
"materials/avt/street2.vmt"  "file"
"materials/avt/street2.vtf"  "file"
"materials/avt/street3.vmt"  "file"
"materials/avt/street3.vtf"  "file"
"materials/avt/street4.vmt"  "file"
"materials/avt/street4.vtf"  "file"
"materials/avt/street5.vmt"  "file"
"materials/avt/street5.vtf"  "file"
"materials/avt/street6.vmt"  "file"
"materials/avt/street6.vtf"  "file"
"materials/avt/street7.vmt"  "file"
"materials/avt/street7.vtf"  "file"
"materials/avt/street8.vmt"  "file"
"materials/avt/street8.vtf"  "file"
"materials/avt/street9.vmt"  "file"
"materials/avt/street9.vtf"  "file"
"materials/avt/streetfekal.vmt"  "file"
"materials/avt/streetfekal.vtf"  "file"
"materials/avt/streetotmor.vmt"  "file"
"materials/avt/streetotmor.vtf"  "file"
"materials/avt/streetpizda.vmt"  "file"
"materials/avt/streetpizda.vtf"  "file"
"materials/avt/streetplenina.vmt"  "file"
"materials/avt/streetplenina.vtf"  "file"
"materials/avt/streetpodzpere.vmt"  "file"
"materials/avt/streetpodzpere.vtf"  "file"
"materials/avt/streetpohmel.vmt"  "file"
"materials/avt/streetpohmel.vtf"  "file"
"materials/avt/streetteplo.vmt"  "file"
"materials/avt/streetteplo.vtf"  "file"
"materials/avt/streetvygreb.vmt"  "file"
"materials/avt/streetvygreb.vtf"  "file"
"materials/avt/streetzhuzha.vmt"  "file"
"materials/avt/streetzhuzha.vtf"  "file"
"materials/avt/svoloch.vmt"  "file"
"materials/avt/svoloch.vtf"  "file"
"materials/avt/tatarin.vmt"  "file"
"materials/avt/tatarin.vtf"  "file"
"materials/avt/train.vmt"  "file"
"materials/avt/train.vtf"  "file"
"materials/avt/tronen.vmt"  "file"
"materials/avt/tronen.vtf"  "file"
"materials/avt/zhutp.vmt"  "file"
"materials/avt/zhutp.vtf"  "file"
"materials/avt/zhuzadepo.vmt"  "file"
"materials/avt/zhuzadepo.vtf"  "file"
"materials/avt/zhuzhahw.vmt"  "file"
"materials/avt/zhuzhahw.vtf"  "file"
"materials/buildings/stena_1.vtf"  "file"
"materials/buildings/wall_1.vtf"  "file"
"materials/custom/plaster/border.vtf"  "file"
"materials/custom/plaster/metal3.vmt"  "file"
"materials/custom/plaster/metal3.vtf"  "file"
"materials/custom/plaster/prop_signs.vtf"  "file"
"materials/custom/plaster/prop_ventstack_01.vtf"  "file"
"materials/custom/plaster/roof_schiffer_01.vmt"  "file"
"materials/custom/plaster/roof_schiffer_01.vtf"  "file"
"materials/custom/plaster/roof_schiffer_01_n.vtf"  "file"
"materials/custom/plaster/wall_orange_01.vtf"  "file"
"materials/custom/plaster/wall_orange_02.vtf"  "file"
"materials/custom/plaster/wall_yellow_01.vtf"  "file"
"materials/custom/plaster/wall_yellow_02.vtf"  "file"
"materials/custom/tilewalls/wind_gr.vmt"  "file"
"materials/custom/tilewalls/wind_gr.vtf"  "file"
"materials/custom/tilewalls/wind_gr01.vmt"  "file"
"materials/custom/tilewalls/wind_gr01.vtf"  "file"
"materials/custom/tilewalls/wind_gr10.vtf"  "file"
"materials/custom/tile_concrete/gr_11.vtf"  "file"
"materials/custom/tile_concrete/gr_3.vmt"  "file"
"materials/custom/tile_concrete/gr_3.vtf"  "file"
"materials/custom/windows/wind_brown.vtf"  "file"
"materials/custom/windows/wind_gr04.vtf"  "file"
"materials/customtext/gc textures/carpet/blue_carpet01.vmt"  "file"
"materials/customtext/gc textures/carpet/blue_carpet01.vtf"  "file"
"materials/customtext/gc textures/carpet/blue_carpet01_normal.vtf"  "file"
"materials/customtext/gc textures/carpet/green_carpet01.vmt"  "file"
"materials/customtext/gc textures/carpet/green_carpet01.vtf"  "file"
"materials/customtext/gc textures/carpet/green_carpet01_normal.vtf"  "file"
"materials/customtext/gc textures/carpet/red_carpet01.vmt"  "file"
"materials/customtext/gc textures/carpet/red_carpet01.vtf"  "file"
"materials/customtext/gc textures/carpet/red_carpet01_normal.vtf"  "file"
"materials/customtext/gc textures/carpet/yellow_carpet01.vmt"  "file"
"materials/customtext/gc textures/carpet/yellow_carpet01.vtf"  "file"
"materials/customtext/gc textures/carpet/yellow_carpet01_normal.vtf"  "file"
"materials/customtext/gc textures/roofs/roof_ceramic02.vmt"  "file"
"materials/customtext/gc textures/roofs/roof_ceramic02.vtf"  "file"
"materials/customtext/gc textures/roofs/roof_ceramic02_normal.vtf"  "file"
"materials/customtext/gc textures/roofs/roof_slate02.vmt"  "file"
"materials/customtext/gc textures/roofs/roof_slate02.vtf"  "file"
"materials/customtext/gc textures/roofs/roof_slate02_normal.vtf"  "file"
"materials/customtext/gc textures/tile/tile_medium01.vmt"  "file"
"materials/customtext/gc textures/tile/tile_medium01.vtf"  "file"
"materials/customtext/gc textures/tile/tile_medium01_normal.vtf"  "file"
"materials/customtext/gc textures/tile/tile_medium02.vmt"  "file"
"materials/customtext/gc textures/tile/tile_medium02.vtf"  "file"
"materials/customtext/gc textures/tile/tile_medium02_normal.vtf"  "file"
"materials/customtext/gc textures/tile/tile_medium05.vmt"  "file"
"materials/customtext/gc textures/tile/tile_medium05.vtf"  "file"
"materials/customtext/gc textures/tile/tile_medium05_normal.vtf"  "file"
"materials/customtext/gc textures/tile/tile_medium06.vmt"  "file"
"materials/customtext/gc textures/tile/tile_medium06.vtf"  "file"
"materials/customtext/gc textures/tile/tile_medium06_normal.vtf"  "file"
"materials/customtext/gc textures/tile/tile_small01.vmt"  "file"
"materials/customtext/gc textures/tile/tile_small01.vtf"  "file"
"materials/customtext/gc textures/tile/tile_small01_normal.vtf"  "file"
"materials/customtext/gc textures/tile/tile_small04.vmt"  "file"
"materials/customtext/gc textures/tile/tile_small04.vtf"  "file"
"materials/customtext/gc textures/tile/tile_small04_normal.vtf"  "file"
"materials/customtext/gc textures/tile/tile_small05.vmt"  "file"
"materials/customtext/gc textures/tile/tile_small05.vtf"  "file"
"materials/customtext/gc textures/tile/tile_small05_normal.vtf"  "file"
"materials/customtext/gc textures/tile/tile_small07.vmt"  "file"
"materials/customtext/gc textures/tile/tile_small07.vtf"  "file"
"materials/customtext/gc textures/tile/tile_small07_normal.vtf"  "file"
"materials/man/bbicotka/9f_shtukaturka.vmt"  "file"
"materials/man/bbicotka/9f_shtukaturka.vtf"  "file"
"materials/man/bbicotka/cstrike_ce2x099.vmt"  "file"
"materials/man/bbicotka/cstrike_ce2x099.vtf"  "file"
"materials/man/bbicotka/cstrike_cj2b01.vmt"  "file"
"materials/man/bbicotka/cstrike_cj2b01.vtf"  "file"
"materials/man/bbicotka/POCHT_YASHIKI2.vmt"  "file"
"materials/man/bbicotka/pocht_yashiki2.vtf"  "file"
"materials/man/petergof/inside_lift_buttons_1-1.vmt"  "file"
"materials/man/petergof/inside_lift_buttons_1-1.vtf"  "file"
"materials/man/petergof/inside_lift_button_1-1.vmt"  "file"
"materials/man/petergof/inside_lift_button_1-1.vtf"  "file"
"materials/man/petergof/inside_lift_door_1-1.vmt"  "file"
"materials/man/petergof/inside_lift_door_1-1.vtf"  "file"
"materials/man/petergof/inside_lift_door_2-1.vmt"  "file"
"materials/man/petergof/inside_lift_door_2-1.vtf"  "file"
"materials/man/petergof/inside_lift_floor_1-1.vmt"  "file"
"materials/man/petergof/inside_lift_floor_1-1.vtf"  "file"
"materials/man/petergof/inside_lift_rules_2-1.vmt"  "file"
"materials/man/petergof/inside_lift_rules_2-1.vtf"  "file"
"materials/man/petergof/inside_lift_wall_2-1.vmt"  "file"
"materials/man/petergof/inside_lift_wall_2-1.vtf"  "file"
"materials/man/rf/beton_fasad_006.vmt"  "file"
"materials/man/rf/beton_fasad_006.vtf"  "file"
"materials/man/rf/beton_fasad_006_normal.vtf"  "file"
"materials/man/rf/beton_fasad_016.vtf"  "file"
"materials/man/rf/beton_fasad_016_normal.vtf"  "file"
"materials/man/rf/beton_fasad_017.vmt"  "file"
"materials/man/rf/beton_fasad_017.vtf"  "file"
"materials/man/rf/beton_fasad_017_mask.vtf"  "file"
"materials/man/rf/beton_fasad_018.vmt"  "file"
"materials/man/rf/beton_fasad_018.vtf"  "file"
"materials/man/rf/beton_fasad_018_mask.vtf"  "file"
"materials/man/rf/beton_fasad_020.vtf"  "file"
"materials/man/rf/beton_fasad_020_mask.vtf"  "file"
"materials/man/rf/beton_fasad_021.vtf"  "file"
"materials/man/rf/beton_fasad_021_mask.vtf"  "file"
"materials/man/rf/beton_fasad_022.vtf"  "file"
"materials/man/rf/beton_fasad_022_mask.vtf"  "file"
"materials/man/rf/beton_fasad_023.vtf"  "file"
"materials/man/rf/beton_fasad_023_mask.vtf"  "file"
"materials/man/rf/beton_fasad_024.vtf"  "file"
"materials/man/rf/beton_fasad_024_normal.vtf"  "file"
"materials/man/rf/beton_fasad_026.vtf"  "file"
"materials/man/rf/beton_fasad_026_normal.vtf"  "file"
"materials/man/rf/beton_fasad_027.vtf"  "file"
"materials/man/rf/beton_fasad_027_normal.vtf"  "file"
"materials/man/rf/beton_fasad_029.vtf"  "file"
"materials/man/rf/beton_fasad_029_normal.vtf"  "file"
"materials/man/rf/beton_fasad_031.vtf"  "file"
"materials/man/rf/beton_fasad_031_mask.vtf"  "file"
"materials/man/rf/beton_fasad_032.vtf"  "file"
"materials/man/rf/beton_fasad_032_mask.vtf"  "file"
"materials/man/rf/beton_fasad_034.vtf"  "file"
"materials/man/rf/beton_fasad_037.vtf"  "file"
"materials/man/rf/beton_fasad_037_mask.vtf"  "file"
"materials/man/rf/beton_fasad_042.vmt"  "file"
"materials/man/rf/beton_fasad_042.vtf"  "file"
"materials/man/rf/beton_fasad_042_normal.vtf"  "file"
"materials/man/rf/beton_fasad_043.vmt"  "file"
"materials/man/rf/beton_fasad_043.vtf"  "file"
"materials/man/rf/beton_fasad_043_mask.vtf"  "file"
"materials/man/rf/beton_fasad_045.vmt"  "file"
"materials/man/rf/beton_fasad_045.vtf"  "file"
"materials/man/rf/beton_fasad_045_mask.vtf"  "file"
"materials/man/rf/beton_fasad_049.vmt"  "file"
"materials/man/rf/beton_fasad_049.vtf"  "file"
"materials/man/rf/beton_fasad_049_mask.vtf"  "file"
"materials/man/rf/beton_fasad_050.vtf"  "file"
"materials/man/rf/beton_fasad_052.vtf"  "file"
"materials/man/rf/beton_fasad_053.vtf"  "file"
"materials/man/rf/beton_fasad_054.vtf"  "file"
"materials/man/rf/beton_fasad_056.vtf"  "file"
"materials/man/rf/beton_fasad_057.vtf"  "file"
"materials/man/rf/beton_fasad_059.vtf"  "file"
"materials/man/rf/beton_fasad_060.vtf"  "file"
"materials/man/rf/beton_fasad_062.vtf"  "file"
"materials/man/rf/beton_fasad_062_mask.vtf"  "file"
"materials/man/rf/beton_fasad_063.vtf"  "file"
"materials/man/rf/beton_fasad_063_mask.vtf"  "file"
"materials/man/rf/beton_fasad_064.vtf"  "file"
"materials/man/rf/beton_fasad_068.vtf"  "file"
"materials/man/rf/beton_fasad_070.vtf"  "file"
"materials/man/rf/beton_fasad_070_normal.vtf"  "file"
"materials/man/rf/beton_fasad_073.vtf"  "file"
"materials/man/rf/beton_fasad_078.vtf"  "file"
"materials/man/rf/beton_fasad_078_normal.vtf"  "file"
"materials/man/rf/beton_fasad_079.vtf"  "file"
"materials/man/rf/beton_fasad_092.vmt"  "file"
"materials/man/rf/beton_fasad_092.vtf"  "file"
"materials/man/rf/beton_fasad_092_normal.vtf"  "file"
"materials/man/rf/beton_fasad_094.vtf"  "file"
"materials/man/rf/beton_fasad_094_mask.vtf"  "file"
"materials/man/rf/beton_fasad_095.vtf"  "file"
"materials/man/rf/beton_fasad_095_mask.vtf"  "file"
"materials/man/rf/beton_fasad_096.vmt"  "file"
"materials/man/rf/beton_fasad_096.vtf"  "file"
"materials/man/rf/beton_fasad_096_mask.vtf"  "file"
"materials/man/rf/beton_fasad_097.vtf"  "file"
"materials/man/rf/beton_fasad_097_mask.vtf"  "file"
"materials/man/rf/beton_fasad_098.vtf"  "file"
"materials/man/rf/beton_fasad_098_mask.vtf"  "file"
"materials/man/rf/beton_fasad_099.vtf"  "file"
"materials/man/rf/beton_fasad_099_mask.vtf"  "file"
"materials/man/rf/beton_fasad_100.vtf"  "file"
"materials/man/rf/beton_fasad_100_mask.vtf"  "file"
"materials/man/rf/beton_fasad_108.vtf"  "file"
"materials/man/rf/beton_fasad_108_normal.vtf"  "file"
"materials/man/rf/beton_fasad_117.vtf"  "file"
"materials/man/rf/beton_fasad_117_mask.vtf"  "file"
"materials/man/rf/beton_fasad_119.vtf"  "file"
"materials/man/rf/beton_fasad_119_mask.vtf"  "file"
"materials/man/rf/beton_fasad_124.vtf"  "file"
"materials/man/rf/beton_fasad_124_normal.vtf"  "file"
"materials/man/rf/beton_fasad_126.vtf"  "file"
"materials/man/rf/beton_fasad_126_normal.vtf"  "file"
"materials/man/rf/beton_fasad_138.vtf"  "file"
"materials/man/rf/beton_fasad_138_mask.vtf"  "file"
"materials/man/rf/beton_fasad_141.vmt"  "file"
"materials/man/rf/beton_fasad_141.vtf"  "file"
"materials/man/rf/beton_fasad_141_mask.vtf"  "file"
"materials/man/rf/beton_fasad_142.vmt"  "file"
"materials/man/rf/beton_fasad_142.vtf"  "file"
"materials/man/rf/beton_fasad_142_mask.vtf"  "file"
"materials/man/rf/beton_fasad_143.vmt"  "file"
"materials/man/rf/beton_fasad_143.vtf"  "file"
"materials/man/rf/beton_fasad_143_normal.vtf"  "file"
"materials/man/rf/beton_fasad_144.vmt"  "file"
"materials/man/rf/beton_fasad_144.vtf"  "file"
"materials/man/rf/beton_fasad_144_normal.vtf"  "file"
"materials/man/rf/BET_BORDUR_005A.vmt"  "file"
"materials/man/rf/bet_bordur_005a.vtf"  "file"
"materials/man/rf/bet_bordur_005a_normal.vtf"  "file"
"materials/man/rf/BET_CEILING_01A.vmt"  "file"
"materials/man/rf/bet_ceiling_01a.vtf"  "file"
"materials/man/rf/bet_ceiling_01a_normal.vtf"  "file"
"materials/man/rf/bet_dom_base_02.vtf"  "file"
"materials/man/rf/bet_dom_base_05.vtf"  "file"
"materials/man/rf/bet_dom_base_05_normal.vtf"  "file"
"materials/man/rf/bet_dom_base_09.vtf"  "file"
"materials/man/rf/bet_dom_base_09_normal.vtf"  "file"
"materials/man/rf/BET_DOM_BASE_10.vmt"  "file"
"materials/man/rf/bet_dom_base_10.vtf"  "file"
"materials/man/rf/bet_dom_base_10_normal.vtf"  "file"
"materials/man/rf/bet_dom_base_11.vtf"  "file"
"materials/man/rf/bet_dom_base_11_normal.vtf"  "file"
"materials/man/rf/BET_FLOOR_RF_05.vmt"  "file"
"materials/man/rf/bet_floor_rf_05.vtf"  "file"
"materials/man/rf/bet_floor_rf_05_normal.vtf"  "file"
"materials/man/rf/bet_floor_rf_10.vtf"  "file"
"materials/man/rf/bet_floor_rf_10_normal.vtf"  "file"
"materials/man/rf/bet_floor_rf_12.vtf"  "file"
"materials/man/rf/bet_floor_rf_12_normal.vtf"  "file"
"materials/man/rf/bet_floor_rf_22.vtf"  "file"
"materials/man/rf/bet_floor_rf_22_normal.vtf"  "file"
"materials/man/rf/bet_garaz_rf_02.vtf"  "file"
"materials/man/rf/bet_garaz_rf_02_normal.vtf"  "file"
"materials/man/rf/BET_GARAZ_RF_04.vmt"  "file"
"materials/man/rf/bet_garaz_rf_04.vtf"  "file"
"materials/man/rf/bet_garaz_rf_04_normal.vtf"  "file"
"materials/man/rf/bet_plita_rf_08.vtf"  "file"
"materials/man/rf/bet_plita_rf_08_normal.vtf"  "file"
"materials/man/rf/BET_ROOF_RF_001.vmt"  "file"
"materials/man/rf/bet_roof_rf_001.vtf"  "file"
"materials/man/rf/bet_roof_rf_001_normal.vtf"  "file"
"materials/man/rf/BET_ROOF_RF_002.vmt"  "file"
"materials/man/rf/bet_roof_rf_002.vtf"  "file"
"materials/man/rf/bet_roof_rf_002_normal.vtf"  "file"
"materials/man/rf/bet_vent_ATC_01.vtf"  "file"
"materials/man/rf/bet_vent_ATC_01_normal.vtf"  "file"
"materials/man/rf/bet_vent_ATC_02.vtf"  "file"
"materials/man/rf/bet_vent_ATC_02_normal.vtf"  "file"
"materials/man/rf/bet_wall_rf_11a.vtf"  "file"
"materials/man/rf/bet_wall_rf_11a_normal.vtf"  "file"
"materials/man/rf/bet_wall_rf_15a.vtf"  "file"
"materials/man/rf/bet_wall_rf_15a_normal.vtf"  "file"
"materials/man/rf/bet_wall_rf_17a.vmt"  "file"
"materials/man/rf/bet_wall_rf_17a.vtf"  "file"
"materials/man/rf/bet_wall_rf_17a_normal.vtf"  "file"
"materials/man/rf/bet_wall_rf_23a.vtf"  "file"
"materials/man/rf/bet_wall_rf_23a_normal.vtf"  "file"
"materials/man/rf/bet_wall_rf_30a.vmt"  "file"
"materials/man/rf/bet_wall_rf_30a.vtf"  "file"
"materials/man/rf/bet_wall_rf_30a_normal.vtf"  "file"
"materials/man/rf/bet_wall_rf_42a.vmt"  "file"
"materials/man/rf/bet_wall_rf_42a.vtf"  "file"
"materials/man/rf/bet_wall_rf_42a_normal.vtf"  "file"
"materials/man/rf/bet_zabor_rf_04_lod1.vmt"  "file"
"materials/man/rf/bet_zabor_rf_04_lod1.vtf"  "file"
"materials/man/rf/bet_zabor_rf_04_lod1_normal.vtf"  "file"
"materials/man/rf/bet_zabor_rf_07_lod1.vmt"  "file"
"materials/man/rf/bet_zabor_rf_07_lod1.vtf"  "file"
"materials/man/rf/bet_zabor_rf_07_lod1_normal.vtf"  "file"
"materials/man/rf/bet_zabor_rf_08.vmt"  "file"
"materials/man/rf/bet_zabor_rf_08.vtf"  "file"
"materials/man/rf/bet_zabor_rf_08_normal.vtf"  "file"
"materials/man/rf/bet_zabor_rf_10_lod1.vmt"  "file"
"materials/man/rf/bet_zabor_rf_10_lod1.vtf"  "file"
"materials/man/rf/bet_zabor_rf_10_lod1_normal.vtf"  "file"
"materials/man/rf/brick_red_rf_04.vmt"  "file"
"materials/man/rf/brick_red_rf_04.vtf"  "file"
"materials/man/rf/brick_red_rf_04_normal.vtf"  "file"
"materials/man/rf/brick_wall_0001.vmt"  "file"
"materials/man/rf/brick_wall_0001.vtf"  "file"
"materials/man/rf/brick_wall_0001_normal.vtf"  "file"
"materials/man/rf/brick_white_01a.vmt"  "file"
"materials/man/rf/brick_white_01a.vtf"  "file"
"materials/man/rf/brick_white_01a_normal.vtf"  "file"
"materials/man/rf/brick_white_01b.vmt"  "file"
"materials/man/rf/brick_white_01b.vtf"  "file"
"materials/man/rf/brick_white_03a.vmt"  "file"
"materials/man/rf/brick_white_03a.vtf"  "file"
"materials/man/rf/brick_white_03a_normal.vtf"  "file"
"materials/man/rf/conc_asphalt_01.vmt"  "file"
"materials/man/rf/conc_asphalt_01.vtf"  "file"
"materials/man/rf/conc_asphalt_01_normal.vtf"  "file"
"materials/man/rf/conc_asphalt_08.vmt"  "file"
"materials/man/rf/conc_asphalt_08.vtf"  "file"
"materials/man/rf/conc_asphalt_08_normal.vtf"  "file"
"materials/man/rf/glass_window_01.vmt"  "file"
"materials/man/rf/glass_window_01.vtf"  "file"
"materials/man/rf/glass_window_01_normal.vtf"  "file"
"materials/man/rf/glass_window_03a.vmt"  "file"
"materials/man/rf/glass_window_03a.vtf"  "file"
"materials/man/rf/glass_window_07.vmt"  "file"
"materials/man/rf/glass_window_07.vtf"  "file"
"materials/man/rf/glass_window_07_mask.vtf"  "file"
"materials/man/rf/glass_window_07_normal.vtf"  "file"
"materials/man/rf/glass_window_09.vmt"  "file"
"materials/man/rf/glass_window_09.vtf"  "file"
"materials/man/rf/glass_window_09a.vmt"  "file"
"materials/man/rf/glass_window_09a.vtf"  "file"
"materials/man/rf/glass_window_09_normal.vtf"  "file"
"materials/man/rf/glass_window_11.vmt"  "file"
"materials/man/rf/glass_window_11.vtf"  "file"
"materials/man/rf/glass_window_11_normal.vtf"  "file"
"materials/man/rf/glass_window_21a.vmt"  "file"
"materials/man/rf/glass_window_21a.vtf"  "file"
"materials/man/rf/glass_window_21_normal.vtf"  "file"
"materials/man/rf/GRASS_FOREST_01.vmt"  "file"
"materials/man/rf/grass_forest_01.vtf"  "file"
"materials/man/rf/GRND_GRAVEL_04A.vmt"  "file"
"materials/man/rf/grnd_gravel_04a.vtf"  "file"
"materials/man/rf/grnd_gravel_04a_normal.vtf"  "file"
"materials/man/rf/GRND_TRASH_002C.vmt"  "file"
"materials/man/rf/grnd_trash_002c.vtf"  "file"
"materials/man/rf/grnd_trash_002c_normal.vtf"  "file"
"materials/man/rf/GRND_TRASH_007A.vmt"  "file"
"materials/man/rf/grnd_trash_007a.vtf"  "file"
"materials/man/rf/grnd_trash_007a_normal.vtf"  "file"
"materials/man/rf/MET_BUTTON_001A.vmt"  "file"
"materials/man/rf/met_button_001a.vtf"  "file"
"materials/man/rf/met_button_001a_normal.vtf"  "file"
"materials/man/rf/MET_DOOR_RF_002.vmt"  "file"
"materials/man/rf/met_door_rf_002.vtf"  "file"
"materials/man/rf/met_door_rf_002_normal.vtf"  "file"
"materials/man/rf/MET_DOOR_RF_004.vmt"  "file"
"materials/man/rf/met_door_rf_004.vtf"  "file"
"materials/man/rf/met_door_rf_004_normal.vtf"  "file"
"materials/man/rf/MET_DOOR_RF_005.vmt"  "file"
"materials/man/rf/met_door_rf_005.vtf"  "file"
"materials/man/rf/met_door_rf_005_normal.vtf"  "file"
"materials/man/rf/met_door_rf_010.vtf"  "file"
"materials/man/rf/met_door_rf_010_normal.vtf"  "file"
"materials/man/rf/MET_DOOR_RF_011.vmt"  "file"
"materials/man/rf/met_door_rf_011.vtf"  "file"
"materials/man/rf/met_door_rf_011_normal.vtf"  "file"
"materials/man/rf/MET_DOOR_RF_012.vmt"  "file"
"materials/man/rf/met_door_rf_012.vtf"  "file"
"materials/man/rf/met_door_rf_012_normal.vtf"  "file"
"materials/man/rf/MET_DOOR_RF_015.vmt"  "file"
"materials/man/rf/met_door_rf_015.vtf"  "file"
"materials/man/rf/met_door_rf_015_normal.vtf"  "file"
"materials/man/rf/MET_DOOR_RF_018.vmt"  "file"
"materials/man/rf/met_door_rf_018.vtf"  "file"
"materials/man/rf/met_door_rf_018_normal.vtf"  "file"
"materials/man/rf/MET_DOOR_RF_019.vmt"  "file"
"materials/man/rf/met_door_rf_019.vtf"  "file"
"materials/man/rf/met_door_rf_019_normal.vtf"  "file"
"materials/man/rf/MET_DOOR_RF_021.vmt"  "file"
"materials/man/rf/met_door_rf_021.vtf"  "file"
"materials/man/rf/met_door_rf_021_normal.vtf"  "file"
"materials/man/rf/MET_DOOR_RF_022.vmt"  "file"
"materials/man/rf/met_door_rf_022.vtf"  "file"
"materials/man/rf/met_door_rf_022_normal.vtf"  "file"
"materials/man/rf/MET_DOOR_RF_025.vmt"  "file"
"materials/man/rf/met_door_rf_025.vtf"  "file"
"materials/man/rf/met_door_rf_025_normal.vtf"  "file"
"materials/man/rf/MET_FLOOR_RF_01.vmt"  "file"
"materials/man/rf/met_floor_rf_01.vtf"  "file"
"materials/man/rf/met_floor_rf_01_normal.vtf"  "file"
"materials/man/rf/met_garaz_rf_03.vtf"  "file"
"materials/man/rf/met_garaz_rf_03_normal.vtf"  "file"
"materials/man/rf/met_garaz_rf_04.vtf"  "file"
"materials/man/rf/met_garaz_rf_04_normal.vtf"  "file"
"materials/man/rf/met_garaz_rf_05.vtf"  "file"
"materials/man/rf/met_garaz_rf_05_normal.vtf"  "file"
"materials/man/rf/met_panel_rf_07.vtf"  "file"
"materials/man/rf/met_panel_rf_07_normal.vtf"  "file"
"materials/man/rf/met_panel_rf_09.vtf"  "file"
"materials/man/rf/MET_PANEL_RF_11.vmt"  "file"
"materials/man/rf/met_panel_rf_11.vtf"  "file"
"materials/man/rf/met_panel_rf_11_normal.vtf"  "file"
"materials/man/rf/met_panel_rf_14.vtf"  "file"
"materials/man/rf/met_panel_rf_14_normal.vtf"  "file"
"materials/man/rf/met_panel_rf_16.vtf"  "file"
"materials/man/rf/met_panel_rf_16_normal.vtf"  "file"
"materials/man/rf/met_panel_rf_22.vtf"  "file"
"materials/man/rf/met_panel_rf_22_normal.vtf"  "file"
"materials/man/rf/met_panel_rf_23.vtf"  "file"
"materials/man/rf/met_panel_rf_23_normal.vtf"  "file"
"materials/man/rf/MET_PANEL_RF_24.vmt"  "file"
"materials/man/rf/met_panel_rf_24.vtf"  "file"
"materials/man/rf/met_panel_rf_24_normal.vtf"  "file"
"materials/man/rf/MET_PANEL_RF_25.vmt"  "file"
"materials/man/rf/met_panel_rf_25.vtf"  "file"
"materials/man/rf/met_panel_rf_25_normal.vtf"  "file"
"materials/man/rf/met_panel_rf_26.vtf"  "file"
"materials/man/rf/met_panel_rf_26_normal.vtf"  "file"
"materials/man/rf/met_panel_rf_27.vtf"  "file"
"materials/man/rf/met_panel_rf_27_normal.vtf"  "file"
"materials/man/rf/met_panel_rf_28.vtf"  "file"
"materials/man/rf/met_panel_rf_28_normal.vtf"  "file"
"materials/man/rf/met_panel_rf_29.vtf"  "file"
"materials/man/rf/met_panel_rf_29_normal.vtf"  "file"
"materials/man/rf/MET_PANEL_RF_30.vmt"  "file"
"materials/man/rf/met_panel_rf_30.vtf"  "file"
"materials/man/rf/met_panel_rf_30_normal.vtf"  "file"
"materials/man/rf/met_panel_rf_34.vtf"  "file"
"materials/man/rf/met_panel_rf_34_normal.vtf"  "file"
"materials/man/rf/met_stop_rf_001.vtf"  "file"
"materials/man/rf/met_stop_rf_001_normal.vtf"  "file"
"materials/man/rf/met_stop_rf_002.vtf"  "file"
"materials/man/rf/met_stop_rf_002_normal.vtf"  "file"
"materials/man/rf/met_stop_rf_003.vtf"  "file"
"materials/man/rf/met_stop_rf_003_normal.vtf"  "file"
"materials/man/rf/met_stop_rf_004.vtf"  "file"
"materials/man/rf/MET_TRANSFOR_10.vmt"  "file"
"materials/man/rf/met_transfor_10.vtf"  "file"
"materials/man/rf/met_transfor_10_normal.vtf"  "file"
"materials/man/rf/met_transfor_11.vtf"  "file"
"materials/man/rf/met_transfor_11_normal.vtf"  "file"
"materials/man/rf/met_transfor_12.vtf"  "file"
"materials/man/rf/met_transfor_12_normal.vtf"  "file"
"materials/man/rf/met_transfor_13.vtf"  "file"
"materials/man/rf/met_transfor_13_normal.vtf"  "file"
"materials/man/rf/met_transven_02.vtf"  "file"
"materials/man/rf/met_transven_02_normal.vtf"  "file"
"materials/man/rf/MET_WALL_RF_007.vmt"  "file"
"materials/man/rf/met_wall_rf_007.vtf"  "file"
"materials/man/rf/met_wall_rf_007_normal.vtf"  "file"
"materials/man/rf/PLAST_WALL_06A1.vmt"  "file"
"materials/man/rf/plast_wall_06a1.vtf"  "file"
"materials/man/rf/PLAST_WALL_08A1.vmt"  "file"
"materials/man/rf/plast_wall_08a1.vtf"  "file"
"materials/man/rf/plast_wall_08a1_normal.vtf"  "file"
"materials/man/rf/PLAST_WALL_09A1.vmt"  "file"
"materials/man/rf/plast_wall_09a1.vtf"  "file"
"materials/man/rf/plast_wall_09a1_normal.vtf"  "file"
"materials/man/rf/tile_budkatr_01.vtf"  "file"
"materials/man/rf/tile_budkatr_01_normal.vtf"  "file"
"materials/man/rf/tile_budkatr_02.vtf"  "file"
"materials/man/rf/tile_budkatr_02_normal.vtf"  "file"
"materials/man/rf/tile_budkatr_03.vtf"  "file"
"materials/man/rf/tile_budkatr_03_normal.vtf"  "file"
"materials/man/rf/TILE_FLOOR_001A.vmt"  "file"
"materials/man/rf/tile_floor_001a.vtf"  "file"
"materials/man/rf/tile_floor_001a_normal.vtf"  "file"
"materials/man/rf/TILE_PLITKA_001.vmt"  "file"
"materials/man/rf/tile_plitka_001.vtf"  "file"
"materials/man/rf/tile_plitka_001_mask.vtf"  "file"
"materials/man/rf/tile_plitka_001_normal.vtf"  "file"
"materials/man/rf/TILE_WALL_RF_11.vmt"  "file"
"materials/man/rf/tile_wall_rf_11.vtf"  "file"
"materials/man/rf/tile_wall_rf_11_mask.vtf"  "file"
"materials/man/rf/tile_wall_rf_11_normal.vtf"  "file"
"materials/man/rf/WOOD_DOOR_RF_04.vmt"  "file"
"materials/man/rf/wood_door_rf_04.vtf"  "file"
"materials/man/rf/wood_door_rf_04_normal.vtf"  "file"
"materials/man/rf/WOOD_DOOR_RF_06.vmt"  "file"
"materials/man/rf/wood_door_rf_06.vtf"  "file"
"materials/man/rf/wood_door_rf_06_normal.vtf"  "file"
"materials/man/rf/WOOD_DOOR_RF_09.vmt"  "file"
"materials/man/rf/wood_door_rf_09.vtf"  "file"
"materials/man/rf/wood_door_rf_09_normal.vtf"  "file"
"materials/man/rf/WOOD_DOOR_RF_13.vmt"  "file"
"materials/man/rf/wood_door_rf_13.vtf"  "file"
"materials/man/rf/wood_door_rf_13_normal.vtf"  "file"
"materials/man/rf/WOOD_DOOR_RF_14.vmt"  "file"
"materials/man/rf/wood_door_rf_14.vtf"  "file"
"materials/man/rf/wood_door_rf_14_normal.vtf"  "file"
"materials/man/rf/WOOD_DOOR_RF_15.vmt"  "file"
"materials/man/rf/wood_door_rf_15.vtf"  "file"
"materials/man/rf/wood_door_rf_15_normal.vtf"  "file"
"materials/man/rf/WOOD_FLOOR_001A.vmt"  "file"
"materials/man/rf/wood_floor_001a.vtf"  "file"
"materials/man/rf/wood_floor_001a_normal.vtf"  "file"
"materials/man/rf/WOOD_PANEL_002A.vmt"  "file"
"materials/man/rf/wood_panel_002a.vtf"  "file"
"materials/man/rf/wood_panel_002a_normal.vtf"  "file"
"materials/man/rf/WOOD_ZABOR_001A.vmt"  "file"
"materials/man/rf/wood_zabor_001a.vtf"  "file"
"materials/man/rf/wood_zabor_001a_normal.vtf"  "file"
"materials/maps/rp_rashkinsk_release/brick/brickwall014f_0_0_0.vmt"  "file"
"materials/maps/rp_rashkinsk_release/c0_0_0.hdr.vtf"  "file"
"materials/maps/rp_rashkinsk_release/c0_0_0.vtf"  "file"
"materials/maps/rp_rashkinsk_release/concrete/concretefloor011a_c17_0_0_0.vmt"  "file"
"materials/maps/rp_rashkinsk_release/concrete/concretefloor013b_0_0_0.vmt"  "file"
"materials/maps/rp_rashkinsk_release/concrete/concretefloor028c_0_0_0.vmt"  "file"
"materials/maps/rp_rashkinsk_release/concrete/concretefloor033a_0_0_0.vmt"  "file"
"materials/maps/rp_rashkinsk_release/concrete/concretefloor033k_c17_0_0_0.vmt"  "file"
"materials/maps/rp_rashkinsk_release/concrete/concretefloor033o_0_0_0.vmt"  "file"
"materials/maps/rp_rashkinsk_release/concrete/concretefloor038b_0_0_0.vmt"  "file"
"materials/maps/rp_rashkinsk_release/cubemapdefault.hdr.vtf"  "file"
"materials/maps/rp_rashkinsk_release/cubemapdefault.vtf"  "file"
"materials/maps/rp_rashkinsk_release/dev/dev_blendmeasure_wvt_patch.vmt"  "file"
"materials/maps/rp_rashkinsk_release/de_chateau/wall04pnl_0_0_0.vmt"  "file"
"materials/maps/rp_rashkinsk_release/de_dust/tilefloor02_0_0_0.vmt"  "file"
"materials/maps/rp_rashkinsk_release/liquids/militiawater_depth_101.vmt"  "file"
"materials/maps/rp_rashkinsk_release/man/rf/tile_plitka_001_0_0_0.vmt"  "file"
"materials/maps/rp_rashkinsk_release/man/rf/tile_wall_rf_11_0_0_0.vmt"  "file"
"materials/maps/rp_rashkinsk_release/metal/offelevdrsa_0_0_0.vmt"  "file"
"materials/maps/rp_rashkinsk_release/nature/blenddirtmud003a_wvt_patch.vmt"  "file"
"materials/maps/rp_rashkinsk_release/nature/blendgrassgrass001a_wvt_patch.vmt"  "file"
"materials/maps/rp_rashkinsk_release/nature/blendgrassgravel003a_wvt_patch.vmt"  "file"
"materials/maps/rp_rashkinsk_release/nature/blendmilground004_2_wvt_patch.vmt"  "file"
"materials/maps/rp_rashkinsk_release/nature/blendmilground008_2_wvt_patch.vmt"  "file"
"materials/maps/rp_rashkinsk_release/nature/blendmilground008_4_wvt_patch.vmt"  "file"
"materials/maps/rp_rashkinsk_release/nature/toxicslime002a_depth_41.vmt"  "file"
"materials/maps/rp_rashkinsk_release/plaster/plasterwall005e_0_0_0.vmt"  "file"
"materials/maps/rp_rashkinsk_release/plaster/plasterwall013g_0_0_0.vmt"  "file"
"materials/maps/rp_rashkinsk_release/plaster/plasterwall043c_0_0_0.vmt"  "file"
"materials/maps/rp_rashkinsk_release/stone/blendstonefloor003asphalt_wvt_patch.vmt"  "file"
"materials/maps/rp_rashkinsk_release/tile/tilefloor021a_0_0_0.vmt"  "file"
"materials/maps/rp_rashkinsk_release/tile/tileroof004a_0_0_0.vmt"  "file"
"materials/maps/rp_rashkinsk_release/tile/tileroof004b_0_0_0.vmt"  "file"
"materials/maps/rp_rashkinsk_release/wood/woodfloor006a_0_0_0.vmt"  "file"
"materials/maps/rp_rashkinsk_release/wood/woodwall009a_0_0_0.vmt"  "file"
"materials/models/av/5etazechka/5e-1.vmt"  "file"
"materials/models/av/5etazechka/5e-2.vmt"  "file"
"materials/models/av/5etazechka/5e-3.vmt"  "file"
"materials/models/av/5etazechka/9e-8.vmt"  "file"
"materials/models/av/5etazechka/9e-podval.vmt"  "file"
"materials/models/av/5etazechka/beton_fasad_098.vmt"  "file"
"materials/models/av/5etazechka/brickwall052c.vmt"  "file"
"materials/models/av/5etazechka/brickwall052e.vmt"  "file"
"materials/models/av/5etazechka/concretefloor010b.vmt"  "file"
"materials/models/av/5etazechka/concretefloor031a.vmt"  "file"
"materials/models/av/5etazechka/glasswindow031b.vmt"  "file"
"materials/models/av/5etazechka/glasswindow037c.vmt"  "file"
"materials/models/av/5etazechka/infbaseb.vmt"  "file"
"materials/models/av/5etazechka/metalwall001b_cheap.vmt"  "file"
"materials/models/av/5etazechka/metalwall014a_cheap.vmt"  "file"
"materials/models/av/5etazechka/metalwall042a.vmt"  "file"
"materials/models/av/5etazechka/met_door_rf_011.vmt"  "file"
"materials/models/av/5etazechka/padik.vmt"  "file"
"materials/models/av/5etazechka/train_glasswindow_01.vmt"  "file"
"materials/models/av/5etazechka/woodwall041a.vmt"  "file"
"materials/models/av/beton_fasad_018.vmt"  "file"
"materials/models/av/beton_fasad_062.vmt"  "file"
"materials/models/av/beton_fasad_063.vmt"  "file"
"materials/models/av/beton_fasad_070.vmt"  "file"
"materials/models/av/beton_fasad_078.vmt"  "file"
"materials/models/av/beton_fasad_092.vmt"  "file"
"materials/models/av/beton_fasad_094.vmt"  "file"
"materials/models/av/beton_fasad_095.vmt"  "file"
"materials/models/av/beton_fasad_096.vmt"  "file"
"materials/models/av/beton_fasad_097.vmt"  "file"
"materials/models/av/beton_fasad_098.vmt"  "file"
"materials/models/av/beton_fasad_099.vmt"  "file"
"materials/models/av/beton_fasad_100.vmt"  "file"
"materials/models/av/beton_fasad_108.vmt"  "file"
"materials/models/av/beton_fasad_117.vmt"  "file"
"materials/models/av/beton_fasad_119.vmt"  "file"
"materials/models/av/beton_fasad_126.vmt"  "file"
"materials/models/av/beton_fasad_138.vmt"  "file"
"materials/models/av/bet_dom_base_05.vmt"  "file"
"materials/models/av/bet_dom_base_10.vmt"  "file"
"materials/models/av/bet_dom_base_11.vmt"  "file"
"materials/models/av/bet_plita_rf_08.vmt"  "file"
"materials/models/av/bet_roof_rf_001.vmt"  "file"
"materials/models/av/bet_roof_rf_002.vmt"  "file"
"materials/models/av/bet_wall_rf_11a.vmt"  "file"
"materials/models/av/bet_wall_rf_15a.vmt"  "file"
"materials/models/av/bet_zabor_rf_08.vmt"  "file"
"materials/models/av/border.vmt"  "file"
"materials/models/av/concreteceiling001a.vmt"  "file"
"materials/models/av/concreteceiling002a.vmt"  "file"
"materials/models/av/concretefloor006a.vmt"  "file"
"materials/models/av/concretefloor011a_c17.vmt"  "file"
"materials/models/av/concretestair003a.vmt"  "file"
"materials/models/av/concretewall006a.vmt"  "file"
"materials/models/av/concretewall065a.vmt"  "file"
"materials/models/av/glasswindow031b.vmt"  "file"
"materials/models/av/gr_11.vmt"  "file"
"materials/models/av/gr_3.vmt"  "file"
"materials/models/av/infbaseb.vmt"  "file"
"materials/models/av/metal3.vmt"  "file"
"materials/models/av/metalfence001a.vmt"  "file"
"materials/models/av/metalshutters001a.vmt"  "file"
"materials/models/av/p49/9e-6.vmt"  "file"
"materials/models/av/p49/9e-podval.vmt"  "file"
"materials/models/av/p49/beton_fasad_016.vmt"  "file"
"materials/models/av/p49/concreteceiling001a.vmt"  "file"
"materials/models/av/p49/concreteceiling002a.vmt"  "file"
"materials/models/av/p49/concreteceiling004a.vmt"  "file"
"materials/models/av/p49/concretefloor015a_c17.vmt"  "file"
"materials/models/av/p49/metalfence001a.vmt"  "file"
"materials/models/av/p49/metalfence005a.vmt"  "file"
"materials/models/av/p49/nuke_officedoor_01.vmt"  "file"
"materials/models/av/p49/p49.vmt"  "file"
"materials/models/av/p49/p49add.vmt"  "file"
"materials/models/av/prop_ventstack_01.vmt"  "file"
"materials/models/av/roof_schiffer_01.vmt"  "file"
"materials/models/av/rubberroof002a.vmt"  "file"
"materials/models/av/wind_gr.vmt"  "file"
"materials/models/av/wind_gr04.vmt"  "file"
"materials/models/av/wind_gr10.vmt"  "file"
"materials/models/dimidrol/transport/0a0cad57.vmt"  "file"
"materials/models/dimidrol/transport/0a0cad57.vtf"  "file"
"materials/models/dimidrol/transport/0f68ae69.vmt"  "file"
"materials/models/dimidrol/transport/0f68ae69.vtf"  "file"
"materials/models/dimidrol/transport/15a3492a.vmt"  "file"
"materials/models/dimidrol/transport/15a3492a.vtf"  "file"
"materials/models/dimidrol/transport/15a3492a_normal.vtf"  "file"
"materials/models/dimidrol/transport/614bb871.vmt"  "file"
"materials/models/dimidrol/transport/614bb871.vtf"  "file"
"materials/models/dimidrol/transport/ab8c79eb.vmt"  "file"
"materials/models/dimidrol/transport/ab8c79eb.vtf"  "file"
"materials/models/dimidrol/transport/body.vmt"  "file"
"materials/models/dimidrol/transport/body.vtf"  "file"
"materials/models/dimidrol/transport/de560161.vmt"  "file"
"materials/models/dimidrol/transport/de560161.vtf"  "file"
"materials/models/dimidrol/transport/disc.vmt"  "file"
"materials/models/dimidrol/transport/disc.vtf"  "file"
"materials/models/dimidrol/transport/ff7873d2.vmt"  "file"
"materials/models/dimidrol/transport/ff7873d2.vtf"  "file"
"materials/models/dimidrol/transport/lights.vmt"  "file"
"materials/models/dimidrol/transport/lights.vtf"  "file"
"materials/models/dimidrol/transport/mirror.vmt"  "file"
"materials/models/dimidrol/transport/mirror.vtf"  "file"
"materials/models/dimidrol/transport/tire.vmt"  "file"
"materials/models/dimidrol/transport/tire.vtf"  "file"
"materials/models/lenin_statues/1b0cde82.vmt"  "file"
"materials/models/lenin_statues/1b0cde82.vtf"  "file"
"materials/models/lenin_statues/1b0cde82_normal.vtf"  "file"
"materials/models/lenin_statues/822faac8.vmt"  "file"
"materials/models/lenin_statues/822faac8.vtf"  "file"
"materials/models/lenin_statues/b4159071.vmt"  "file"
"materials/models/lenin_statues/b4159071.vtf"  "file"
"materials/models/lenin_statues/b4159071_normal.vtf"  "file"
"materials/models/lenin_statues/c4dd7464.vmt"  "file"
"materials/models/lenin_statues/c4dd7464.vtf"  "file"
"materials/models/lenin_statues/leninstatue2_normal.vtf"  "file"
"materials/models/man/kvartal/outside_stolb_1.vmt"  "file"
"materials/models/man/kvartal/outside_stolb_1.vtf"  "file"
"materials/models/man/kvartal/outside_stolb_2.vmt"  "file"
"materials/models/man/kvartal/outside_stolb_2.vtf"  "file"
"materials/models/man/nature/gepevo01.vmt"  "file"
"materials/models/man/nature/gepevo01.vtf"  "file"
"materials/models/man/nature/nature_kust_03.vmt"  "file"
"materials/models/man/nature/nature_kust_03.vtf"  "file"
"materials/models/man/nature/nature_kust_04.vmt"  "file"
"materials/models/man/nature/nature_kust_04.vtf"  "file"
"materials/models/man/nature/nature_kust_05.vmt"  "file"
"materials/models/man/nature/nature_kust_05.vtf"  "file"
"materials/models/man/props/bet_wall_tez_01.vmt"  "file"
"materials/models/man/props/bet_wall_tez_01.vtf"  "file"
"materials/models/man/props/bet_wall_tez_02.vmt"  "file"
"materials/models/man/props/bet_wall_tez_02.vtf"  "file"
"materials/models/man/props/bet_wall_tez_03.vmt"  "file"
"materials/models/man/props/bet_wall_tez_03.vtf"  "file"
"materials/models/man/props/bet_wall_tez_04.vmt"  "file"
"materials/models/man/props/bet_wall_tez_04.vtf"  "file"
"materials/models/man/rf/beton_fasad_016.vmt"  "file"
"materials/models/man/rf/beton_fasad_020.vmt"  "file"
"materials/models/man/rf/beton_fasad_021.vmt"  "file"
"materials/models/man/rf/beton_fasad_022.vmt"  "file"
"materials/models/man/rf/beton_fasad_023.vmt"  "file"
"materials/models/man/rf/beton_fasad_024.vmt"  "file"
"materials/models/man/rf/beton_fasad_026.vmt"  "file"
"materials/models/man/rf/beton_fasad_027.vmt"  "file"
"materials/models/man/rf/beton_fasad_029.vmt"  "file"
"materials/models/man/rf/beton_fasad_031.vmt"  "file"
"materials/models/man/rf/beton_fasad_032.vmt"  "file"
"materials/models/man/rf/beton_fasad_034.vmt"  "file"
"materials/models/man/rf/beton_fasad_037.vmt"  "file"
"materials/models/man/rf/beton_fasad_050.vmt"  "file"
"materials/models/man/rf/beton_fasad_052.vmt"  "file"
"materials/models/man/rf/beton_fasad_053.vmt"  "file"
"materials/models/man/rf/beton_fasad_054.vmt"  "file"
"materials/models/man/rf/beton_fasad_056.vmt"  "file"
"materials/models/man/rf/beton_fasad_057.vmt"  "file"
"materials/models/man/rf/beton_fasad_059.vmt"  "file"
"materials/models/man/rf/beton_fasad_060.vmt"  "file"
"materials/models/man/rf/beton_fasad_062.vmt"  "file"
"materials/models/man/rf/beton_fasad_063.vmt"  "file"
"materials/models/man/rf/beton_fasad_064.vmt"  "file"
"materials/models/man/rf/beton_fasad_068.vmt"  "file"
"materials/models/man/rf/beton_fasad_070.vmt"  "file"
"materials/models/man/rf/beton_fasad_073.vmt"  "file"
"materials/models/man/rf/beton_fasad_079.vmt"  "file"
"materials/models/man/rf/beton_fasad_124.vmt"  "file"
"materials/models/man/rf/beton_fasad_143.vmt"  "file"
"materials/models/man/rf/bet_dom_base_02.vmt"  "file"
"materials/models/man/rf/bet_dom_base_05.vmt"  "file"
"materials/models/man/rf/bet_dom_base_09.vmt"  "file"
"materials/models/man/rf/bet_floor_rf_10.vmt"  "file"
"materials/models/man/rf/bet_floor_rf_12.vmt"  "file"
"materials/models/man/rf/bet_floor_rf_22.vmt"  "file"
"materials/models/man/rf/bet_garaz_rf_02.vmt"  "file"
"materials/models/man/rf/bet_roof_rf_001.vmt"  "file"
"materials/models/man/rf/bet_vent_atc_01.vmt"  "file"
"materials/models/man/rf/bet_vent_atc_02.vmt"  "file"
"materials/models/man/rf/bet_wall_rf_23a.vmt"  "file"
"materials/models/man/rf/met_door_rf_004.vmt"  "file"
"materials/models/man/rf/met_door_rf_010.vmt"  "file"
"materials/models/man/rf/met_garaz_rf_03.vmt"  "file"
"materials/models/man/rf/met_garaz_rf_04.vmt"  "file"
"materials/models/man/rf/met_garaz_rf_05.vmt"  "file"
"materials/models/man/rf/met_panel_rf_07.vmt"  "file"
"materials/models/man/rf/met_panel_rf_09.vmt"  "file"
"materials/models/man/rf/met_panel_rf_11.vmt"  "file"
"materials/models/man/rf/met_panel_rf_14.vmt"  "file"
"materials/models/man/rf/met_panel_rf_16.vmt"  "file"
"materials/models/man/rf/met_panel_rf_22.vmt"  "file"
"materials/models/man/rf/met_panel_rf_23.vmt"  "file"
"materials/models/man/rf/met_panel_rf_24.vmt"  "file"
"materials/models/man/rf/met_panel_rf_26.vmt"  "file"
"materials/models/man/rf/met_panel_rf_27.vmt"  "file"
"materials/models/man/rf/met_panel_rf_28.vmt"  "file"
"materials/models/man/rf/met_panel_rf_29.vmt"  "file"
"materials/models/man/rf/met_panel_rf_34.vmt"  "file"
"materials/models/man/rf/met_stop_rf_001.vmt"  "file"
"materials/models/man/rf/met_stop_rf_002.vmt"  "file"
"materials/models/man/rf/met_stop_rf_003.vmt"  "file"
"materials/models/man/rf/met_stop_rf_004.vmt"  "file"
"materials/models/man/rf/met_transfor_10.vmt"  "file"
"materials/models/man/rf/met_transfor_11.vmt"  "file"
"materials/models/man/rf/met_transfor_12.vmt"  "file"
"materials/models/man/rf/met_transfor_13.vmt"  "file"
"materials/models/man/rf/met_transven_02.vmt"  "file"
"materials/models/man/rf/prop_met_rust_03.vmt"  "file"
"materials/models/man/rf/prop_met_rust_03.vtf"  "file"
"materials/models/man/rf/tile_budkatr_01.vmt"  "file"
"materials/models/man/rf/tile_budkatr_02.vmt"  "file"
"materials/models/man/rf/tile_budkatr_03.vmt"  "file"
"materials/models/props/2etaz1/border.vmt"  "file"
"materials/models/props/2etaz1/brickwall017b.vmt"  "file"
"materials/models/props/2etaz1/concretefloor006a.vmt"  "file"
"materials/models/props/2etaz1/concretestair006a.vmt"  "file"
"materials/models/props/2etaz1/concretewall065a.vmt"  "file"
"materials/models/props/2etaz1/metal3.vmt"  "file"
"materials/models/props/2etaz1/metalvent004a.vmt"  "file"
"materials/models/props/2etaz1/metalwall031a.vmt"  "file"
"materials/models/props/2etaz1/prop_signs.vmt"  "file"
"materials/models/props/2etaz1/roof_schiffer_01.vmt"  "file"
"materials/models/props/2etaz1/wall_orange_01.vmt"  "file"
"materials/models/props/2etaz1/wall_orange_02.vmt"  "file"
"materials/models/props/2etaz1/wind_brown.vmt"  "file"
"materials/models/props/2etaz1/wooddoor046a.vmt"  "file"
"materials/models/props/2etaz1/woodwall011a.vmt"  "file"
"materials/models/props/2etaz1/woodwall018a.vmt"  "file"
"materials/models/props/2etaz1/woodwall037a.vmt"  "file"
"materials/models/props/2etaz2/border.vmt"  "file"
"materials/models/props/2etaz2/brickwall017b.vmt"  "file"
"materials/models/props/2etaz2/concretefloor006a.vmt"  "file"
"materials/models/props/2etaz2/concretestair006a.vmt"  "file"
"materials/models/props/2etaz2/concretewall065a.vmt"  "file"
"materials/models/props/2etaz2/metal3.vmt"  "file"
"materials/models/props/2etaz2/metalvent004a.vmt"  "file"
"materials/models/props/2etaz2/metalwall031a.vmt"  "file"
"materials/models/props/2etaz2/prop_signs.vmt"  "file"
"materials/models/props/2etaz2/roof_schiffer_01.vmt"  "file"
"materials/models/props/2etaz2/wall_yellow_01.vmt"  "file"
"materials/models/props/2etaz2/wall_yellow_02.vmt"  "file"
"materials/models/props/2etaz2/wind_brown.vmt"  "file"
"materials/models/props/2etaz2/wooddoor046a.vmt"  "file"
"materials/models/props/2etaz2/woodwall011a.vmt"  "file"
"materials/models/props/2etaz2/woodwall018a.vmt"  "file"
"materials/models/props/2etaz2/woodwall037a.vmt"  "file"
"materials/models/props/av/concretefloor011a.vmt"  "file"
"materials/models/props/av/concretefloor011a_c17.vmt"  "file"
"materials/models/props/av/concretefloor031a.vmt"  "file"
"materials/models/props/av/concretewall001a.vmt"  "file"
"materials/models/props/av/concretewall006a.vmt"  "file"
"materials/models/props/av/concretewall023a.vmt"  "file"
"materials/models/props/av/concretewall032b.vmt"  "file"
"materials/models/props/av/concretewall037a.vmt"  "file"
"materials/models/props/av/concretewall070a.vmt"  "file"
"materials/models/props/av/concretewall073a.vmt"  "file"
"materials/models/props/av/concretewall074c.vmt"  "file"
"materials/models/props/av/fluorescentcool001a.vmt"  "file"
"materials/models/props/av/metaldoor066a.vmt"  "file"
"materials/models/props/av/metalhull003a.vmt"  "file"
"materials/models/props/av/metalwall047a.vmt"  "file"
"materials/models/props/av/nuke_officedoor_01.vmt"  "file"
"materials/models/props/av/offwllatp.vmt"  "file"
"materials/models/props/av/p68balcony.vmt"  "file"
"materials/models/props/av/p68_stena.vmt"  "file"
"materials/models/props/av/p68_torec.vmt"  "file"
"materials/models/props/av/stena_1.vmt"  "file"
"materials/models/props/av/tilefloor009a.vmt"  "file"
"materials/models/props/av/toolsblack.vmt"  "file"
"materials/models/props/av/wall_1.vmt"  "file"
"materials/models/props_foliage/trees_bark_sosna_02.vmt"  "file"
"materials/models/props_foliage/trees_bark_sosna_02.vtf"  "file"
"materials/models/props_foliage/trees_sosna.vmt"  "file"
"materials/models/props_foliage/trees_sosna.vtf"  "file"
"materials/models/props_foliage/trees_sosna_normal.vtf"  "file"
"materials/models/props_trainstation/train001.vmt"  "file"
"materials/models/props_trainstation/train001.vtf"  "file"
"materials/models/props_uboat/ixb-uboat.vmt"  "file"
"materials/models/props_uboat/ixb-uboat.vtf"  "file"
"materials/models/props_uboat/ixb-uboat_n.vtf"  "file"
"materials/models/razor/foliage.vmt"  "file"
"materials/models/razor/foliage.vtf"  "file"
"materials/models/razor/train_vagon01.vmt"  "file"
"materials/models/razor/train_vagon01.vtf"  "file"
"materials/models/razor/train_vagon01_normal.vtf"  "file"
"materials/models/razor/train_vagon02.vmt"  "file"
"materials/models/razor/train_vagon02.vtf"  "file"
"materials/models/razor/train_vagon03.vmt"  "file"
"materials/models/razor/train_vagon03.vtf"  "file"
"materials/models/razor/train_vagon03_normal.vtf"  "file"
"materials/models/razor/train_vagon04.vmt"  "file"
"materials/models/razor/train_vagon04.vtf"  "file"
"materials/models/razor/train_vagon04_normal.vtf"  "file"
"materials/models/razor/train_vagon05.vmt"  "file"
"materials/models/razor/train_vagon05.vtf"  "file"
"materials/models/razor/train_vagon05_normal.vtf"  "file"
"materials/models/razor/train_vagon06.vmt"  "file"
"materials/models/razor/train_vagon06.vtf"  "file"
"materials/models/razor/train_vagon06_normal.vtf"  "file"
"materials/models/razor/train_vagon07.vmt"  "file"
"materials/models/razor/train_vagon07.vtf"  "file"
"materials/models/razor/train_vagon07_normal.vtf"  "file"
"materials/models/razor/train_vagon08.vmt"  "file"
"materials/models/razor/train_vagon08.vtf"  "file"
"materials/models/razor/train_vagon08_normal.vtf"  "file"
"materials/models/razor/trunk.vmt"  "file"
"materials/models/razor/trunk.vtf"  "file"
"materials/models/razor/trunk_normal.vtf"  "file"
"materials/models/renafox/cleancars/avia.vmt"  "file"
"materials/models/renafox/cleancars/avia1.vtf"  "file"
"materials/models/renafox/cleancars/avia2.vmt"  "file"
"materials/models/renafox/cleancars/avia2.vtf"  "file"
"materials/models/renafox/cleancars/car002.vmt"  "file"
"materials/models/renafox/cleancars/car002a.vtf"  "file"
"materials/models/renafox/cleancars/car002b.vmt"  "file"
"materials/models/renafox/cleancars/car002b.vtf"  "file"
"materials/models/renafox/cleancars/car002c.vmt"  "file"
"materials/models/renafox/cleancars/car002c.vtf"  "file"
"materials/models/renafox/cleancars/car002_n.vtf"  "file"
"materials/models/renafox/cleancars/car004.vmt"  "file"
"materials/models/renafox/cleancars/car004a.vtf"  "file"
"materials/models/renafox/cleancars/car004b.vmt"  "file"
"materials/models/renafox/cleancars/car004b.vtf"  "file"
"materials/models/renafox/cleancars/car004_n.vtf"  "file"
"materials/models/renafox/cleancars/car005.vmt"  "file"
"materials/models/renafox/cleancars/car005a.vtf"  "file"
"materials/models/renafox/cleancars/car005b.vmt"  "file"
"materials/models/renafox/cleancars/car005b.vtf"  "file"
"materials/models/renafox/cleancars/car005_n.vtf"  "file"
"materials/models/renafox/cleancars/car006.vmt"  "file"
"materials/models/renafox/cleancars/car006.vtf"  "file"
"materials/models/renafox/cleancars/car006b.vmt"  "file"
"materials/models/renafox/cleancars/car006b.vtf"  "file"
"materials/models/renafox/cleancars/car006c.vmt"  "file"
"materials/models/renafox/cleancars/car006c.vtf"  "file"
"materials/models/renafox/cleancars/car006_n.vtf"  "file"
"materials/models/renafox/cleancars/carsglass.vmt"  "file"
"materials/models/renafox/cleancars/carsglass.vtf"  "file"
"materials/models/renafox/cleancars/gaz52.vmt"  "file"
"materials/models/renafox/cleancars/gaz52.vtf"  "file"
"materials/models/renafox/cleancars/gaz52_n.vtf"  "file"
"materials/models/renafox/cleancars/truck001a_01.vtf"  "file"
"materials/models/renafox/cleancars/tyres.vmt"  "file"
"materials/models/renafox/mw2/cars_01.vmt"  "file"
"materials/models/renafox/mw2/cars_01.vtf"  "file"
"materials/models/renafox/mw2/cars_02.vmt"  "file"
"materials/models/renafox/mw2/cars_02.vtf"  "file"
"materials/models/renafox/mw2/cars_03.vmt"  "file"
"materials/models/renafox/mw2/cars_03.vtf"  "file"
"materials/models/renafox/mw2/cars_04.vmt"  "file"
"materials/models/renafox/mw2/cars_04.vtf"  "file"
"materials/models/renafox/mw2/cars_05.vmt"  "file"
"materials/models/renafox/mw2/cars_05.vtf"  "file"
"materials/models/renafox/mw2/cars_glass.vmt"  "file"
"materials/models/renafox/mw2/cars_glass.vtf"  "file"
"materials/models/renafox/mw2/cars_normal.vtf"  "file"
"materials/models/rusigns/66.vmt"  "file"
"materials/models/rusigns/66.vtf"  "file"
"materials/models/rusigns/signback.vmt"  "file"
"materials/models/rusigns/signback.vtf"  "file"
"materials/models/rusty/hatchback/4carz1024.vmt"  "file"
"materials/models/rusty/hatchback/4carz1024.vtf"  "file"
"materials/models/rusty/hatchback/4carz1024_envmask.vtf"  "file"
"materials/models/rusty/hatchback/4carz1024_glass.vmt"  "file"
"materials/models/rusty/hatchback/4carz1024_glass.vtf"  "file"
"materials/models/rusty/hatchback/hatchback_blue.vmt"  "file"
"materials/models/rusty/hatchback/hatchback_blue.vtf"  "file"
"materials/models/rusty/hatchback/hatchback_orange.vmt"  "file"
"materials/models/rusty/hatchback/hatchback_orange.vtf"  "file"
"materials/models/rusty/hatchback/hatchback_red.vmt"  "file"
"materials/models/rusty/hatchback/hatchback_red.vtf"  "file"
"materials/models/rusty/hatchback/hatchback_ref.vtf"  "file"
"materials/models/rusty/hatchback/hatchback_white.vmt"  "file"
"materials/models/rusty/hatchback/hatchback_white.vtf"  "file"
"materials/models/rusty/hatchback/hatchback_yellow.vmt"  "file"
"materials/models/rusty/hatchback/hatchback_yellow.vtf"  "file"
"materials/models/rusty/van/4carz1024.vmt"  "file"
"materials/models/rusty/van/4carz1024.vtf"  "file"
"materials/models/rusty/van/4carz1024_envmask.vtf"  "file"
"materials/models/rusty/van/4carz1024_glass.vmt"  "file"
"materials/models/rusty/van/4carz1024_glass.vtf"  "file"
"materials/models/rusty/van/hl2_van_lightblue.vmt"  "file"
"materials/models/rusty/van/hl2_van_lightblue.vtf"  "file"
"materials/models/rusty/van/hl2_van_orange.vmt"  "file"
"materials/models/rusty/van/hl2_van_orange.vtf"  "file"
"materials/models/rusty/van/hl2_van_ref.vtf"  "file"
"materials/models/rusty/van/hl2_van_white.vmt"  "file"
"materials/models/rusty/van/hl2_van_white.vtf"  "file"
"materials/models/said/veh_molokovoz.vmt"  "file"
"materials/models/said/veh_molokovoz.vtf"  "file"
"materials/models/said/veh_zil.vmt"  "file"
"materials/models/said/veh_zil.vtf"  "file"
"materials/models/trakpak/concretefloor005a.vmt"  "file"
"materials/models/trakpak/dev_hazzardstripe01a.vmt"  "file"
"materials/models/trakpak/metalhull003a.vmt"  "file"
"materials/models/trakpak/metaltrack001a.vmt"  "file"
"materials/models/trakpak/metalwall030a.vmt"  "file"
"materials/models/trakpak2/gravelfloor002a_norails.vmt"  "file"
"materials/models/trakpak2/gravelfloor002b.vmt"  "file"
"materials/models/trakpak2/metalhull003a.vmt"  "file"
"materials/models/trakpak2/metalwall030a.vmt"  "file"
"materials/models/trakpak2/railtop.vmt"  "file"
"materials/models/trakpak2/rustyrail.vmt"  "file"
"materials/models/trakpak2/switchstand_red.vmt"  "file"
"materials/models/trakpak2/switchstand_yellow.vmt"  "file"
"materials/models/trakpak2/woodfloor008a.vmt"  "file"
"materials/models/z-o-m-b-i-e/1b777c72.vmt"  "file"
"materials/models/z-o-m-b-i-e/1b777c72.vtf"  "file"
"materials/models/z-o-m-b-i-e/f603082b.vmt"  "file"
"materials/models/z-o-m-b-i-e/f603082b.vtf"  "file"
"materials/models/z-o-m-b-i-e/metro_2033/props/props_turn.vmt"  "file"
"materials/models/z-o-m-b-i-e/metro_2033/props/props_turn.vtf"  "file"
"materials/models/z-o-m-b-i-e/mtl_garage_pryp_01.vmt"  "file"
"materials/models/z-o-m-b-i-e/mtl_garage_pryp_01.vtf"  "file"
"materials/models/z-o-m-b-i-e/mtl_garage_pryp_02.vmt"  "file"
"materials/models/z-o-m-b-i-e/mtl_garage_pryp_02.vtf"  "file"
"materials/models/z-o-m-b-i-e/mtl_garage_pryp_03.vmt"  "file"
"materials/models/z-o-m-b-i-e/mtl_garage_pryp_03.vtf"  "file"
"materials/models/z-o-m-b-i-e/stalker/295aaccc.vmt"  "file"
"materials/models/z-o-m-b-i-e/stalker/295aaccc.vtf"  "file"
"materials/models/z-o-m-b-i-e/stalker/8a19604d.vmt"  "file"
"materials/models/z-o-m-b-i-e/stalker/8a19604d.vtf"  "file"
"materials/models/z-o-m-b-i-e/stalker/c917d86a.vmt"  "file"
"materials/models/z-o-m-b-i-e/stalker/c917d86a.vtf"  "file"
"materials/models/z-o-m-b-i-e/stalker/f3872361.vmt"  "file"
"materials/models/z-o-m-b-i-e/stalker/f3872361.vtf"  "file"
"materials/mytextures/tileflor.vmt"  "file"
"materials/mytextures/tileflor.vtf"  "file"
"materials/mytextures/wallpap.vmt"  "file"
"materials/mytextures/wallpap.vtf"  "file"
"materials/mytextures/wallpaper2.vmt"  "file"
"materials/mytextures/wallpaper2.vtf"  "file"
"materials/mytextures/woodenfloor1.vmt"  "file"
"materials/mytextures/woodenfloor1.vtf"  "file"
"materials/mytextures/woodfloor2.vmt"  "file"
"materials/mytextures/woodfloor2.vtf"  "file"
"materials/srp/brick/wall_brick_medium01.vmt"  "file"
"materials/srp/brick/wall_brick_medium01.vtf"  "file"
"materials/srp/brick/wall_brick_white01.vmt"  "file"
"materials/srp/brick/wall_brick_white01.vtf"  "file"
"materials/srp/brick/wall_brick_white02.vmt"  "file"
"materials/srp/brick/wall_brick_white02.vtf"  "file"
"materials/srp/brick/wall_brick_white03.vmt"  "file"
"materials/srp/brick/wall_brick_white03.vtf"  "file"
"materials/srp/stone/stone_tile_red01.vmt"  "file"
"materials/srp/stone/stone_tile_red01.vtf"  "file"
"materials/srp/stone/wall_lab_tile01.vmt"  "file"
"materials/srp/stone/wall_lab_tile01.vtf"  "file"
"materials/srp/wood/floor_wood_generic01.vmt"  "file"
"materials/srp/wood/floor_wood_generic01.vtf"  "file"
"materials/trakpak/gravelfloor002a_norails.vtf"  "file"
"materials/trakpak/railtop.vtf"  "file"
"materials/trakpak/rustyrail.vtf"  "file"
"materials/vintagewallpaper/wallpaper01.vmt"  "file"
"materials/vintagewallpaper/wallpaper01.vtf"  "file"
"materials/vintagewallpaper/wallpaper04.vmt"  "file"
"materials/vintagewallpaper/wallpaper04.vtf"  "file"
"materials/vintagewallpaper/wallpaper05.vmt"  "file"
"materials/vintagewallpaper/wallpaper05.vtf"  "file"
"materials/vintagewallpaper/wallpaper07.vmt"  "file"
"materials/vintagewallpaper/wallpaper07.vtf"  "file"
"materials/vintagewallpaper/wallpaper08.vmt"  "file"
"materials/vintagewallpaper/wallpaper08.vtf"  "file"
"materials/vintagewallpaper/wallpaper09.vmt"  "file"
"materials/vintagewallpaper/wallpaper09.vtf"  "file"
"materials/vintagewallpaper/wallpaper10.vmt"  "file"
"materials/vintagewallpaper/wallpaper10.vtf"  "file"
"materials/vintagewallpaper/wallpaper11.vmt"  "file"
"materials/vintagewallpaper/wallpaper11.vtf"  "file"
"materials/vintagewallpaper/wallpaper12.vmt"  "file"
"materials/vintagewallpaper/wallpaper12.vtf"  "file"
"materials/vintagewallpaper/wallpaper14.vmt"  "file"
"materials/vintagewallpaper/wallpaper14.vtf"  "file"
"materials/vintagewallpaper/wallpaper16.vmt"  "file"
"materials/vintagewallpaper/wallpaper16.vtf"  "file"
"materials/vintagewallpaper/wallpaper18.vmt"  "file"
"materials/vintagewallpaper/wallpaper18.vtf"  "file"
"materials/vintagewallpaper/wallpaper19.vmt"  "file"
"materials/vintagewallpaper/wallpaper19.vtf"  "file"
"materials/vintagewallpaper/wallpaper21.vmt"  "file"
"materials/vintagewallpaper/wallpaper21.vtf"  "file"
"materials/vintagewallpaper/wallpaper24.vmt"  "file"
"materials/vintagewallpaper/wallpaper24.vtf"  "file"
"materials/vintagewallpaper/wallpaper25.vmt"  "file"
"materials/vintagewallpaper/wallpaper25.vtf"  "file"
"materials/vintagewallpaper/wallpaper27.vmt"  "file"
"materials/vintagewallpaper/wallpaper27.vtf"  "file"
"materials/vintagewallpaper/wallpaper28.vmt"  "file"
"materials/vintagewallpaper/wallpaper28.vtf"  "file"
"materials/vintagewallpaper/wallpaper29.vmt"  "file"
"materials/vintagewallpaper/wallpaper29.vtf"  "file"
"models/av/5etazechka.dx80.vtx"  "file"
"models/av/5etazechka.dx90.vtx"  "file"
"models/av/5etazechka.mdl"  "file"
"models/av/5etazechka.phy"  "file"
"models/av/5etazechka.sw.vtx"  "file"
"models/av/5etazechka.vvd"  "file"
"models/av/i515.dx80.vtx"  "file"
"models/av/i515.dx90.vtx"  "file"
"models/av/i515.mdl"  "file"
"models/av/i515.phy"  "file"
"models/av/i515.sw.vtx"  "file"
"models/av/i515.vvd"  "file"
"models/av/lenseria.dx80.vtx"  "file"
"models/av/lenseria.dx90.vtx"  "file"
"models/av/lenseria.mdl"  "file"
"models/av/lenseria.phy"  "file"
"models/av/lenseria.sw.vtx"  "file"
"models/av/lenseria.vvd"  "file"
"models/av/p18m.dx80.vtx"  "file"
"models/av/p18m.dx90.vtx"  "file"
"models/av/p18m.mdl"  "file"
"models/av/p18m.phy"  "file"
"models/av/p18m.sw.vtx"  "file"
"models/av/p18m.vvd"  "file"
"models/av/p49.dx80.vtx"  "file"
"models/av/p49.dx90.vtx"  "file"
"models/av/p49.mdl"  "file"
"models/av/p49.phy"  "file"
"models/av/p49.sw.vtx"  "file"
"models/av/p49.vvd"  "file"
"models/av/p68.dx80.vtx"  "file"
"models/av/p68.dx90.vtx"  "file"
"models/av/p68.mdl"  "file"
"models/av/p68.sw.vtx"  "file"
"models/av/p68.vvd"  "file"
"models/dimidrol/transport/gaz_66_codbo_01.dx80.vtx"  "file"
"models/dimidrol/transport/gaz_66_codbo_01.dx90.vtx"  "file"
"models/dimidrol/transport/gaz_66_codbo_01.mdl"  "file"
"models/dimidrol/transport/gaz_66_codbo_01.phy"  "file"
"models/dimidrol/transport/gaz_66_codbo_01.sw.vtx"  "file"
"models/dimidrol/transport/gaz_66_codbo_01.vvd"  "file"
"models/dimidrol/transport/gaz_szp_001.dx80.vtx"  "file"
"models/dimidrol/transport/gaz_szp_001.dx90.vtx"  "file"
"models/dimidrol/transport/gaz_szp_001.mdl"  "file"
"models/dimidrol/transport/gaz_szp_001.phy"  "file"
"models/dimidrol/transport/gaz_szp_001.sw.vtx"  "file"
"models/dimidrol/transport/gaz_szp_001.vvd"  "file"
"models/dimidrol/transport/pobeda_x2_01.dx80.vtx"  "file"
"models/dimidrol/transport/pobeda_x2_01.dx90.vtx"  "file"
"models/dimidrol/transport/pobeda_x2_01.mdl"  "file"
"models/dimidrol/transport/pobeda_x2_01.phy"  "file"
"models/dimidrol/transport/pobeda_x2_01.sw.vtx"  "file"
"models/dimidrol/transport/pobeda_x2_01.vvd"  "file"
"models/dimidrol/transport/uaz_cod4_01.dx80.vtx"  "file"
"models/dimidrol/transport/uaz_cod4_01.dx90.vtx"  "file"
"models/dimidrol/transport/uaz_cod4_01.mdl"  "file"
"models/dimidrol/transport/uaz_cod4_01.phy"  "file"
"models/dimidrol/transport/uaz_cod4_01.sw.vtx"  "file"
"models/dimidrol/transport/uaz_cod4_01.vvd"  "file"
"models/dimidrol/transport/uaz_my_konvert_01.dx80.vtx"  "file"
"models/dimidrol/transport/uaz_my_konvert_01.dx90.vtx"  "file"
"models/dimidrol/transport/uaz_my_konvert_01.mdl"  "file"
"models/dimidrol/transport/uaz_my_konvert_01.phy"  "file"
"models/dimidrol/transport/uaz_my_konvert_01.sw.vtx"  "file"
"models/dimidrol/transport/uaz_my_konvert_01.vvd"  "file"
"models/lenin_statues/leninstatue1.dx80.vtx"  "file"
"models/lenin_statues/leninstatue1.dx90.vtx"  "file"
"models/lenin_statues/leninstatue1.mdl"  "file"
"models/lenin_statues/leninstatue1.phy"  "file"
"models/lenin_statues/leninstatue1.sw.vtx"  "file"
"models/lenin_statues/leninstatue1.vvd"  "file"
"models/lenin_statues/leninstatue2.dx80.vtx"  "file"
"models/lenin_statues/leninstatue2.dx90.vtx"  "file"
"models/lenin_statues/leninstatue2.mdl"  "file"
"models/lenin_statues/leninstatue2.phy"  "file"
"models/lenin_statues/leninstatue2.sw.vtx"  "file"
"models/lenin_statues/leninstatue2.vvd"  "file"
"models/man/kvartal/outside_stolb_2.dx80.vtx"  "file"
"models/man/kvartal/outside_stolb_2.dx90.vtx"  "file"
"models/man/kvartal/outside_stolb_2.mdl"  "file"
"models/man/kvartal/outside_stolb_2.phy"  "file"
"models/man/kvartal/outside_stolb_2.sw.vtx"  "file"
"models/man/kvartal/outside_stolb_2.vvd"  "file"
"models/man/nature/nature_tree_06.dx80.vtx"  "file"
"models/man/nature/nature_tree_06.dx90.vtx"  "file"
"models/man/nature/nature_tree_06.mdl"  "file"
"models/man/nature/nature_tree_06.phy"  "file"
"models/man/nature/nature_tree_06.sw.vtx"  "file"
"models/man/nature/nature_tree_06.vvd"  "file"
"models/man/props/prop_truba_tez_01.dx80.vtx"  "file"
"models/man/props/prop_truba_tez_01.dx90.vtx"  "file"
"models/man/props/prop_truba_tez_01.mdl"  "file"
"models/man/props/prop_truba_tez_01.phy"  "file"
"models/man/props/prop_truba_tez_01.sw.vtx"  "file"
"models/man/props/prop_truba_tez_01.vvd"  "file"
"models/man/rf/outside_budka_tran_01.dx80.vtx"  "file"
"models/man/rf/outside_budka_tran_01.dx90.vtx"  "file"
"models/man/rf/outside_budka_tran_01.mdl"  "file"
"models/man/rf/outside_budka_tran_01.phy"  "file"
"models/man/rf/outside_budka_tran_01.sw.vtx"  "file"
"models/man/rf/outside_budka_tran_01.vvd"  "file"
"models/man/rf/outside_budka_tran_02.dx80.vtx"  "file"
"models/man/rf/outside_budka_tran_02.dx90.vtx"  "file"
"models/man/rf/outside_budka_tran_02.mdl"  "file"
"models/man/rf/outside_budka_tran_02.phy"  "file"
"models/man/rf/outside_budka_tran_02.sw.vtx"  "file"
"models/man/rf/outside_budka_tran_02.vvd"  "file"
"models/man/rf/outside_dom_hrushevka_02.dx80.vtx"  "file"
"models/man/rf/outside_dom_hrushevka_02.dx90.vtx"  "file"
"models/man/rf/outside_dom_hrushevka_02.mdl"  "file"
"models/man/rf/outside_dom_hrushevka_02.phy"  "file"
"models/man/rf/outside_dom_hrushevka_02.sw.vtx"  "file"
"models/man/rf/outside_dom_hrushevka_02.vvd"  "file"
"models/man/rf/outside_dom_korabl_01.dx80.vtx"  "file"
"models/man/rf/outside_dom_korabl_01.dx90.vtx"  "file"
"models/man/rf/outside_dom_korabl_01.mdl"  "file"
"models/man/rf/outside_dom_korabl_01.phy"  "file"
"models/man/rf/outside_dom_korabl_01.sw.vtx"  "file"
"models/man/rf/outside_dom_korabl_01.vvd"  "file"
"models/man/rf/outside_dom_to4ka_01.dx80.vtx"  "file"
"models/man/rf/outside_dom_to4ka_01.dx90.vtx"  "file"
"models/man/rf/outside_dom_to4ka_01.mdl"  "file"
"models/man/rf/outside_dom_to4ka_01.phy"  "file"
"models/man/rf/outside_dom_to4ka_01.sw.vtx"  "file"
"models/man/rf/outside_dom_to4ka_01.vvd"  "file"
"models/man/rf/outside_met_angar_01.dx80.vtx"  "file"
"models/man/rf/outside_met_angar_01.dx90.vtx"  "file"
"models/man/rf/outside_met_angar_01.mdl"  "file"
"models/man/rf/outside_met_angar_01.phy"  "file"
"models/man/rf/outside_met_angar_01.sw.vtx"  "file"
"models/man/rf/outside_met_angar_01.vvd"  "file"
"models/man/rf/outside_met_ostanovka_01.dx80.vtx"  "file"
"models/man/rf/outside_met_ostanovka_01.dx90.vtx"  "file"
"models/man/rf/outside_met_ostanovka_01.mdl"  "file"
"models/man/rf/outside_met_ostanovka_01.phy"  "file"
"models/man/rf/outside_met_ostanovka_01.sw.vtx"  "file"
"models/man/rf/outside_met_ostanovka_01.vvd"  "file"
"models/man/rf/prop_bet_roof_truba_01.dx80.vtx"  "file"
"models/man/rf/prop_bet_roof_truba_01.dx90.vtx"  "file"
"models/man/rf/prop_bet_roof_truba_01.mdl"  "file"
"models/man/rf/prop_bet_roof_truba_01.phy"  "file"
"models/man/rf/prop_bet_roof_truba_01.sw.vtx"  "file"
"models/man/rf/prop_bet_roof_truba_01.vvd"  "file"
"models/man/rf/prop_bet_vent_01.dx80.vtx"  "file"
"models/man/rf/prop_bet_vent_01.dx90.vtx"  "file"
"models/man/rf/prop_bet_vent_01.mdl"  "file"
"models/man/rf/prop_bet_vent_01.phy"  "file"
"models/man/rf/prop_bet_vent_01.sw.vtx"  "file"
"models/man/rf/prop_bet_vent_01.vvd"  "file"
"models/man/rf/prop_met_garage_01.dx80.vtx"  "file"
"models/man/rf/prop_met_garage_01.dx90.vtx"  "file"
"models/man/rf/prop_met_garage_01.mdl"  "file"
"models/man/rf/prop_met_garage_01.phy"  "file"
"models/man/rf/prop_met_garage_01.sw.vtx"  "file"
"models/man/rf/prop_met_garage_01.vvd"  "file"
"models/man/rf/prop_met_garage_02.dx80.vtx"  "file"
"models/man/rf/prop_met_garage_02.dx90.vtx"  "file"
"models/man/rf/prop_met_garage_02.mdl"  "file"
"models/man/rf/prop_met_garage_02.phy"  "file"
"models/man/rf/prop_met_garage_02.sw.vtx"  "file"
"models/man/rf/prop_met_garage_02.vvd"  "file"
"models/man/rf/prop_met_garage_03.dx80.vtx"  "file"
"models/man/rf/prop_met_garage_03.dx90.vtx"  "file"
"models/man/rf/prop_met_garage_03.mdl"  "file"
"models/man/rf/prop_met_garage_03.phy"  "file"
"models/man/rf/prop_met_garage_03.sw.vtx"  "file"
"models/man/rf/prop_met_garage_03.vvd"  "file"
"models/man/rf/prop_met_trashbox_02.dx80.vtx"  "file"
"models/man/rf/prop_met_trashbox_02.dx90.vtx"  "file"
"models/man/rf/prop_met_trashbox_02.mdl"  "file"
"models/man/rf/prop_met_trashbox_02.phy"  "file"
"models/man/rf/prop_met_trashbox_02.sw.vtx"  "file"
"models/man/rf/prop_met_trashbox_02.vvd"  "file"
"models/man/rf/prop_met_zabor_02.dx80.vtx"  "file"
"models/man/rf/prop_met_zabor_02.dx90.vtx"  "file"
"models/man/rf/prop_met_zabor_02.mdl"  "file"
"models/man/rf/prop_met_zabor_02.phy"  "file"
"models/man/rf/prop_met_zabor_02.sw.vtx"  "file"
"models/man/rf/prop_met_zabor_02.vvd"  "file"
"models/props/2etaz1.dx80.vtx"  "file"
"models/props/2etaz1.dx90.vtx"  "file"
"models/props/2etaz1.mdl"  "file"
"models/props/2etaz1.sw.vtx"  "file"
"models/props/2etaz1.vvd"  "file"
"models/props/2etaz2.dx80.vtx"  "file"
"models/props/2etaz2.dx90.vtx"  "file"
"models/props/2etaz2.mdl"  "file"
"models/props/2etaz2.sw.vtx"  "file"
"models/props/2etaz2.vvd"  "file"
"models/props_trainstation/train001_passenger.dx80.vtx"  "file"
"models/props_trainstation/train001_passenger.dx90.vtx"  "file"
"models/props_trainstation/train001_passenger.mdl"  "file"
"models/props_trainstation/train001_passenger.phy"  "file"
"models/props_trainstation/train001_passenger.sw.vtx"  "file"
"models/props_trainstation/train001_passenger.vvd"  "file"
"models/props_uboat/jed_ixb_boab.dx80.vtx"  "file"
"models/props_uboat/jed_ixb_boab.dx90.vtx"  "file"
"models/props_uboat/jed_ixb_boab.mdl"  "file"
"models/props_uboat/jed_ixb_boab.phy"  "file"
"models/props_uboat/jed_ixb_boab.sw.vtx"  "file"
"models/props_uboat/jed_ixb_boab.vvd"  "file"
"models/props_uboat/jed_ixb_hull.dx80.vtx"  "file"
"models/props_uboat/jed_ixb_hull.dx90.vtx"  "file"
"models/props_uboat/jed_ixb_hull.mdl"  "file"
"models/props_uboat/jed_ixb_hull.phy"  "file"
"models/props_uboat/jed_ixb_hull.sw.vtx"  "file"
"models/props_uboat/jed_ixb_hull.vvd"  "file"
"models/props_uboat/jed_ixb_miab.dx80.vtx"  "file"
"models/props_uboat/jed_ixb_miab.dx90.vtx"  "file"
"models/props_uboat/jed_ixb_miab.mdl"  "file"
"models/props_uboat/jed_ixb_miab.phy"  "file"
"models/props_uboat/jed_ixb_miab.sw.vtx"  "file"
"models/props_uboat/jed_ixb_miab.vvd"  "file"
"models/props_uboat/jed_ixb_stab.dx80.vtx"  "file"
"models/props_uboat/jed_ixb_stab.dx90.vtx"  "file"
"models/props_uboat/jed_ixb_stab.mdl"  "file"
"models/props_uboat/jed_ixb_stab.phy"  "file"
"models/props_uboat/jed_ixb_stab.sw.vtx"  "file"
"models/props_uboat/jed_ixb_stab.vvd"  "file"
"models/props_uboat/jed_ixb_twr.dx80.vtx"  "file"
"models/props_uboat/jed_ixb_twr.dx90.vtx"  "file"
"models/props_uboat/jed_ixb_twr.mdl"  "file"
"models/props_uboat/jed_ixb_twr.phy"  "file"
"models/props_uboat/jed_ixb_twr.sw.vtx"  "file"
"models/props_uboat/jed_ixb_twr.vvd"  "file"
"models/razor/tree01.dx80.vtx"  "file"
"models/razor/tree01.dx90.vtx"  "file"
"models/razor/tree01.mdl"  "file"
"models/razor/tree01.phy"  "file"
"models/razor/tree01.sw.vtx"  "file"
"models/razor/tree01.vvd"  "file"
"models/razor/vagon01.dx80.vtx"  "file"
"models/razor/vagon01.dx90.vtx"  "file"
"models/razor/vagon01.mdl"  "file"
"models/razor/vagon01.phy"  "file"
"models/razor/vagon01.sw.vtx"  "file"
"models/razor/vagon01.vvd"  "file"
"models/renafox/cleancars/car002b.dx80.vtx"  "file"
"models/renafox/cleancars/car002b.dx90.vtx"  "file"
"models/renafox/cleancars/car002b.mdl"  "file"
"models/renafox/cleancars/car002b.phy"  "file"
"models/renafox/cleancars/car002b.sw.vtx"  "file"
"models/renafox/cleancars/car002b.vvd"  "file"
"models/renafox/cleancars/car004.dx80.vtx"  "file"
"models/renafox/cleancars/car004.dx90.vtx"  "file"
"models/renafox/cleancars/car004.mdl"  "file"
"models/renafox/cleancars/car004.phy"  "file"
"models/renafox/cleancars/car004.sw.vtx"  "file"
"models/renafox/cleancars/car004.vvd"  "file"
"models/renafox/cleancars/car005.dx80.vtx"  "file"
"models/renafox/cleancars/car005.dx90.vtx"  "file"
"models/renafox/cleancars/car005.mdl"  "file"
"models/renafox/cleancars/car005.phy"  "file"
"models/renafox/cleancars/car005.sw.vtx"  "file"
"models/renafox/cleancars/car005.vvd"  "file"
"models/renafox/cleancars/car006.dx80.vtx"  "file"
"models/renafox/cleancars/car006.dx90.vtx"  "file"
"models/renafox/cleancars/car006.mdl"  "file"
"models/renafox/cleancars/car006.phy"  "file"
"models/renafox/cleancars/car006.sw.vtx"  "file"
"models/renafox/cleancars/car006.vvd"  "file"
"models/renafox/cleancars/truck_001.dx80.vtx"  "file"
"models/renafox/cleancars/truck_001.dx90.vtx"  "file"
"models/renafox/cleancars/truck_001.mdl"  "file"
"models/renafox/cleancars/truck_001.phy"  "file"
"models/renafox/cleancars/truck_001.sw.vtx"  "file"
"models/renafox/cleancars/truck_001.vvd"  "file"
"models/renafox/cleancars/truck_003.dx80.vtx"  "file"
"models/renafox/cleancars/truck_003.dx90.vtx"  "file"
"models/renafox/cleancars/truck_003.mdl"  "file"
"models/renafox/cleancars/truck_003.phy"  "file"
"models/renafox/cleancars/truck_003.sw.vtx"  "file"
"models/renafox/cleancars/truck_003.vvd"  "file"
"models/renafox/mw2/coupe.dx80.vtx"  "file"
"models/renafox/mw2/coupe.dx90.vtx"  "file"
"models/renafox/mw2/coupe.mdl"  "file"
"models/renafox/mw2/coupe.phy"  "file"
"models/renafox/mw2/coupe.sw.vtx"  "file"
"models/renafox/mw2/coupe.vvd"  "file"
"models/renafox/mw2/hatchback.dx80.vtx"  "file"
"models/renafox/mw2/hatchback.dx90.vtx"  "file"
"models/renafox/mw2/hatchback.mdl"  "file"
"models/renafox/mw2/hatchback.phy"  "file"
"models/renafox/mw2/hatchback.sw.vtx"  "file"
"models/renafox/mw2/hatchback.vvd"  "file"
"models/renafox/mw2/sedan.dx80.vtx"  "file"
"models/renafox/mw2/sedan.dx90.vtx"  "file"
"models/renafox/mw2/sedan.mdl"  "file"
"models/renafox/mw2/sedan.phy"  "file"
"models/renafox/mw2/sedan.sw.vtx"  "file"
"models/renafox/mw2/sedan.vvd"  "file"
"models/renafox/mw2/wagon.dx80.vtx"  "file"
"models/renafox/mw2/wagon.dx90.vtx"  "file"
"models/renafox/mw2/wagon.mdl"  "file"
"models/renafox/mw2/wagon.phy"  "file"
"models/renafox/mw2/wagon.sw.vtx"  "file"
"models/renafox/mw2/wagon.vvd"  "file"
"models/rusigns/stoptab.dx80.vtx"  "file"
"models/rusigns/stoptab.dx90.vtx"  "file"
"models/rusigns/stoptab.mdl"  "file"
"models/rusigns/stoptab.phy"  "file"
"models/rusigns/stoptab.sw.vtx"  "file"
"models/rusigns/stoptab.vvd"  "file"
"models/rusty/hatchback/hl2_hatchback_restored.dx80.vtx"  "file"
"models/rusty/hatchback/hl2_hatchback_restored.dx90.vtx"  "file"
"models/rusty/hatchback/hl2_hatchback_restored.mdl"  "file"
"models/rusty/hatchback/hl2_hatchback_restored.phy"  "file"
"models/rusty/hatchback/hl2_hatchback_restored.sw.vtx"  "file"
"models/rusty/hatchback/hl2_hatchback_restored.vvd"  "file"
"models/rusty/van/hl2_van_restored.dx80.vtx"  "file"
"models/rusty/van/hl2_van_restored.dx90.vtx"  "file"
"models/rusty/van/hl2_van_restored.mdl"  "file"
"models/rusty/van/hl2_van_restored.phy"  "file"
"models/rusty/van/hl2_van_restored.sw.vtx"  "file"
"models/rusty/van/hl2_van_restored.vvd"  "file"
"models/saidmodels/molokovoz.dx80.vtx"  "file"
"models/saidmodels/molokovoz.dx90.vtx"  "file"
"models/saidmodels/molokovoz.mdl"  "file"
"models/saidmodels/molokovoz.phy"  "file"
"models/saidmodels/molokovoz.sw.vtx"  "file"
"models/saidmodels/molokovoz.vvd"  "file"
"models/saidmodels/zil.dx80.vtx"  "file"
"models/saidmodels/zil.dx90.vtx"  "file"
"models/saidmodels/zil.mdl"  "file"
"models/saidmodels/zil.phy"  "file"
"models/saidmodels/zil.sw.vtx"  "file"
"models/saidmodels/zil.vvd"  "file"
"models/test/little_sosna.dx80.vtx"  "file"
"models/test/little_sosna.dx90.vtx"  "file"
"models/test/little_sosna.mdl"  "file"
"models/test/little_sosna.phy"  "file"
"models/test/little_sosna.sw.vtx"  "file"
"models/test/little_sosna.vvd"  "file"
"models/trakpak/1gauge/bumper.dx80.vtx"  "file"
"models/trakpak/1gauge/bumper.dx90.vtx"  "file"
"models/trakpak/1gauge/bumper.mdl"  "file"
"models/trakpak/1gauge/bumper.phy"  "file"
"models/trakpak/1gauge/bumper.sw.vtx"  "file"
"models/trakpak/1gauge/bumper.vvd"  "file"
"models/trakpak2/curves/r1536/bend_256_left.dx80.vtx"  "file"
"models/trakpak2/curves/r1536/bend_256_left.dx90.vtx"  "file"
"models/trakpak2/curves/r1536/bend_256_left.mdl"  "file"
"models/trakpak2/curves/r1536/bend_256_left.phy"  "file"
"models/trakpak2/curves/r1536/bend_256_left.sw.vtx"  "file"
"models/trakpak2/curves/r1536/bend_256_left.vvd"  "file"
"models/trakpak2/curves/r1536/left_90.dx80.vtx"  "file"
"models/trakpak2/curves/r1536/left_90.dx90.vtx"  "file"
"models/trakpak2/curves/r1536/left_90.mdl"  "file"
"models/trakpak2/curves/r1536/left_90.phy"  "file"
"models/trakpak2/curves/r1536/left_90.sw.vtx"  "file"
"models/trakpak2/curves/r1536/left_90.vvd"  "file"
"models/trakpak2/grades/s0512_16.dx80.vtx"  "file"
"models/trakpak2/grades/s0512_16.dx90.vtx"  "file"
"models/trakpak2/grades/s0512_16.mdl"  "file"
"models/trakpak2/grades/s0512_16.phy"  "file"
"models/trakpak2/grades/s0512_16.sw.vtx"  "file"
"models/trakpak2/grades/s0512_16.vvd"  "file"
"models/trakpak2/groundthrows/throw_4_righthand.dx80.vtx"  "file"
"models/trakpak2/groundthrows/throw_4_righthand.dx90.vtx"  "file"
"models/trakpak2/groundthrows/throw_4_righthand.mdl"  "file"
"models/trakpak2/groundthrows/throw_4_righthand.phy"  "file"
"models/trakpak2/groundthrows/throw_4_righthand.sw.vtx"  "file"
"models/trakpak2/groundthrows/throw_4_righthand.vvd"  "file"
"models/trakpak2/straights/s0128.dx80.vtx"  "file"
"models/trakpak2/straights/s0128.dx90.vtx"  "file"
"models/trakpak2/straights/s0128.mdl"  "file"
"models/trakpak2/straights/s0128.phy"  "file"
"models/trakpak2/straights/s0128.sw.vtx"  "file"
"models/trakpak2/straights/s0128.vvd"  "file"
"models/trakpak2/straights/s0256.dx80.vtx"  "file"
"models/trakpak2/straights/s0256.dx90.vtx"  "file"
"models/trakpak2/straights/s0256.mdl"  "file"
"models/trakpak2/straights/s0256.phy"  "file"
"models/trakpak2/straights/s0256.sw.vtx"  "file"
"models/trakpak2/straights/s0256.vvd"  "file"
"models/trakpak2/straights/s0384.dx80.vtx"  "file"
"models/trakpak2/straights/s0384.dx90.vtx"  "file"
"models/trakpak2/straights/s0384.mdl"  "file"
"models/trakpak2/straights/s0384.phy"  "file"
"models/trakpak2/straights/s0384.sw.vtx"  "file"
"models/trakpak2/straights/s0384.vvd"  "file"
"models/trakpak2/straights/s0512.dx80.vtx"  "file"
"models/trakpak2/straights/s0512.dx90.vtx"  "file"
"models/trakpak2/straights/s0512.mdl"  "file"
"models/trakpak2/straights/s0512.phy"  "file"
"models/trakpak2/straights/s0512.sw.vtx"  "file"
"models/trakpak2/straights/s0512.vvd"  "file"
"models/trakpak2/straights/s0768.dx80.vtx"  "file"
"models/trakpak2/straights/s0768.dx90.vtx"  "file"
"models/trakpak2/straights/s0768.mdl"  "file"
"models/trakpak2/straights/s0768.phy"  "file"
"models/trakpak2/straights/s0768.sw.vtx"  "file"
"models/trakpak2/straights/s0768.vvd"  "file"
"models/trakpak2/straights/s1024.dx80.vtx"  "file"
"models/trakpak2/straights/s1024.dx90.vtx"  "file"
"models/trakpak2/straights/s1024.mdl"  "file"
"models/trakpak2/straights/s1024.phy"  "file"
"models/trakpak2/straights/s1024.sw.vtx"  "file"
"models/trakpak2/straights/s1024.vvd"  "file"
"models/trakpak2/straights/s2048.dx80.vtx"  "file"
"models/trakpak2/straights/s2048.dx90.vtx"  "file"
"models/trakpak2/straights/s2048.mdl"  "file"
"models/trakpak2/straights/s2048.phy"  "file"
"models/trakpak2/straights/s2048.sw.vtx"  "file"
"models/trakpak2/straights/s2048.vvd"  "file"
"models/trakpak2/straights/s3072.dx80.vtx"  "file"
"models/trakpak2/straights/s3072.dx90.vtx"  "file"
"models/trakpak2/straights/s3072.mdl"  "file"
"models/trakpak2/straights/s3072.phy"  "file"
"models/trakpak2/straights/s3072.sw.vtx"  "file"
"models/trakpak2/straights/s3072.vvd"  "file"
"models/trakpak2/straights/s4096.dx80.vtx"  "file"
"models/trakpak2/straights/s4096.dx90.vtx"  "file"
"models/trakpak2/straights/s4096.mdl"  "file"
"models/trakpak2/straights/s4096.phy"  "file"
"models/trakpak2/straights/s4096.sw.vtx"  "file"
"models/trakpak2/straights/s4096.vvd"  "file"
"models/trakpak2/straights/s8192.dx80.vtx"  "file"
"models/trakpak2/straights/s8192.dx90.vtx"  "file"
"models/trakpak2/straights/s8192.mdl"  "file"
"models/trakpak2/straights/s8192.phy"  "file"
"models/trakpak2/straights/s8192.sw.vtx"  "file"
"models/trakpak2/straights/s8192.vvd"  "file"
"models/trakpak2/turnouts/r1536/left_siding_dv.dx80.vtx"  "file"
"models/trakpak2/turnouts/r1536/left_siding_dv.dx90.vtx"  "file"
"models/trakpak2/turnouts/r1536/left_siding_dv.mdl"  "file"
"models/trakpak2/turnouts/r1536/left_siding_dv.phy"  "file"
"models/trakpak2/turnouts/r1536/left_siding_dv.sw.vtx"  "file"
"models/trakpak2/turnouts/r1536/left_siding_dv.vvd"  "file"
"models/trakpak2/turnouts/r1536/left_siding_mn.dx80.vtx"  "file"
"models/trakpak2/turnouts/r1536/left_siding_mn.dx90.vtx"  "file"
"models/trakpak2/turnouts/r1536/left_siding_mn.mdl"  "file"
"models/trakpak2/turnouts/r1536/left_siding_mn.phy"  "file"
"models/trakpak2/turnouts/r1536/left_siding_mn.sw.vtx"  "file"
"models/trakpak2/turnouts/r1536/left_siding_mn.vvd"  "file"
"models/trakpak2/turnouts/r1536/right_siding_dv.dx80.vtx"  "file"
"models/trakpak2/turnouts/r1536/right_siding_dv.dx90.vtx"  "file"
"models/trakpak2/turnouts/r1536/right_siding_dv.mdl"  "file"
"models/trakpak2/turnouts/r1536/right_siding_dv.phy"  "file"
"models/trakpak2/turnouts/r1536/right_siding_dv.sw.vtx"  "file"
"models/trakpak2/turnouts/r1536/right_siding_dv.vvd"  "file"
"models/trakpak2/turnouts/r1536/right_siding_mn.dx80.vtx"  "file"
"models/trakpak2/turnouts/r1536/right_siding_mn.dx90.vtx"  "file"
"models/trakpak2/turnouts/r1536/right_siding_mn.mdl"  "file"
"models/trakpak2/turnouts/r1536/right_siding_mn.phy"  "file"
"models/trakpak2/turnouts/r1536/right_siding_mn.sw.vtx"  "file"
"models/trakpak2/turnouts/r1536/right_siding_mn.vvd"  "file"
"models/z-o-m-b-i-e/metro_2033/props/m_33_turniket_01.dx80.vtx"  "file"
"models/z-o-m-b-i-e/metro_2033/props/m_33_turniket_01.dx90.vtx"  "file"
"models/z-o-m-b-i-e/metro_2033/props/m_33_turniket_01.mdl"  "file"
"models/z-o-m-b-i-e/metro_2033/props/m_33_turniket_01.phy"  "file"
"models/z-o-m-b-i-e/metro_2033/props/m_33_turniket_01.sw.vtx"  "file"
"models/z-o-m-b-i-e/metro_2033/props/m_33_turniket_01.vvd"  "file"
"models/z-o-m-b-i-e/stalker/st_budka_03.dx80.vtx"  "file"
"models/z-o-m-b-i-e/stalker/st_budka_03.dx90.vtx"  "file"
"models/z-o-m-b-i-e/stalker/st_budka_03.mdl"  "file"
"models/z-o-m-b-i-e/stalker/st_budka_03.phy"  "file"
"models/z-o-m-b-i-e/stalker/st_budka_03.sw.vtx"  "file"
"models/z-o-m-b-i-e/stalker/st_budka_03.vvd"  "file"
"models/z-o-m-b-i-e/st_car_02.dx80.vtx"  "file"
"models/z-o-m-b-i-e/st_car_02.dx90.vtx"  "file"
"models/z-o-m-b-i-e/st_car_02.mdl"  "file"
"models/z-o-m-b-i-e/st_car_02.phy"  "file"
"models/z-o-m-b-i-e/st_car_02.sw.vtx"  "file"
"models/z-o-m-b-i-e/st_car_02.vvd"  "file"
"models/z-o-m-b-i-e/st_garage_01_nodoors.dx80.vtx"  "file"
"models/z-o-m-b-i-e/st_garage_01_nodoors.dx90.vtx"  "file"
"models/z-o-m-b-i-e/st_garage_01_nodoors.mdl"  "file"
"models/z-o-m-b-i-e/st_garage_01_nodoors.phy"  "file"
"models/z-o-m-b-i-e/st_garage_01_nodoors.sw.vtx"  "file"
"models/z-o-m-b-i-e/st_garage_01_nodoors.vvd"  "file"

}