EESchema Schematic File Version 4
EELAYER 30 0
EELAYER END
$Descr A4 11693 8268
encoding utf-8
Sheet 1 1
Title ""
Date ""
Rev ""
Comp ""
Comment1 ""
Comment2 ""
Comment3 ""
Comment4 ""
$EndDescr
$Comp
L MCU_Module:WeMos_D1_mini U1
U 1 1 61716035
P 1500 3300
F 0 "U1" H 1900 2650 50  0000 C CNN
F 1 "WeMos_D1_mini" H 800 2650 50  0000 C CNN
F 2 "Module:WEMOS_D1_mini_light" H 1500 2150 50  0001 C CNN
F 3 "https://wiki.wemos.cc/products:d1:d1_mini#documentation" H -350 2150 50  0001 C CNN
	1    1500 3300
	1    0    0    -1  
$EndComp
$Comp
L Regulator_Linear:L7805 U2
U 1 1 61716CA3
P 2200 1400
F 0 "U2" H 2200 1642 50  0000 C CNN
F 1 "L7805" H 2200 1551 50  0000 C CNN
F 2 "" H 2225 1250 50  0001 L CIN
F 3 "http://www.st.com/content/ccc/resource/technical/document/datasheet/41/4f/b3/b0/12/d4/47/88/CD00000444.pdf/files/CD00000444.pdf/jcr:content/translations/en.CD00000444.pdf" H 2200 1350 50  0001 C CNN
	1    2200 1400
	1    0    0    -1  
$EndComp
$Comp
L Device:C C1
U 1 1 61716F38
P 1600 1550
F 0 "C1" H 1715 1596 50  0000 L CNN
F 1 "C" H 1715 1505 50  0000 L CNN
F 2 "" H 1638 1400 50  0001 C CNN
F 3 "~" H 1600 1550 50  0001 C CNN
	1    1600 1550
	1    0    0    -1  
$EndComp
$Comp
L Device:C C2
U 1 1 617172C9
P 2750 1550
F 0 "C2" H 2865 1596 50  0000 L CNN
F 1 "C" H 2865 1505 50  0000 L CNN
F 2 "" H 2788 1400 50  0001 C CNN
F 3 "~" H 2750 1550 50  0001 C CNN
	1    2750 1550
	1    0    0    -1  
$EndComp
$Comp
L power:+9V #PWR0101
U 1 1 61717774
P 1000 1350
F 0 "#PWR0101" H 1000 1200 50  0001 C CNN
F 1 "+9V" H 1015 1523 50  0000 C CNN
F 2 "" H 1000 1350 50  0001 C CNN
F 3 "" H 1000 1350 50  0001 C CNN
	1    1000 1350
	1    0    0    -1  
$EndComp
$Comp
L power:GND #PWR0102
U 1 1 61717D56
P 1600 1700
F 0 "#PWR0102" H 1600 1450 50  0001 C CNN
F 1 "GND" H 1605 1527 50  0000 C CNN
F 2 "" H 1600 1700 50  0001 C CNN
F 3 "" H 1600 1700 50  0001 C CNN
	1    1600 1700
	1    0    0    -1  
$EndComp
$Comp
L power:GND #PWR0103
U 1 1 6171807F
P 2200 1700
F 0 "#PWR0103" H 2200 1450 50  0001 C CNN
F 1 "GND" H 2205 1527 50  0000 C CNN
F 2 "" H 2200 1700 50  0001 C CNN
F 3 "" H 2200 1700 50  0001 C CNN
	1    2200 1700
	1    0    0    -1  
$EndComp
$Comp
L power:GND #PWR0104
U 1 1 617182C7
P 2750 1700
F 0 "#PWR0104" H 2750 1450 50  0001 C CNN
F 1 "GND" H 2755 1527 50  0000 C CNN
F 2 "" H 2750 1700 50  0001 C CNN
F 3 "" H 2750 1700 50  0001 C CNN
	1    2750 1700
	1    0    0    -1  
$EndComp
$Comp
L power:GND #PWR0105
U 1 1 6171852B
P 1500 4100
F 0 "#PWR0105" H 1500 3850 50  0001 C CNN
F 1 "GND" H 1505 3927 50  0000 C CNN
F 2 "" H 1500 4100 50  0001 C CNN
F 3 "" H 1500 4100 50  0001 C CNN
	1    1500 4100
	1    0    0    -1  
$EndComp
$Comp
L power:GND #PWR0106
U 1 1 617187AB
P 4300 3050
F 0 "#PWR0106" H 4300 2800 50  0001 C CNN
F 1 "GND" H 4305 2877 50  0000 C CNN
F 2 "" H 4300 3050 50  0001 C CNN
F 3 "" H 4300 3050 50  0001 C CNN
	1    4300 3050
	1    0    0    -1  
$EndComp
Wire Wire Line
	1000 1350 1000 1400
Wire Wire Line
	1600 1400 1900 1400
Wire Wire Line
	2500 1400 2750 1400
$Comp
L power:+5V #PWR0107
U 1 1 617195C6
P 2750 1400
F 0 "#PWR0107" H 2750 1250 50  0001 C CNN
F 1 "+5V" H 2765 1573 50  0000 C CNN
F 2 "" H 2750 1400 50  0001 C CNN
F 3 "" H 2750 1400 50  0001 C CNN
	1    2750 1400
	1    0    0    -1  
$EndComp
Connection ~ 2750 1400
$Comp
L Switch:SW_SPST SW1
U 1 1 61719E14
P 1300 1400
F 0 "SW1" H 1300 1635 50  0000 C CNN
F 1 "PWR" H 1300 1544 50  0000 C CNN
F 2 "" H 1300 1400 50  0001 C CNN
F 3 "~" H 1300 1400 50  0001 C CNN
	1    1300 1400
	1    0    0    -1  
$EndComp
Wire Wire Line
	1000 1400 1100 1400
Wire Wire Line
	1500 1400 1600 1400
Connection ~ 1600 1400
$Comp
L power:+5V #PWR0108
U 1 1 6171D7E4
P 1400 2500
F 0 "#PWR0108" H 1400 2350 50  0001 C CNN
F 1 "+5V" H 1415 2673 50  0000 C CNN
F 2 "" H 1400 2500 50  0001 C CNN
F 3 "" H 1400 2500 50  0001 C CNN
	1    1400 2500
	1    0    0    -1  
$EndComp
Text GLabel 1900 3200 2    50   Output ~ 0
Servo1
Text GLabel 1900 3300 2    50   Output ~ 0
Servo2
Text GLabel 1900 3500 2    50   Output ~ 0
Servo3
Text GLabel 1900 3600 2    50   Output ~ 0
Servo4
$Comp
L Connector:Conn_01x03_Male J3
U 1 1 6171EF2F
P 4100 2950
F 0 "J3" H 4208 3231 50  0000 C CNN
F 1 "Servo 2" H 4208 3140 50  0000 C CNN
F 2 "" H 4100 2950 50  0001 C CNN
F 3 "~" H 4100 2950 50  0001 C CNN
	1    4100 2950
	1    0    0    -1  
$EndComp
Text GLabel 4300 2850 2    50   Input ~ 0
Servo2
$Comp
L power:+5V #PWR0109
U 1 1 6171FEEC
P 4750 2950
F 0 "#PWR0109" H 4750 2800 50  0001 C CNN
F 1 "+5V" H 4765 3123 50  0000 C CNN
F 2 "" H 4750 2950 50  0001 C CNN
F 3 "" H 4750 2950 50  0001 C CNN
	1    4750 2950
	1    0    0    -1  
$EndComp
Wire Wire Line
	4300 2950 4750 2950
$Comp
L power:GND #PWR0110
U 1 1 617221BC
P 3350 3050
F 0 "#PWR0110" H 3350 2800 50  0001 C CNN
F 1 "GND" H 3355 2877 50  0000 C CNN
F 2 "" H 3350 3050 50  0001 C CNN
F 3 "" H 3350 3050 50  0001 C CNN
	1    3350 3050
	1    0    0    -1  
$EndComp
$Comp
L Connector:Conn_01x03_Male J1
U 1 1 617221C2
P 3150 2950
F 0 "J1" H 3258 3231 50  0000 C CNN
F 1 "Servo 1" H 3258 3140 50  0000 C CNN
F 2 "" H 3150 2950 50  0001 C CNN
F 3 "~" H 3150 2950 50  0001 C CNN
	1    3150 2950
	1    0    0    -1  
$EndComp
Text GLabel 3350 2850 2    50   Input ~ 0
Servo1
$Comp
L power:+5V #PWR0111
U 1 1 617221C9
P 3800 2950
F 0 "#PWR0111" H 3800 2800 50  0001 C CNN
F 1 "+5V" H 3815 3123 50  0000 C CNN
F 2 "" H 3800 2950 50  0001 C CNN
F 3 "" H 3800 2950 50  0001 C CNN
	1    3800 2950
	1    0    0    -1  
$EndComp
Wire Wire Line
	3350 2950 3800 2950
$Comp
L power:GND #PWR0112
U 1 1 617248FE
P 4300 3800
F 0 "#PWR0112" H 4300 3550 50  0001 C CNN
F 1 "GND" H 4305 3627 50  0000 C CNN
F 2 "" H 4300 3800 50  0001 C CNN
F 3 "" H 4300 3800 50  0001 C CNN
	1    4300 3800
	1    0    0    -1  
$EndComp
$Comp
L Connector:Conn_01x03_Male J4
U 1 1 61724904
P 4100 3700
F 0 "J4" H 4208 3981 50  0000 C CNN
F 1 "Servo 3" H 4208 3890 50  0000 C CNN
F 2 "" H 4100 3700 50  0001 C CNN
F 3 "~" H 4100 3700 50  0001 C CNN
	1    4100 3700
	1    0    0    -1  
$EndComp
Text GLabel 4300 3600 2    50   Input ~ 0
Servo3
$Comp
L power:+5V #PWR0113
U 1 1 6172490B
P 4750 3700
F 0 "#PWR0113" H 4750 3550 50  0001 C CNN
F 1 "+5V" H 4765 3873 50  0000 C CNN
F 2 "" H 4750 3700 50  0001 C CNN
F 3 "" H 4750 3700 50  0001 C CNN
	1    4750 3700
	1    0    0    -1  
$EndComp
Wire Wire Line
	4300 3700 4750 3700
$Comp
L power:GND #PWR0114
U 1 1 61724912
P 3350 3800
F 0 "#PWR0114" H 3350 3550 50  0001 C CNN
F 1 "GND" H 3355 3627 50  0000 C CNN
F 2 "" H 3350 3800 50  0001 C CNN
F 3 "" H 3350 3800 50  0001 C CNN
	1    3350 3800
	1    0    0    -1  
$EndComp
$Comp
L Connector:Conn_01x03_Male J2
U 1 1 61724918
P 3150 3700
F 0 "J2" H 3258 3981 50  0000 C CNN
F 1 "Servo 4" H 3258 3890 50  0000 C CNN
F 2 "" H 3150 3700 50  0001 C CNN
F 3 "~" H 3150 3700 50  0001 C CNN
	1    3150 3700
	1    0    0    -1  
$EndComp
Text GLabel 3350 3600 2    50   Input ~ 0
Servo4
$Comp
L power:+5V #PWR0115
U 1 1 6172491F
P 3800 3700
F 0 "#PWR0115" H 3800 3550 50  0001 C CNN
F 1 "+5V" H 3815 3873 50  0000 C CNN
F 2 "" H 3800 3700 50  0001 C CNN
F 3 "" H 3800 3700 50  0001 C CNN
	1    3800 3700
	1    0    0    -1  
$EndComp
Wire Wire Line
	3350 3700 3800 3700
$EndSCHEMATC
