<?xml version="1.0" standalone="no"?>
 <!DOCTYPE svg PUBLIC "-//W3C//DTD SVG 1.1//EN" 
 "http://www.w3.org/Graphics/SVG/1.1/DTD/svg11.dtd"> 
<svg
  xmlns:svg="http://www.w3.org/2000/svg"
  xmlns="http://www.w3.org/2000/svg"
  xmlns:xlink="http://www.w3.org/1999/xlink"
  version="1.1"
  width="29.700220cm" height="21.000720cm" viewBox="0 0 116930 82680">
<title>SVG Picture created as turtleboard.svg date 2021/10/21 14:37:34 </title>
  <desc>Picture generated by Eeschema-SVG </desc>
<g style="fill:#000000; fill-opacity:1;stroke:#000000; stroke-opacity:1;
stroke-linecap:round; stroke-linejoin:round;"
 transform="translate(0 0) scale(1 1)">
</g>
<g style="fill:#000000; fill-opacity:0.0; 
stroke:#000000; stroke-width:0; stroke-opacity:1; 
stroke-linecap:round; stroke-linejoin:round;">
<g >
</g>
<g style="fill:#840000; fill-opacity:0.0; 
stroke:#840000; stroke-width:0; stroke-opacity:1; 
stroke-linecap:round; stroke-linejoin:round;">
</g>
<g style="fill:#840000; fill-opacity:0.0; 
stroke:#840000; stroke-width:60; stroke-opacity:1; 
stroke-linecap:round; stroke-linejoin:round;">
<path style="fill:#840000; fill-opacity:0.0; 
stroke:#840000; stroke-width:60; stroke-opacity:1; 
stroke-linecap:round; stroke-linejoin:round;fill:none"
d="M 59700,22000
60000,21500
" /> 
<path style="fill:#840000; fill-opacity:0.0; 
stroke:#840000; stroke-width:60; stroke-opacity:1; 
stroke-linecap:round; stroke-linejoin:round;fill:none"
d="M 60000,22500
60000,21500
" /> 
<path style="fill:#840000; fill-opacity:0.0; 
stroke:#840000; stroke-width:60; stroke-opacity:1; 
stroke-linecap:round; stroke-linejoin:round;fill:none"
d="M 60000,21500
60300,22000
" /> 
</g>
<g style="fill:#008484; fill-opacity:0.0; 
stroke:#008484; stroke-width:60; stroke-opacity:1; 
stroke-linecap:round; stroke-linejoin:round;">
<text x="60150" y="21040"
textLength="1580" font-size="660" lengthAdjust="spacingAndGlyphs"
text-anchor="middle" opacity="0">+5V</text>
<path d="M59500 20820
L59880 20820
" />
<path d="M59690 21010
L59690 20630
" />
<path d="M60360 20510
L60120 20510
L60100 20750
L60120 20730
L60170 20700
L60290 20700
L60340 20730
L60360 20750
L60380 20800
L60380 20920
L60360 20960
L60340 20990
L60290 21010
L60170 21010
L60120 20990
L60100 20960
" />
<path d="M60530 20510
L60690 21010
L60860 20510
" />
</g>
</g>
<g style="fill:#008484; fill-opacity:0.0; 
stroke:#008484; stroke-width:0; stroke-opacity:1; 
stroke-linecap:round; stroke-linejoin:round;">
<g >
</g>
<g style="fill:#840000; fill-opacity:0.0; 
stroke:#840000; stroke-width:0; stroke-opacity:1; 
stroke-linecap:round; stroke-linejoin:round;">
</g>
<g style="fill:#840000; fill-opacity:0.0; 
stroke:#840000; stroke-width:60; stroke-opacity:1; 
stroke-linecap:round; stroke-linejoin:round;">
<path style="fill:#840000; fill-opacity:0.0; 
stroke:#840000; stroke-width:60; stroke-opacity:1; 
stroke-linecap:round; stroke-linejoin:round;fill:none"
d="M 79700,37500
80000,37000
" /> 
<path style="fill:#840000; fill-opacity:0.0; 
stroke:#840000; stroke-width:60; stroke-opacity:1; 
stroke-linecap:round; stroke-linejoin:round;fill:none"
d="M 80000,38000
80000,37000
" /> 
<path style="fill:#840000; fill-opacity:0.0; 
stroke:#840000; stroke-width:60; stroke-opacity:1; 
stroke-linecap:round; stroke-linejoin:round;fill:none"
d="M 80000,37000
80300,37500
" /> 
</g>
<g style="fill:#008484; fill-opacity:0.0; 
stroke:#008484; stroke-width:60; stroke-opacity:1; 
stroke-linecap:round; stroke-linejoin:round;">
<text x="80150" y="36540"
textLength="1580" font-size="660" lengthAdjust="spacingAndGlyphs"
text-anchor="middle" opacity="0">+5V</text>
<path d="M79500 36320
L79880 36320
" />
<path d="M79690 36510
L79690 36130
" />
<path d="M80360 36010
L80120 36010
L80100 36250
L80120 36230
L80170 36200
L80290 36200
L80340 36230
L80360 36250
L80380 36300
L80380 36420
L80360 36460
L80340 36490
L80290 36510
L80170 36510
L80120 36490
L80100 36460
" />
<path d="M80530 36010
L80690 36510
L80860 36010
" />
</g>
</g>
<g style="fill:#008484; fill-opacity:0.0; 
stroke:#008484; stroke-width:0; stroke-opacity:1; 
stroke-linecap:round; stroke-linejoin:round;">
<g >
</g>
<g style="fill:#840000; fill-opacity:0.0; 
stroke:#840000; stroke-width:0; stroke-opacity:1; 
stroke-linecap:round; stroke-linejoin:round;">
</g>
<g style="fill:#840000; fill-opacity:0.0; 
stroke:#840000; stroke-width:60; stroke-opacity:1; 
stroke-linecap:round; stroke-linejoin:round;">
<path style="fill:#840000; fill-opacity:0.0; 
stroke:#840000; stroke-width:60; stroke-opacity:1; 
stroke-linecap:round; stroke-linejoin:round;fill:none"
d="M 66000,39000
66000,39500
66500,39500
66000,40000
65500,39500
66000,39500
" /> 
</g>
<g style="fill:#008484; fill-opacity:0.0; 
stroke:#008484; stroke-width:60; stroke-opacity:1; 
stroke-linecap:round; stroke-linejoin:round;">
<text x="66050" y="41000"
textLength="1580" font-size="660" lengthAdjust="spacingAndGlyphs"
text-anchor="middle" opacity="0">GND</text>
<path d="M65660 40500
L65620 40470
L65550 40470
L65470 40500
L65430 40540
L65400 40590
L65380 40690
L65380 40760
L65400 40850
L65430 40900
L65470 40950
L65550 40970
L65590 40970
L65660 40950
L65690 40920
L65690 40760
L65590 40760
" />
<path d="M65900 40970
L65900 40470
L66190 40970
L66190 40470
" />
<path d="M66430 40970
L66430 40470
L66550 40470
L66620 40500
L66660 40540
L66690 40590
L66710 40690
L66710 40760
L66690 40850
L66660 40900
L66620 40950
L66550 40970
L66430 40970
" />
</g>
</g>
<g style="fill:#008484; fill-opacity:0.0; 
stroke:#008484; stroke-width:0; stroke-opacity:1; 
stroke-linecap:round; stroke-linejoin:round;">
<g >
</g>
<g style="fill:#840000; fill-opacity:0.0; 
stroke:#840000; stroke-width:0; stroke-opacity:1; 
stroke-linecap:round; stroke-linejoin:round;">
</g>
<g style="fill:#840000; fill-opacity:1.0; 
stroke:#840000; stroke-width:60; stroke-opacity:1; 
stroke-linecap:round; stroke-linejoin:round;">
<rect x="73500" y="38950" width="340" height="100" rx="0" />
<rect x="73500" y="37950" width="340" height="100" rx="0" />
<rect x="73500" y="36950" width="340" height="100" rx="0" />
</g>
<g style="fill:#840000; fill-opacity:0.0; 
stroke:#840000; stroke-width:60; stroke-opacity:1; 
stroke-linecap:round; stroke-linejoin:round;">
<path style="fill:#840000; fill-opacity:0.0; 
stroke:#840000; stroke-width:60; stroke-opacity:1; 
stroke-linecap:round; stroke-linejoin:round;fill:none"
d="M 74000,39000
73840,39000
" /> 
<path style="fill:#840000; fill-opacity:0.0; 
stroke:#840000; stroke-width:60; stroke-opacity:1; 
stroke-linecap:round; stroke-linejoin:round;fill:none"
d="M 74000,38000
73840,38000
" /> 
<path style="fill:#840000; fill-opacity:0.0; 
stroke:#840000; stroke-width:60; stroke-opacity:1; 
stroke-linecap:round; stroke-linejoin:round;fill:none"
d="M 74000,37000
73840,37000
" /> 
<path d="M74000 37000
L75500 37000
" />
<text x="74750" y="36900"
textLength="540" font-size="660" lengthAdjust="spacingAndGlyphs"
text-anchor="middle" opacity="0">1</text>
<path d="M74890 36870
L74600 36870
" />
<path d="M74750 36870
L74750 36370
L74700 36440
L74650 36490
L74600 36510
" />
<path d="M74000 38000
L75500 38000
" />
<text x="74750" y="37900"
textLength="540" font-size="660" lengthAdjust="spacingAndGlyphs"
text-anchor="middle" opacity="0">2</text>
<path d="M74600 37420
L74630 37400
L74670 37370
L74790 37370
L74840 37400
L74860 37420
L74890 37470
L74890 37510
L74860 37590
L74580 37870
L74890 37870
" />
<path d="M74000 39000
L75500 39000
" />
<text x="74750" y="38900"
textLength="540" font-size="660" lengthAdjust="spacingAndGlyphs"
text-anchor="middle" opacity="0">3</text>
<path d="M74580 38370
L74890 38370
L74720 38560
L74790 38560
L74840 38590
L74860 38610
L74890 38660
L74890 38780
L74860 38820
L74840 38850
L74790 38870
L74650 38870
L74600 38850
L74580 38820
" />
</g>
<g style="fill:#008484; fill-opacity:0.0; 
stroke:#008484; stroke-width:60; stroke-opacity:1; 
stroke-linecap:round; stroke-linejoin:round;">
<text x="74580" y="35460"
textLength="920" font-size="660" lengthAdjust="spacingAndGlyphs"
text-anchor="middle" opacity="0">J3</text>
<path d="M74410 34930
L74410 35290
L74380 35360
L74340 35410
L74270 35430
L74220 35430
" />
<path d="M74600 34930
L74910 34930
L74740 35120
L74810 35120
L74860 35150
L74880 35170
L74910 35220
L74910 35340
L74880 35380
L74860 35410
L74810 35430
L74670 35430
L74620 35410
L74600 35380
" />
<text x="74580" y="36370"
textLength="2960" font-size="660" lengthAdjust="spacingAndGlyphs"
text-anchor="middle" opacity="0">Servo 2</text>
<path d="M73220 36320
L73290 36340
L73410 36340
L73460 36320
L73480 36290
L73500 36250
L73500 36200
L73480 36150
L73460 36130
L73410 36100
L73310 36080
L73270 36060
L73240 36030
L73220 35980
L73220 35940
L73240 35890
L73270 35870
L73310 35840
L73430 35840
L73500 35870
" />
<path d="M73910 36320
L73860 36340
L73770 36340
L73720 36320
L73690 36270
L73690 36080
L73720 36030
L73770 36010
L73860 36010
L73910 36030
L73930 36080
L73930 36130
L73690 36170
" />
<path d="M74150 36340
L74150 36010
" />
<path d="M74150 36100
L74170 36060
L74190 36030
L74240 36010
L74290 36010
" />
<path d="M74410 36010
L74530 36340
L74650 36010
" />
<path d="M74910 36340
L74860 36320
L74840 36290
L74810 36250
L74810 36100
L74840 36060
L74860 36030
L74910 36010
L74980 36010
L75030 36030
L75050 36060
L75080 36100
L75080 36250
L75050 36290
L75030 36320
L74980 36340
L74910 36340
" />
<path d="M75650 35890
L75670 35870
L75720 35840
L75840 35840
L75880 35870
L75910 35890
L75930 35940
L75930 35980
L75910 36060
L75620 36340
L75930 36340
" />
</g>
</g>
<g style="fill:#008484; fill-opacity:0.0; 
stroke:#008484; stroke-width:0; stroke-opacity:1; 
stroke-linecap:round; stroke-linejoin:round;">
<g >
</g>
<g style="fill:#840000; fill-opacity:0.0; 
stroke:#840000; stroke-width:0; stroke-opacity:1; 
stroke-linecap:round; stroke-linejoin:round;">
</g>
<g style="fill:#840000; fill-opacity:1.0; 
stroke:#840000; stroke-width:60; stroke-opacity:1; 
stroke-linecap:round; stroke-linejoin:round;">
<rect x="64000" y="38950" width="340" height="100" rx="0" />
<rect x="64000" y="37950" width="340" height="100" rx="0" />
<rect x="64000" y="36950" width="340" height="100" rx="0" />
</g>
<g style="fill:#840000; fill-opacity:0.0; 
stroke:#840000; stroke-width:60; stroke-opacity:1; 
stroke-linecap:round; stroke-linejoin:round;">
<path style="fill:#840000; fill-opacity:0.0; 
stroke:#840000; stroke-width:60; stroke-opacity:1; 
stroke-linecap:round; stroke-linejoin:round;fill:none"
d="M 64500,39000
64340,39000
" /> 
<path style="fill:#840000; fill-opacity:0.0; 
stroke:#840000; stroke-width:60; stroke-opacity:1; 
stroke-linecap:round; stroke-linejoin:round;fill:none"
d="M 64500,38000
64340,38000
" /> 
<path style="fill:#840000; fill-opacity:0.0; 
stroke:#840000; stroke-width:60; stroke-opacity:1; 
stroke-linecap:round; stroke-linejoin:round;fill:none"
d="M 64500,37000
64340,37000
" /> 
<path d="M64500 37000
L66000 37000
" />
<text x="65250" y="36900"
textLength="540" font-size="660" lengthAdjust="spacingAndGlyphs"
text-anchor="middle" opacity="0">1</text>
<path d="M65390 36870
L65100 36870
" />
<path d="M65250 36870
L65250 36370
L65200 36440
L65150 36490
L65100 36510
" />
<path d="M64500 38000
L66000 38000
" />
<text x="65250" y="37900"
textLength="540" font-size="660" lengthAdjust="spacingAndGlyphs"
text-anchor="middle" opacity="0">2</text>
<path d="M65100 37420
L65130 37400
L65170 37370
L65290 37370
L65340 37400
L65360 37420
L65390 37470
L65390 37510
L65360 37590
L65080 37870
L65390 37870
" />
<path d="M64500 39000
L66000 39000
" />
<text x="65250" y="38900"
textLength="540" font-size="660" lengthAdjust="spacingAndGlyphs"
text-anchor="middle" opacity="0">3</text>
<path d="M65080 38370
L65390 38370
L65220 38560
L65290 38560
L65340 38590
L65360 38610
L65390 38660
L65390 38780
L65360 38820
L65340 38850
L65290 38870
L65150 38870
L65100 38850
L65080 38820
" />
</g>
<g style="fill:#008484; fill-opacity:0.0; 
stroke:#008484; stroke-width:60; stroke-opacity:1; 
stroke-linecap:round; stroke-linejoin:round;">
<text x="65080" y="35460"
textLength="920" font-size="660" lengthAdjust="spacingAndGlyphs"
text-anchor="middle" opacity="0">J1</text>
<path d="M64910 34930
L64910 35290
L64880 35360
L64840 35410
L64770 35430
L64720 35430
" />
<path d="M65410 35430
L65120 35430
" />
<path d="M65270 35430
L65270 34930
L65220 35000
L65170 35050
L65120 35070
" />
<text x="65080" y="36370"
textLength="2960" font-size="660" lengthAdjust="spacingAndGlyphs"
text-anchor="middle" opacity="0">Servo 1</text>
<path d="M63720 36320
L63790 36340
L63910 36340
L63960 36320
L63980 36290
L64000 36250
L64000 36200
L63980 36150
L63960 36130
L63910 36100
L63810 36080
L63770 36060
L63740 36030
L63720 35980
L63720 35940
L63740 35890
L63770 35870
L63810 35840
L63930 35840
L64000 35870
" />
<path d="M64410 36320
L64360 36340
L64270 36340
L64220 36320
L64190 36270
L64190 36080
L64220 36030
L64270 36010
L64360 36010
L64410 36030
L64430 36080
L64430 36130
L64190 36170
" />
<path d="M64650 36340
L64650 36010
" />
<path d="M64650 36100
L64670 36060
L64690 36030
L64740 36010
L64790 36010
" />
<path d="M64910 36010
L65030 36340
L65150 36010
" />
<path d="M65410 36340
L65360 36320
L65340 36290
L65310 36250
L65310 36100
L65340 36060
L65360 36030
L65410 36010
L65480 36010
L65530 36030
L65550 36060
L65580 36100
L65580 36250
L65550 36290
L65530 36320
L65480 36340
L65410 36340
" />
<path d="M66430 36340
L66150 36340
" />
<path d="M66290 36340
L66290 35840
L66240 35910
L66190 35960
L66150 35980
" />
</g>
</g>
<g style="fill:#008484; fill-opacity:0.0; 
stroke:#008484; stroke-width:0; stroke-opacity:1; 
stroke-linecap:round; stroke-linejoin:round;">
<g >
</g>
<g style="fill:#840000; fill-opacity:0.0; 
stroke:#840000; stroke-width:0; stroke-opacity:1; 
stroke-linecap:round; stroke-linejoin:round;">
</g>
<g style="fill:#840000; fill-opacity:0.0; 
stroke:#840000; stroke-width:60; stroke-opacity:1; 
stroke-linecap:round; stroke-linejoin:round;">
<path style="fill:#840000; fill-opacity:0.0; 
stroke:#840000; stroke-width:60; stroke-opacity:1; 
stroke-linecap:round; stroke-linejoin:round;fill:none"
d="M 70200,37500
70500,37000
" /> 
<path style="fill:#840000; fill-opacity:0.0; 
stroke:#840000; stroke-width:60; stroke-opacity:1; 
stroke-linecap:round; stroke-linejoin:round;fill:none"
d="M 70500,38000
70500,37000
" /> 
<path style="fill:#840000; fill-opacity:0.0; 
stroke:#840000; stroke-width:60; stroke-opacity:1; 
stroke-linecap:round; stroke-linejoin:round;fill:none"
d="M 70500,37000
70800,37500
" /> 
</g>
<g style="fill:#008484; fill-opacity:0.0; 
stroke:#008484; stroke-width:60; stroke-opacity:1; 
stroke-linecap:round; stroke-linejoin:round;">
<text x="70650" y="36540"
textLength="1580" font-size="660" lengthAdjust="spacingAndGlyphs"
text-anchor="middle" opacity="0">+5V</text>
<path d="M70000 36320
L70380 36320
" />
<path d="M70190 36510
L70190 36130
" />
<path d="M70860 36010
L70620 36010
L70600 36250
L70620 36230
L70670 36200
L70790 36200
L70840 36230
L70860 36250
L70880 36300
L70880 36420
L70860 36460
L70840 36490
L70790 36510
L70670 36510
L70620 36490
L70600 36460
" />
<path d="M71030 36010
L71190 36510
L71360 36010
" />
</g>
</g>
<g style="fill:#008484; fill-opacity:0.0; 
stroke:#008484; stroke-width:0; stroke-opacity:1; 
stroke-linecap:round; stroke-linejoin:round;">
<g >
</g>
<g style="fill:#840000; fill-opacity:0.0; 
stroke:#840000; stroke-width:0; stroke-opacity:1; 
stroke-linecap:round; stroke-linejoin:round;">
</g>
<g style="fill:#840000; fill-opacity:0.0; 
stroke:#840000; stroke-width:60; stroke-opacity:1; 
stroke-linecap:round; stroke-linejoin:round;">
<path style="fill:#840000; fill-opacity:0.0; 
stroke:#840000; stroke-width:60; stroke-opacity:1; 
stroke-linecap:round; stroke-linejoin:round;fill:none"
d="M 75500,46500
75500,47000
76000,47000
75500,47500
75000,47000
75500,47000
" /> 
</g>
<g style="fill:#008484; fill-opacity:0.0; 
stroke:#008484; stroke-width:60; stroke-opacity:1; 
stroke-linecap:round; stroke-linejoin:round;">
<text x="75550" y="48500"
textLength="1580" font-size="660" lengthAdjust="spacingAndGlyphs"
text-anchor="middle" opacity="0">GND</text>
<path d="M75160 48000
L75120 47970
L75050 47970
L74970 48000
L74930 48040
L74900 48090
L74880 48190
L74880 48260
L74900 48350
L74930 48400
L74970 48450
L75050 48470
L75090 48470
L75160 48450
L75190 48420
L75190 48260
L75090 48260
" />
<path d="M75400 48470
L75400 47970
L75690 48470
L75690 47970
" />
<path d="M75930 48470
L75930 47970
L76050 47970
L76120 48000
L76160 48040
L76190 48090
L76210 48190
L76210 48260
L76190 48350
L76160 48400
L76120 48450
L76050 48470
L75930 48470
" />
</g>
</g>
<g style="fill:#008484; fill-opacity:0.0; 
stroke:#008484; stroke-width:0; stroke-opacity:1; 
stroke-linecap:round; stroke-linejoin:round;">
<g >
</g>
<g style="fill:#840000; fill-opacity:0.0; 
stroke:#840000; stroke-width:0; stroke-opacity:1; 
stroke-linecap:round; stroke-linejoin:round;">
</g>
<g style="fill:#840000; fill-opacity:0.0; 
stroke:#840000; stroke-width:60; stroke-opacity:1; 
stroke-linecap:round; stroke-linejoin:round;">
<path style="fill:#840000; fill-opacity:0.0; 
stroke:#840000; stroke-width:60; stroke-opacity:1; 
stroke-linecap:round; stroke-linejoin:round;fill:none"
d="M 46200,33000
46500,32500
" /> 
<path style="fill:#840000; fill-opacity:0.0; 
stroke:#840000; stroke-width:60; stroke-opacity:1; 
stroke-linecap:round; stroke-linejoin:round;fill:none"
d="M 46500,33500
46500,32500
" /> 
<path style="fill:#840000; fill-opacity:0.0; 
stroke:#840000; stroke-width:60; stroke-opacity:1; 
stroke-linecap:round; stroke-linejoin:round;fill:none"
d="M 46500,32500
46800,33000
" /> 
</g>
<g style="fill:#008484; fill-opacity:0.0; 
stroke:#008484; stroke-width:60; stroke-opacity:1; 
stroke-linecap:round; stroke-linejoin:round;">
<text x="46650" y="32040"
textLength="1580" font-size="660" lengthAdjust="spacingAndGlyphs"
text-anchor="middle" opacity="0">+5V</text>
<path d="M46000 31820
L46380 31820
" />
<path d="M46190 32010
L46190 31630
" />
<path d="M46860 31510
L46620 31510
L46600 31750
L46620 31730
L46670 31700
L46790 31700
L46840 31730
L46860 31750
L46880 31800
L46880 31920
L46860 31960
L46840 31990
L46790 32010
L46670 32010
L46620 31990
L46600 31960
" />
<path d="M47030 31510
L47190 32010
L47360 31510
" />
</g>
</g>
<g style="fill:#008484; fill-opacity:0.0; 
stroke:#008484; stroke-width:0; stroke-opacity:1; 
stroke-linecap:round; stroke-linejoin:round;">
<g >
</g>
<g style="fill:#840000; fill-opacity:0.0; 
stroke:#840000; stroke-width:0; stroke-opacity:1; 
stroke-linecap:round; stroke-linejoin:round;">
</g>
<g style="fill:#840000; fill-opacity:1.0; 
stroke:#840000; stroke-width:60; stroke-opacity:1; 
stroke-linecap:round; stroke-linejoin:round;">
<rect x="73500" y="46450" width="340" height="100" rx="0" />
<rect x="73500" y="45450" width="340" height="100" rx="0" />
<rect x="73500" y="44450" width="340" height="100" rx="0" />
</g>
<g style="fill:#840000; fill-opacity:0.0; 
stroke:#840000; stroke-width:60; stroke-opacity:1; 
stroke-linecap:round; stroke-linejoin:round;">
<path style="fill:#840000; fill-opacity:0.0; 
stroke:#840000; stroke-width:60; stroke-opacity:1; 
stroke-linecap:round; stroke-linejoin:round;fill:none"
d="M 74000,46500
73840,46500
" /> 
<path style="fill:#840000; fill-opacity:0.0; 
stroke:#840000; stroke-width:60; stroke-opacity:1; 
stroke-linecap:round; stroke-linejoin:round;fill:none"
d="M 74000,45500
73840,45500
" /> 
<path style="fill:#840000; fill-opacity:0.0; 
stroke:#840000; stroke-width:60; stroke-opacity:1; 
stroke-linecap:round; stroke-linejoin:round;fill:none"
d="M 74000,44500
73840,44500
" /> 
<path d="M74000 44500
L75500 44500
" />
<text x="74750" y="44400"
textLength="540" font-size="660" lengthAdjust="spacingAndGlyphs"
text-anchor="middle" opacity="0">1</text>
<path d="M74890 44370
L74600 44370
" />
<path d="M74750 44370
L74750 43870
L74700 43940
L74650 43990
L74600 44010
" />
<path d="M74000 45500
L75500 45500
" />
<text x="74750" y="45400"
textLength="540" font-size="660" lengthAdjust="spacingAndGlyphs"
text-anchor="middle" opacity="0">2</text>
<path d="M74600 44920
L74630 44900
L74670 44870
L74790 44870
L74840 44900
L74860 44920
L74890 44970
L74890 45010
L74860 45090
L74580 45370
L74890 45370
" />
<path d="M74000 46500
L75500 46500
" />
<text x="74750" y="46400"
textLength="540" font-size="660" lengthAdjust="spacingAndGlyphs"
text-anchor="middle" opacity="0">3</text>
<path d="M74580 45870
L74890 45870
L74720 46060
L74790 46060
L74840 46090
L74860 46110
L74890 46160
L74890 46280
L74860 46320
L74840 46350
L74790 46370
L74650 46370
L74600 46350
L74580 46320
" />
</g>
<g style="fill:#008484; fill-opacity:0.0; 
stroke:#008484; stroke-width:60; stroke-opacity:1; 
stroke-linecap:round; stroke-linejoin:round;">
<text x="74580" y="42960"
textLength="920" font-size="660" lengthAdjust="spacingAndGlyphs"
text-anchor="middle" opacity="0">J4</text>
<path d="M74410 42430
L74410 42790
L74380 42860
L74340 42910
L74270 42930
L74220 42930
" />
<path d="M74860 42600
L74860 42930
" />
<path d="M74740 42410
L74620 42760
L74930 42760
" />
<text x="74580" y="43870"
textLength="2960" font-size="660" lengthAdjust="spacingAndGlyphs"
text-anchor="middle" opacity="0">Servo 3</text>
<path d="M73220 43820
L73290 43840
L73410 43840
L73460 43820
L73480 43790
L73500 43750
L73500 43700
L73480 43650
L73460 43630
L73410 43600
L73310 43580
L73270 43560
L73240 43530
L73220 43480
L73220 43440
L73240 43390
L73270 43370
L73310 43340
L73430 43340
L73500 43370
" />
<path d="M73910 43820
L73860 43840
L73770 43840
L73720 43820
L73690 43770
L73690 43580
L73720 43530
L73770 43510
L73860 43510
L73910 43530
L73930 43580
L73930 43630
L73690 43670
" />
<path d="M74150 43840
L74150 43510
" />
<path d="M74150 43600
L74170 43560
L74190 43530
L74240 43510
L74290 43510
" />
<path d="M74410 43510
L74530 43840
L74650 43510
" />
<path d="M74910 43840
L74860 43820
L74840 43790
L74810 43750
L74810 43600
L74840 43560
L74860 43530
L74910 43510
L74980 43510
L75030 43530
L75050 43560
L75080 43600
L75080 43750
L75050 43790
L75030 43820
L74980 43840
L74910 43840
" />
<path d="M75620 43340
L75930 43340
L75770 43530
L75840 43530
L75880 43560
L75910 43580
L75930 43630
L75930 43750
L75910 43790
L75880 43820
L75840 43840
L75690 43840
L75650 43820
L75620 43790
" />
</g>
</g>
<g style="fill:#008484; fill-opacity:0.0; 
stroke:#008484; stroke-width:0; stroke-opacity:1; 
stroke-linecap:round; stroke-linejoin:round;">
<g >
</g>
<g style="fill:#840000; fill-opacity:0.0; 
stroke:#840000; stroke-width:0; stroke-opacity:1; 
stroke-linecap:round; stroke-linejoin:round;">
</g>
<g style="fill:#840000; fill-opacity:0.0; 
stroke:#840000; stroke-width:60; stroke-opacity:1; 
stroke-linecap:round; stroke-linejoin:round;">
<path style="fill:#840000; fill-opacity:0.0; 
stroke:#840000; stroke-width:60; stroke-opacity:1; 
stroke-linecap:round; stroke-linejoin:round;fill:none"
d="M 79700,45000
80000,44500
" /> 
<path style="fill:#840000; fill-opacity:0.0; 
stroke:#840000; stroke-width:60; stroke-opacity:1; 
stroke-linecap:round; stroke-linejoin:round;fill:none"
d="M 80000,45500
80000,44500
" /> 
<path style="fill:#840000; fill-opacity:0.0; 
stroke:#840000; stroke-width:60; stroke-opacity:1; 
stroke-linecap:round; stroke-linejoin:round;fill:none"
d="M 80000,44500
80300,45000
" /> 
</g>
<g style="fill:#008484; fill-opacity:0.0; 
stroke:#008484; stroke-width:60; stroke-opacity:1; 
stroke-linecap:round; stroke-linejoin:round;">
<text x="80150" y="44040"
textLength="1580" font-size="660" lengthAdjust="spacingAndGlyphs"
text-anchor="middle" opacity="0">+5V</text>
<path d="M79500 43820
L79880 43820
" />
<path d="M79690 44010
L79690 43630
" />
<path d="M80360 43510
L80120 43510
L80100 43750
L80120 43730
L80170 43700
L80290 43700
L80340 43730
L80360 43750
L80380 43800
L80380 43920
L80360 43960
L80340 43990
L80290 44010
L80170 44010
L80120 43990
L80100 43960
" />
<path d="M80530 43510
L80690 44010
L80860 43510
" />
</g>
</g>
<g style="fill:#008484; fill-opacity:0.0; 
stroke:#008484; stroke-width:0; stroke-opacity:1; 
stroke-linecap:round; stroke-linejoin:round;">
<g >
</g>
<g style="fill:#840000; fill-opacity:0.0; 
stroke:#840000; stroke-width:0; stroke-opacity:1; 
stroke-linecap:round; stroke-linejoin:round;">
</g>
<g style="fill:#840000; fill-opacity:0.0; 
stroke:#840000; stroke-width:60; stroke-opacity:1; 
stroke-linecap:round; stroke-linejoin:round;">
<circle cx="44700" cy="22500" r="200" /> 
<circle cx="46300" cy="22500" r="200" /> 
<path style="fill:#840000; fill-opacity:0.0; 
stroke:#840000; stroke-width:60; stroke-opacity:1; 
stroke-linecap:round; stroke-linejoin:round;fill:none"
d="M 44900,22400
46100,21800
" /> 
<path d="M44500 22500
L43500 22500
" />
<text x="44000" y="23100"
textLength="540" font-size="660" lengthAdjust="spacingAndGlyphs"
text-anchor="middle" opacity="0">1</text>
<path d="M44140 23070
L43850 23070
" />
<path d="M44000 23070
L44000 22570
L43950 22640
L43900 22690
L43850 22710
" />
<path d="M46500 22500
L47500 22500
" />
<text x="47000" y="23100"
textLength="540" font-size="660" lengthAdjust="spacingAndGlyphs"
text-anchor="middle" opacity="0">2</text>
<path d="M46850 22620
L46880 22600
L46920 22570
L47040 22570
L47090 22600
L47110 22620
L47140 22670
L47140 22710
L47110 22790
L46830 23070
L47140 23070
" />
</g>
<g style="fill:#008484; fill-opacity:0.0; 
stroke:#008484; stroke-width:60; stroke-opacity:1; 
stroke-linecap:round; stroke-linejoin:round;">
<text x="45500" y="20420"
textLength="1580" font-size="660" lengthAdjust="spacingAndGlyphs"
text-anchor="middle" opacity="0">SW1</text>
<path d="M44830 20370
L44900 20390
L45020 20390
L45070 20370
L45090 20340
L45110 20300
L45110 20250
L45090 20200
L45070 20180
L45020 20150
L44920 20130
L44880 20110
L44850 20080
L44830 20030
L44830 19990
L44850 19940
L44880 19920
L44920 19890
L45040 19890
L45110 19920
" />
<path d="M45280 19890
L45400 20390
L45500 20030
L45590 20390
L45710 19890
" />
<path d="M46160 20390
L45880 20390
" />
<path d="M46020 20390
L46020 19890
L45970 19960
L45920 20010
L45880 20030
" />
<text x="45500" y="21330"
textLength="1630" font-size="660" lengthAdjust="spacingAndGlyphs"
text-anchor="middle" opacity="0">PWR</text>
<path d="M44830 21300
L44830 20800
L45020 20800
L45070 20830
L45090 20850
L45110 20900
L45110 20970
L45090 21020
L45070 21040
L45020 21060
L44830 21060
" />
<path d="M45280 20800
L45400 21300
L45500 20940
L45590 21300
L45710 20800
" />
<path d="M46190 21300
L46020 21060
" />
<path d="M45900 21300
L45900 20800
L46090 20800
L46140 20830
L46160 20850
L46190 20900
L46190 20970
L46160 21020
L46140 21040
L46090 21060
L45900 21060
" />
</g>
</g>
<g style="fill:#008484; fill-opacity:0.0; 
stroke:#008484; stroke-width:0; stroke-opacity:1; 
stroke-linecap:round; stroke-linejoin:round;">
<g >
</g>
<g style="fill:#840000; fill-opacity:0.0; 
stroke:#840000; stroke-width:0; stroke-opacity:1; 
stroke-linecap:round; stroke-linejoin:round;">
</g>
<g style="fill:#840000; fill-opacity:0.0; 
stroke:#840000; stroke-width:60; stroke-opacity:1; 
stroke-linecap:round; stroke-linejoin:round;">
<path style="fill:#840000; fill-opacity:0.0; 
stroke:#840000; stroke-width:60; stroke-opacity:1; 
stroke-linecap:round; stroke-linejoin:round;fill:none"
d="M 66000,46500
66000,47000
66500,47000
66000,47500
65500,47000
66000,47000
" /> 
</g>
<g style="fill:#008484; fill-opacity:0.0; 
stroke:#008484; stroke-width:60; stroke-opacity:1; 
stroke-linecap:round; stroke-linejoin:round;">
<text x="66050" y="48500"
textLength="1580" font-size="660" lengthAdjust="spacingAndGlyphs"
text-anchor="middle" opacity="0">GND</text>
<path d="M65660 48000
L65620 47970
L65550 47970
L65470 48000
L65430 48040
L65400 48090
L65380 48190
L65380 48260
L65400 48350
L65430 48400
L65470 48450
L65550 48470
L65590 48470
L65660 48450
L65690 48420
L65690 48260
L65590 48260
" />
<path d="M65900 48470
L65900 47970
L66190 48470
L66190 47970
" />
<path d="M66430 48470
L66430 47970
L66550 47970
L66620 48000
L66660 48040
L66690 48090
L66710 48190
L66710 48260
L66690 48350
L66660 48400
L66620 48450
L66550 48470
L66430 48470
" />
</g>
</g>
<g style="fill:#008484; fill-opacity:0.0; 
stroke:#008484; stroke-width:0; stroke-opacity:1; 
stroke-linecap:round; stroke-linejoin:round;">
<g >
</g>
<g style="fill:#840000; fill-opacity:0.0; 
stroke:#840000; stroke-width:0; stroke-opacity:1; 
stroke-linecap:round; stroke-linejoin:round;">
</g>
<g style="fill:#840000; fill-opacity:1.0; 
stroke:#840000; stroke-width:60; stroke-opacity:1; 
stroke-linecap:round; stroke-linejoin:round;">
<rect x="64000" y="46450" width="340" height="100" rx="0" />
<rect x="64000" y="45450" width="340" height="100" rx="0" />
<rect x="64000" y="44450" width="340" height="100" rx="0" />
</g>
<g style="fill:#840000; fill-opacity:0.0; 
stroke:#840000; stroke-width:60; stroke-opacity:1; 
stroke-linecap:round; stroke-linejoin:round;">
<path style="fill:#840000; fill-opacity:0.0; 
stroke:#840000; stroke-width:60; stroke-opacity:1; 
stroke-linecap:round; stroke-linejoin:round;fill:none"
d="M 64500,46500
64340,46500
" /> 
<path style="fill:#840000; fill-opacity:0.0; 
stroke:#840000; stroke-width:60; stroke-opacity:1; 
stroke-linecap:round; stroke-linejoin:round;fill:none"
d="M 64500,45500
64340,45500
" /> 
<path style="fill:#840000; fill-opacity:0.0; 
stroke:#840000; stroke-width:60; stroke-opacity:1; 
stroke-linecap:round; stroke-linejoin:round;fill:none"
d="M 64500,44500
64340,44500
" /> 
<path d="M64500 44500
L66000 44500
" />
<text x="65250" y="44400"
textLength="540" font-size="660" lengthAdjust="spacingAndGlyphs"
text-anchor="middle" opacity="0">1</text>
<path d="M65390 44370
L65100 44370
" />
<path d="M65250 44370
L65250 43870
L65200 43940
L65150 43990
L65100 44010
" />
<path d="M64500 45500
L66000 45500
" />
<text x="65250" y="45400"
textLength="540" font-size="660" lengthAdjust="spacingAndGlyphs"
text-anchor="middle" opacity="0">2</text>
<path d="M65100 44920
L65130 44900
L65170 44870
L65290 44870
L65340 44900
L65360 44920
L65390 44970
L65390 45010
L65360 45090
L65080 45370
L65390 45370
" />
<path d="M64500 46500
L66000 46500
" />
<text x="65250" y="46400"
textLength="540" font-size="660" lengthAdjust="spacingAndGlyphs"
text-anchor="middle" opacity="0">3</text>
<path d="M65080 45870
L65390 45870
L65220 46060
L65290 46060
L65340 46090
L65360 46110
L65390 46160
L65390 46280
L65360 46320
L65340 46350
L65290 46370
L65150 46370
L65100 46350
L65080 46320
" />
</g>
<g style="fill:#008484; fill-opacity:0.0; 
stroke:#008484; stroke-width:60; stroke-opacity:1; 
stroke-linecap:round; stroke-linejoin:round;">
<text x="65080" y="42960"
textLength="920" font-size="660" lengthAdjust="spacingAndGlyphs"
text-anchor="middle" opacity="0">J2</text>
<path d="M64910 42430
L64910 42790
L64880 42860
L64840 42910
L64770 42930
L64720 42930
" />
<path d="M65120 42480
L65150 42460
L65190 42430
L65310 42430
L65360 42460
L65380 42480
L65410 42530
L65410 42570
L65380 42650
L65100 42930
L65410 42930
" />
<text x="65080" y="43870"
textLength="2960" font-size="660" lengthAdjust="spacingAndGlyphs"
text-anchor="middle" opacity="0">Servo 4</text>
<path d="M63720 43820
L63790 43840
L63910 43840
L63960 43820
L63980 43790
L64000 43750
L64000 43700
L63980 43650
L63960 43630
L63910 43600
L63810 43580
L63770 43560
L63740 43530
L63720 43480
L63720 43440
L63740 43390
L63770 43370
L63810 43340
L63930 43340
L64000 43370
" />
<path d="M64410 43820
L64360 43840
L64270 43840
L64220 43820
L64190 43770
L64190 43580
L64220 43530
L64270 43510
L64360 43510
L64410 43530
L64430 43580
L64430 43630
L64190 43670
" />
<path d="M64650 43840
L64650 43510
" />
<path d="M64650 43600
L64670 43560
L64690 43530
L64740 43510
L64790 43510
" />
<path d="M64910 43510
L65030 43840
L65150 43510
" />
<path d="M65410 43840
L65360 43820
L65340 43790
L65310 43750
L65310 43600
L65340 43560
L65360 43530
L65410 43510
L65480 43510
L65530 43530
L65550 43560
L65580 43600
L65580 43750
L65550 43790
L65530 43820
L65480 43840
L65410 43840
" />
<path d="M66380 43510
L66380 43840
" />
<path d="M66270 43320
L66150 43670
L66460 43670
" />
</g>
</g>
<g style="fill:#008484; fill-opacity:0.0; 
stroke:#008484; stroke-width:0; stroke-opacity:1; 
stroke-linecap:round; stroke-linejoin:round;">
<g >
</g>
<g style="fill:#840000; fill-opacity:0.0; 
stroke:#840000; stroke-width:0; stroke-opacity:1; 
stroke-linecap:round; stroke-linejoin:round;">
</g>
<g style="fill:#840000; fill-opacity:0.0; 
stroke:#840000; stroke-width:60; stroke-opacity:1; 
stroke-linecap:round; stroke-linejoin:round;">
<path style="fill:#840000; fill-opacity:0.0; 
stroke:#840000; stroke-width:60; stroke-opacity:1; 
stroke-linecap:round; stroke-linejoin:round;fill:none"
d="M 70200,45000
70500,44500
" /> 
<path style="fill:#840000; fill-opacity:0.0; 
stroke:#840000; stroke-width:60; stroke-opacity:1; 
stroke-linecap:round; stroke-linejoin:round;fill:none"
d="M 70500,45500
70500,44500
" /> 
<path style="fill:#840000; fill-opacity:0.0; 
stroke:#840000; stroke-width:60; stroke-opacity:1; 
stroke-linecap:round; stroke-linejoin:round;fill:none"
d="M 70500,44500
70800,45000
" /> 
</g>
<g style="fill:#008484; fill-opacity:0.0; 
stroke:#008484; stroke-width:60; stroke-opacity:1; 
stroke-linecap:round; stroke-linejoin:round;">
<text x="70650" y="44040"
textLength="1580" font-size="660" lengthAdjust="spacingAndGlyphs"
text-anchor="middle" opacity="0">+5V</text>
<path d="M70000 43820
L70380 43820
" />
<path d="M70190 44010
L70190 43630
" />
<path d="M70860 43510
L70620 43510
L70600 43750
L70620 43730
L70670 43700
L70790 43700
L70840 43730
L70860 43750
L70880 43800
L70880 43920
L70860 43960
L70840 43990
L70790 44010
L70670 44010
L70620 43990
L70600 43960
" />
<path d="M71030 43510
L71190 44010
L71360 43510
" />
</g>
</g>
<g style="fill:#008484; fill-opacity:0.0; 
stroke:#008484; stroke-width:0; stroke-opacity:1; 
stroke-linecap:round; stroke-linejoin:round;">
<g >
</g>
<g style="fill:#840000; fill-opacity:0.0; 
stroke:#840000; stroke-width:0; stroke-opacity:1; 
stroke-linecap:round; stroke-linejoin:round;">
</g>
<g style="fill:#FFFFC2; fill-opacity:0.0; 
stroke:#FFFFC2; stroke-width:0; stroke-opacity:1; 
stroke-linecap:round; stroke-linejoin:round;">
</g>
<g style="fill:#FFFFC2; fill-opacity:0.6; 
stroke:#FFFFC2; stroke-width:0; stroke-opacity:1; 
stroke-linecap:round; stroke-linejoin:round;">
<rect x="44500" y="34500" width="6000" height="14000" rx="0" />
</g>
<g style="fill:#840000; fill-opacity:0.6; 
stroke:#840000; stroke-width:0; stroke-opacity:1; 
stroke-linecap:round; stroke-linejoin:round;">
</g>
<g style="fill:#840000; fill-opacity:0.0; 
stroke:#840000; stroke-width:100; stroke-opacity:1; 
stroke-linecap:round; stroke-linejoin:round;">
<rect x="44500" y="34500" width="6000" height="14000" rx="0" />
<rect x="44500" y="34500" width="6000" height="14000" rx="0" />
</g>
<g style="fill:#840000; fill-opacity:0.0; 
stroke:#840000; stroke-width:60; stroke-opacity:1; 
stroke-linecap:round; stroke-linejoin:round;">
<path d="M44500 37500
L43500 37500
" />
</g>
<g style="fill:#008484; fill-opacity:0.0; 
stroke:#008484; stroke-width:60; stroke-opacity:1; 
stroke-linecap:round; stroke-linejoin:round;">
<text x="44700" y="37750"
textLength="1420" font-size="660" lengthAdjust="spacingAndGlyphs"
text-anchor="start" opacity="0">~RST</text>
<path d="M44730 37080
L45230 37080
" />
<path d="M45130 37720
L44960 37480
" />
<path d="M44840 37720
L44840 37220
L45030 37220
L45080 37250
L45110 37270
L45130 37320
L45130 37390
L45110 37440
L45080 37460
L45030 37480
L44840 37480
" />
<path d="M45230 37080
L45700 37080
" />
<path d="M45320 37700
L45390 37720
L45510 37720
L45560 37700
L45580 37670
L45610 37630
L45610 37580
L45580 37530
L45560 37510
L45510 37480
L45420 37460
L45370 37440
L45340 37410
L45320 37360
L45320 37320
L45340 37270
L45370 37250
L45420 37220
L45530 37220
L45610 37250
" />
<path d="M45700 37080
L46080 37080
" />
<path d="M45750 37220
L46030 37220
" />
<path d="M45890 37720
L45890 37220
" />
</g>
<g style="fill:#840000; fill-opacity:0.0; 
stroke:#840000; stroke-width:60; stroke-opacity:1; 
stroke-linecap:round; stroke-linejoin:round;">
<text x="44000" y="37400"
textLength="540" font-size="660" lengthAdjust="spacingAndGlyphs"
text-anchor="middle" opacity="0">1</text>
<path d="M44140 37370
L43850 37370
" />
<path d="M44000 37370
L44000 36870
L43950 36940
L43900 36990
L43850 37010
" />
<path d="M47500 48500
L47500 49500
" />
</g>
<g style="fill:#008484; fill-opacity:0.0; 
stroke:#008484; stroke-width:60; stroke-opacity:1; 
stroke-linecap:round; stroke-linejoin:round;">
<g transform="rotate(-90 47500 48300)">
<text x="47500" y="48550"
textLength="1580" font-size="660" lengthAdjust="spacingAndGlyphs"
text-anchor="start" opacity="0">GND</text>
</g>
<path d="M47250 47880
L47220 47930
L47220 48000
L47250 48070
L47290 48120
L47340 48150
L47440 48170
L47510 48170
L47600 48150
L47650 48120
L47700 48070
L47720 48000
L47720 47960
L47700 47880
L47670 47860
L47510 47860
L47510 47960
" />
<path d="M47720 47650
L47220 47650
L47720 47360
L47220 47360
" />
<path d="M47720 47120
L47220 47120
L47220 47000
L47250 46930
L47290 46880
L47340 46860
L47440 46840
L47510 46840
L47600 46860
L47650 46880
L47700 46930
L47720 47000
L47720 47120
" />
</g>
<g style="fill:#840000; fill-opacity:0.0; 
stroke:#840000; stroke-width:60; stroke-opacity:1; 
stroke-linecap:round; stroke-linejoin:round;">
<g transform="rotate(-90 47400 49000)">
<text x="47400" y="49000"
textLength="1010" font-size="660" lengthAdjust="spacingAndGlyphs"
text-anchor="middle" opacity="0">10</text>
</g>
<path d="M47370 49090
L47370 49380
" />
<path d="M47370 49230
L46870 49230
L46940 49280
L46990 49330
L47010 49380
" />
<path d="M46870 48780
L46870 48730
L46900 48690
L46920 48660
L46970 48640
L47060 48610
L47180 48610
L47280 48640
L47320 48660
L47350 48690
L47370 48730
L47370 48780
L47350 48830
L47320 48850
L47280 48880
L47180 48900
L47060 48900
L46970 48880
L46920 48850
L46900 48830
L46870 48780
" />
<path d="M50500 41500
L51500 41500
" />
</g>
<g style="fill:#008484; fill-opacity:0.0; 
stroke:#008484; stroke-width:60; stroke-opacity:1; 
stroke-linecap:round; stroke-linejoin:round;">
<text x="50300" y="41750"
textLength="1040" font-size="660" lengthAdjust="spacingAndGlyphs"
text-anchor="end" opacity="0">D4</text>
<path d="M49410 41720
L49410 41220
L49530 41220
L49600 41250
L49650 41290
L49670 41340
L49690 41440
L49690 41510
L49670 41600
L49650 41650
L49600 41700
L49530 41720
L49410 41720
" />
<path d="M50120 41390
L50120 41720
" />
<path d="M50000 41200
L49880 41550
L50190 41550
" />
</g>
<g style="fill:#840000; fill-opacity:0.0; 
stroke:#840000; stroke-width:60; stroke-opacity:1; 
stroke-linecap:round; stroke-linejoin:round;">
<text x="51000" y="41400"
textLength="1010" font-size="660" lengthAdjust="spacingAndGlyphs"
text-anchor="middle" opacity="0">11</text>
<path d="M50900 41370
L50610 41370
" />
<path d="M50760 41370
L50760 40870
L50710 40940
L50660 40990
L50610 41010
" />
<path d="M51380 41370
L51090 41370
" />
<path d="M51230 41370
L51230 40870
L51190 40940
L51140 40990
L51090 41010
" />
<path d="M50500 40500
L51500 40500
" />
</g>
<g style="fill:#008484; fill-opacity:0.0; 
stroke:#008484; stroke-width:60; stroke-opacity:1; 
stroke-linecap:round; stroke-linejoin:round;">
<text x="50300" y="40750"
textLength="1040" font-size="660" lengthAdjust="spacingAndGlyphs"
text-anchor="end" opacity="0">D3</text>
<path d="M49410 40720
L49410 40220
L49530 40220
L49600 40250
L49650 40290
L49670 40340
L49690 40440
L49690 40510
L49670 40600
L49650 40650
L49600 40700
L49530 40720
L49410 40720
" />
<path d="M49860 40220
L50170 40220
L50000 40410
L50070 40410
L50120 40440
L50150 40460
L50170 40510
L50170 40630
L50150 40670
L50120 40700
L50070 40720
L49930 40720
L49880 40700
L49860 40670
" />
</g>
<g style="fill:#840000; fill-opacity:0.0; 
stroke:#840000; stroke-width:60; stroke-opacity:1; 
stroke-linecap:round; stroke-linejoin:round;">
<text x="51000" y="40400"
textLength="1010" font-size="660" lengthAdjust="spacingAndGlyphs"
text-anchor="middle" opacity="0">12</text>
<path d="M50900 40370
L50610 40370
" />
<path d="M50760 40370
L50760 39870
L50710 39940
L50660 39990
L50610 40010
" />
<path d="M51090 39920
L51110 39900
L51160 39870
L51280 39870
L51330 39900
L51350 39920
L51380 39970
L51380 40010
L51350 40090
L51070 40370
L51380 40370
" />
<path d="M50500 39500
L51500 39500
" />
</g>
<g style="fill:#008484; fill-opacity:0.0; 
stroke:#008484; stroke-width:60; stroke-opacity:1; 
stroke-linecap:round; stroke-linejoin:round;">
<text x="50300" y="39750"
textLength="2960" font-size="660" lengthAdjust="spacingAndGlyphs"
text-anchor="end" opacity="0">SDA/D2</text>
<path d="M47460 39700
L47530 39720
L47650 39720
L47690 39700
L47720 39670
L47740 39630
L47740 39580
L47720 39530
L47690 39510
L47650 39480
L47550 39460
L47500 39440
L47480 39410
L47460 39360
L47460 39320
L47480 39270
L47500 39250
L47550 39220
L47670 39220
L47740 39250
" />
<path d="M47960 39720
L47960 39220
L48070 39220
L48150 39250
L48190 39290
L48220 39340
L48240 39440
L48240 39510
L48220 39600
L48190 39650
L48150 39700
L48070 39720
L47960 39720
" />
<path d="M48430 39580
L48670 39580
" />
<path d="M48380 39720
L48550 39220
L48720 39720
" />
<path d="M49240 39200
L48810 39840
" />
<path d="M49410 39720
L49410 39220
L49530 39220
L49600 39250
L49650 39290
L49670 39340
L49690 39440
L49690 39510
L49670 39600
L49650 39650
L49600 39700
L49530 39720
L49410 39720
" />
<path d="M49880 39270
L49910 39250
L49960 39220
L50070 39220
L50120 39250
L50150 39270
L50170 39320
L50170 39360
L50150 39440
L49860 39720
L50170 39720
" />
</g>
<g style="fill:#840000; fill-opacity:0.0; 
stroke:#840000; stroke-width:60; stroke-opacity:1; 
stroke-linecap:round; stroke-linejoin:round;">
<text x="51000" y="39400"
textLength="1010" font-size="660" lengthAdjust="spacingAndGlyphs"
text-anchor="middle" opacity="0">13</text>
<path d="M50900 39370
L50610 39370
" />
<path d="M50760 39370
L50760 38870
L50710 38940
L50660 38990
L50610 39010
" />
<path d="M51070 38870
L51380 38870
L51210 39060
L51280 39060
L51330 39090
L51350 39110
L51380 39160
L51380 39280
L51350 39320
L51330 39350
L51280 39370
L51140 39370
L51090 39350
L51070 39320
" />
<path d="M50500 38500
L51500 38500
" />
</g>
<g style="fill:#008484; fill-opacity:0.0; 
stroke:#008484; stroke-width:60; stroke-opacity:1; 
stroke-linecap:round; stroke-linejoin:round;">
<text x="50300" y="38750"
textLength="2940" font-size="660" lengthAdjust="spacingAndGlyphs"
text-anchor="end" opacity="0">SCL/D1</text>
<path d="M47480 38700
L47550 38720
L47670 38720
L47720 38700
L47740 38670
L47770 38630
L47770 38580
L47740 38530
L47720 38510
L47670 38480
L47570 38460
L47530 38440
L47500 38410
L47480 38360
L47480 38320
L47500 38270
L47530 38250
L47570 38220
L47690 38220
L47770 38250
" />
<path d="M48270 38670
L48240 38700
L48170 38720
L48120 38720
L48050 38700
L48000 38650
L47980 38600
L47960 38510
L47960 38440
L47980 38340
L48000 38290
L48050 38250
L48120 38220
L48170 38220
L48240 38250
L48270 38270
" />
<path d="M48720 38720
L48480 38720
L48480 38220
" />
<path d="M49240 38200
L48810 38840
" />
<path d="M49410 38720
L49410 38220
L49530 38220
L49600 38250
L49650 38290
L49670 38340
L49690 38440
L49690 38510
L49670 38600
L49650 38650
L49600 38700
L49530 38720
L49410 38720
" />
<path d="M50170 38720
L49880 38720
" />
<path d="M50030 38720
L50030 38220
L49980 38290
L49930 38340
L49880 38360
" />
</g>
<g style="fill:#840000; fill-opacity:0.0; 
stroke:#840000; stroke-width:60; stroke-opacity:1; 
stroke-linecap:round; stroke-linejoin:round;">
<text x="51000" y="38400"
textLength="1010" font-size="660" lengthAdjust="spacingAndGlyphs"
text-anchor="middle" opacity="0">14</text>
<path d="M50900 38370
L50610 38370
" />
<path d="M50760 38370
L50760 37870
L50710 37940
L50660 37990
L50610 38010
" />
<path d="M51330 38040
L51330 38370
" />
<path d="M51210 37850
L51090 38200
L51400 38200
" />
<path d="M44500 40500
L43500 40500
" />
</g>
<g style="fill:#008484; fill-opacity:0.0; 
stroke:#008484; stroke-width:60; stroke-opacity:1; 
stroke-linecap:round; stroke-linejoin:round;">
<text x="44700" y="40750"
textLength="1040" font-size="660" lengthAdjust="spacingAndGlyphs"
text-anchor="start" opacity="0">RX</text>
<path d="M45130 40720
L44960 40480
" />
<path d="M44840 40720
L44840 40220
L45030 40220
L45080 40250
L45110 40270
L45130 40320
L45130 40390
L45110 40440
L45080 40460
L45030 40480
L44840 40480
" />
<path d="M45300 40220
L45630 40720
" />
<path d="M45630 40220
L45300 40720
" />
</g>
<g style="fill:#840000; fill-opacity:0.0; 
stroke:#840000; stroke-width:60; stroke-opacity:1; 
stroke-linecap:round; stroke-linejoin:round;">
<text x="44000" y="40400"
textLength="1010" font-size="660" lengthAdjust="spacingAndGlyphs"
text-anchor="middle" opacity="0">15</text>
<path d="M43900 40370
L43610 40370
" />
<path d="M43760 40370
L43760 39870
L43710 39940
L43660 39990
L43610 40010
" />
<path d="M44350 39870
L44110 39870
L44090 40110
L44110 40090
L44160 40060
L44280 40060
L44330 40090
L44350 40110
L44380 40160
L44380 40280
L44350 40320
L44330 40350
L44280 40370
L44160 40370
L44110 40350
L44090 40320
" />
<path d="M44500 41500
L43500 41500
" />
</g>
<g style="fill:#008484; fill-opacity:0.0; 
stroke:#008484; stroke-width:60; stroke-opacity:1; 
stroke-linecap:round; stroke-linejoin:round;">
<text x="44700" y="41750"
textLength="920" font-size="660" lengthAdjust="spacingAndGlyphs"
text-anchor="start" opacity="0">TX</text>
<path d="M44770 41220
L45060 41220
" />
<path d="M44920 41720
L44920 41220
" />
<path d="M45180 41220
L45510 41720
" />
<path d="M45510 41220
L45180 41720
" />
</g>
<g style="fill:#840000; fill-opacity:0.0; 
stroke:#840000; stroke-width:60; stroke-opacity:1; 
stroke-linecap:round; stroke-linejoin:round;">
<text x="44000" y="41400"
textLength="1010" font-size="660" lengthAdjust="spacingAndGlyphs"
text-anchor="middle" opacity="0">16</text>
<path d="M43900 41370
L43610 41370
" />
<path d="M43760 41370
L43760 40870
L43710 40940
L43660 40990
L43610 41010
" />
<path d="M44330 40870
L44230 40870
L44190 40900
L44160 40920
L44110 40990
L44090 41090
L44090 41280
L44110 41320
L44140 41350
L44190 41370
L44280 41370
L44330 41350
L44350 41320
L44380 41280
L44380 41160
L44350 41110
L44330 41090
L44280 41060
L44190 41060
L44140 41090
L44110 41110
L44090 41160
" />
<path d="M50500 36500
L51500 36500
" />
</g>
<g style="fill:#008484; fill-opacity:0.0; 
stroke:#008484; stroke-width:60; stroke-opacity:1; 
stroke-linecap:round; stroke-linejoin:round;">
<text x="50300" y="36750"
textLength="960" font-size="660" lengthAdjust="spacingAndGlyphs"
text-anchor="end" opacity="0">A0</text>
<path d="M49460 36580
L49690 36580
" />
<path d="M49410 36720
L49570 36220
L49740 36720
" />
<path d="M50000 36220
L50050 36220
L50100 36250
L50120 36270
L50150 36320
L50170 36410
L50170 36530
L50150 36630
L50120 36670
L50100 36700
L50050 36720
L50000 36720
L49960 36700
L49930 36670
L49910 36630
L49880 36530
L49880 36410
L49910 36320
L49930 36270
L49960 36250
L50000 36220
" />
</g>
<g style="fill:#840000; fill-opacity:0.0; 
stroke:#840000; stroke-width:60; stroke-opacity:1; 
stroke-linecap:round; stroke-linejoin:round;">
<text x="51000" y="36400"
textLength="540" font-size="660" lengthAdjust="spacingAndGlyphs"
text-anchor="middle" opacity="0">2</text>
<path d="M50850 35920
L50880 35900
L50920 35870
L51040 35870
L51090 35900
L51110 35920
L51140 35970
L51140 36010
L51110 36090
L50830 36370
L51140 36370
" />
<path d="M50500 37500
L51500 37500
" />
</g>
<g style="fill:#008484; fill-opacity:0.0; 
stroke:#008484; stroke-width:60; stroke-opacity:1; 
stroke-linecap:round; stroke-linejoin:round;">
<text x="50300" y="37750"
textLength="1040" font-size="660" lengthAdjust="spacingAndGlyphs"
text-anchor="end" opacity="0">D0</text>
<path d="M49410 37720
L49410 37220
L49530 37220
L49600 37250
L49650 37290
L49670 37340
L49690 37440
L49690 37510
L49670 37600
L49650 37650
L49600 37700
L49530 37720
L49410 37720
" />
<path d="M50000 37220
L50050 37220
L50100 37250
L50120 37270
L50150 37320
L50170 37410
L50170 37530
L50150 37630
L50120 37670
L50100 37700
L50050 37720
L50000 37720
L49960 37700
L49930 37670
L49910 37630
L49880 37530
L49880 37410
L49910 37320
L49930 37270
L49960 37250
L50000 37220
" />
</g>
<g style="fill:#840000; fill-opacity:0.0; 
stroke:#840000; stroke-width:60; stroke-opacity:1; 
stroke-linecap:round; stroke-linejoin:round;">
<text x="51000" y="37400"
textLength="540" font-size="660" lengthAdjust="spacingAndGlyphs"
text-anchor="middle" opacity="0">3</text>
<path d="M50830 36870
L51140 36870
L50970 37060
L51040 37060
L51090 37090
L51110 37110
L51140 37160
L51140 37280
L51110 37320
L51090 37350
L51040 37370
L50900 37370
L50850 37350
L50830 37320
" />
<path d="M50500 42500
L51500 42500
" />
</g>
<g style="fill:#008484; fill-opacity:0.0; 
stroke:#008484; stroke-width:60; stroke-opacity:1; 
stroke-linecap:round; stroke-linejoin:round;">
<text x="50300" y="42750"
textLength="3040" font-size="660" lengthAdjust="spacingAndGlyphs"
text-anchor="end" opacity="0">SCK/D5</text>
<path d="M47380 42700
L47460 42720
L47570 42720
L47620 42700
L47650 42670
L47670 42630
L47670 42580
L47650 42530
L47620 42510
L47570 42480
L47480 42460
L47430 42440
L47410 42410
L47380 42360
L47380 42320
L47410 42270
L47430 42250
L47480 42220
L47600 42220
L47670 42250
" />
<path d="M48170 42670
L48150 42700
L48070 42720
L48030 42720
L47960 42700
L47910 42650
L47880 42600
L47860 42510
L47860 42440
L47880 42340
L47910 42290
L47960 42250
L48030 42220
L48070 42220
L48150 42250
L48170 42270
" />
<path d="M48380 42720
L48380 42220
" />
<path d="M48670 42720
L48460 42440
" />
<path d="M48670 42220
L48380 42510
" />
<path d="M49240 42200
L48810 42840
" />
<path d="M49410 42720
L49410 42220
L49530 42220
L49600 42250
L49650 42290
L49670 42340
L49690 42440
L49690 42510
L49670 42600
L49650 42650
L49600 42700
L49530 42720
L49410 42720
" />
<path d="M50150 42220
L49910 42220
L49880 42460
L49910 42440
L49960 42410
L50070 42410
L50120 42440
L50150 42460
L50170 42510
L50170 42630
L50150 42670
L50120 42700
L50070 42720
L49960 42720
L49910 42700
L49880 42670
" />
</g>
<g style="fill:#840000; fill-opacity:0.0; 
stroke:#840000; stroke-width:60; stroke-opacity:1; 
stroke-linecap:round; stroke-linejoin:round;">
<text x="51000" y="42400"
textLength="540" font-size="660" lengthAdjust="spacingAndGlyphs"
text-anchor="middle" opacity="0">4</text>
<path d="M51090 42040
L51090 42370
" />
<path d="M50970 41850
L50850 42200
L51160 42200
" />
<path d="M50500 43500
L51500 43500
" />
</g>
<g style="fill:#008484; fill-opacity:0.0; 
stroke:#008484; stroke-width:60; stroke-opacity:1; 
stroke-linecap:round; stroke-linejoin:round;">
<text x="50300" y="43750"
textLength="3370" font-size="660" lengthAdjust="spacingAndGlyphs"
text-anchor="end" opacity="0">MISO/D6</text>
<path d="M47070 43720
L47070 43220
L47240 43580
L47410 43220
L47410 43720
" />
<path d="M47650 43720
L47650 43220
" />
<path d="M47860 43700
L47930 43720
L48050 43720
L48100 43700
L48120 43670
L48150 43630
L48150 43580
L48120 43530
L48100 43510
L48050 43480
L47960 43460
L47910 43440
L47880 43410
L47860 43360
L47860 43320
L47880 43270
L47910 43250
L47960 43220
L48070 43220
L48150 43250
" />
<path d="M48460 43220
L48550 43220
L48600 43250
L48650 43290
L48670 43390
L48670 43550
L48650 43650
L48600 43700
L48550 43720
L48460 43720
L48410 43700
L48360 43650
L48340 43550
L48340 43390
L48360 43290
L48410 43250
L48460 43220
" />
<path d="M49240 43200
L48810 43840
" />
<path d="M49410 43720
L49410 43220
L49530 43220
L49600 43250
L49650 43290
L49670 43340
L49690 43440
L49690 43510
L49670 43600
L49650 43650
L49600 43700
L49530 43720
L49410 43720
" />
<path d="M50120 43220
L50030 43220
L49980 43250
L49960 43270
L49910 43340
L49880 43440
L49880 43630
L49910 43670
L49930 43700
L49980 43720
L50070 43720
L50120 43700
L50150 43670
L50170 43630
L50170 43510
L50150 43460
L50120 43440
L50070 43410
L49980 43410
L49930 43440
L49910 43460
L49880 43510
" />
</g>
<g style="fill:#840000; fill-opacity:0.0; 
stroke:#840000; stroke-width:60; stroke-opacity:1; 
stroke-linecap:round; stroke-linejoin:round;">
<text x="51000" y="43400"
textLength="540" font-size="660" lengthAdjust="spacingAndGlyphs"
text-anchor="middle" opacity="0">5</text>
<path d="M51110 42870
L50880 42870
L50850 43110
L50880 43090
L50920 43060
L51040 43060
L51090 43090
L51110 43110
L51140 43160
L51140 43280
L51110 43320
L51090 43350
L51040 43370
L50920 43370
L50880 43350
L50850 43320
" />
<path d="M50500 44500
L51500 44500
" />
</g>
<g style="fill:#008484; fill-opacity:0.0; 
stroke:#008484; stroke-width:60; stroke-opacity:1; 
stroke-linecap:round; stroke-linejoin:round;">
<text x="50300" y="44750"
textLength="3370" font-size="660" lengthAdjust="spacingAndGlyphs"
text-anchor="end" opacity="0">MOSI/D7</text>
<path d="M47070 44720
L47070 44220
L47240 44580
L47410 44220
L47410 44720
" />
<path d="M47740 44220
L47840 44220
L47880 44250
L47930 44290
L47960 44390
L47960 44550
L47930 44650
L47880 44700
L47840 44720
L47740 44720
L47690 44700
L47650 44650
L47620 44550
L47620 44390
L47650 44290
L47690 44250
L47740 44220
" />
<path d="M48150 44700
L48220 44720
L48340 44720
L48380 44700
L48410 44670
L48430 44630
L48430 44580
L48410 44530
L48380 44510
L48340 44480
L48240 44460
L48190 44440
L48170 44410
L48150 44360
L48150 44320
L48170 44270
L48190 44250
L48240 44220
L48360 44220
L48430 44250
" />
<path d="M48650 44720
L48650 44220
" />
<path d="M49240 44200
L48810 44840
" />
<path d="M49410 44720
L49410 44220
L49530 44220
L49600 44250
L49650 44290
L49670 44340
L49690 44440
L49690 44510
L49670 44600
L49650 44650
L49600 44700
L49530 44720
L49410 44720
" />
<path d="M49860 44220
L50190 44220
L49980 44720
" />
</g>
<g style="fill:#840000; fill-opacity:0.0; 
stroke:#840000; stroke-width:60; stroke-opacity:1; 
stroke-linecap:round; stroke-linejoin:round;">
<text x="51000" y="44400"
textLength="540" font-size="660" lengthAdjust="spacingAndGlyphs"
text-anchor="middle" opacity="0">6</text>
<path d="M51090 43870
L51000 43870
L50950 43900
L50920 43920
L50880 43990
L50850 44090
L50850 44280
L50880 44320
L50900 44350
L50950 44370
L51040 44370
L51090 44350
L51110 44320
L51140 44280
L51140 44160
L51110 44110
L51090 44090
L51040 44060
L50950 44060
L50900 44090
L50880 44110
L50850 44160
" />
<path d="M50500 45500
L51500 45500
" />
</g>
<g style="fill:#008484; fill-opacity:0.0; 
stroke:#008484; stroke-width:60; stroke-opacity:1; 
stroke-linecap:round; stroke-linejoin:round;">
<text x="50300" y="45750"
textLength="2540" font-size="660" lengthAdjust="spacingAndGlyphs"
text-anchor="end" opacity="0">CS/D8</text>
<path d="M48190 45670
L48170 45700
L48100 45720
L48050 45720
L47980 45700
L47930 45650
L47910 45600
L47880 45510
L47880 45440
L47910 45340
L47930 45290
L47980 45250
L48050 45220
L48100 45220
L48170 45250
L48190 45270
" />
<path d="M48380 45700
L48460 45720
L48570 45720
L48620 45700
L48650 45670
L48670 45630
L48670 45580
L48650 45530
L48620 45510
L48570 45480
L48480 45460
L48430 45440
L48410 45410
L48380 45360
L48380 45320
L48410 45270
L48430 45250
L48480 45220
L48600 45220
L48670 45250
" />
<path d="M49240 45200
L48810 45840
" />
<path d="M49410 45720
L49410 45220
L49530 45220
L49600 45250
L49650 45290
L49670 45340
L49690 45440
L49690 45510
L49670 45600
L49650 45650
L49600 45700
L49530 45720
L49410 45720
" />
<path d="M49980 45440
L49930 45410
L49910 45390
L49880 45340
L49880 45320
L49910 45270
L49930 45250
L49980 45220
L50070 45220
L50120 45250
L50150 45270
L50170 45320
L50170 45340
L50150 45390
L50120 45410
L50070 45440
L49980 45440
L49930 45460
L49910 45480
L49880 45530
L49880 45630
L49910 45670
L49930 45700
L49980 45720
L50070 45720
L50120 45700
L50150 45670
L50170 45630
L50170 45530
L50150 45480
L50120 45460
L50070 45440
" />
</g>
<g style="fill:#840000; fill-opacity:0.0; 
stroke:#840000; stroke-width:60; stroke-opacity:1; 
stroke-linecap:round; stroke-linejoin:round;">
<text x="51000" y="45400"
textLength="540" font-size="660" lengthAdjust="spacingAndGlyphs"
text-anchor="middle" opacity="0">7</text>
<path d="M50830 44870
L51160 44870
L50950 45370
" />
<path d="M48500 34500
L48500 33500
" />
</g>
<g style="fill:#008484; fill-opacity:0.0; 
stroke:#008484; stroke-width:60; stroke-opacity:1; 
stroke-linecap:round; stroke-linejoin:round;">
<g transform="rotate(-90 48500 34700)">
<text x="48500" y="34950"
textLength="1440" font-size="660" lengthAdjust="spacingAndGlyphs"
text-anchor="end" opacity="0">3V3</text>
</g>
<path d="M48220 36030
L48220 35730
L48410 35890
L48410 35820
L48440 35770
L48460 35750
L48510 35730
L48630 35730
L48670 35750
L48700 35770
L48720 35820
L48720 35960
L48700 36010
L48670 36030
" />
<path d="M48220 35580
L48720 35420
L48220 35250
" />
<path d="M48220 35130
L48220 34820
L48410 34990
L48410 34920
L48440 34870
L48460 34840
L48510 34820
L48630 34820
L48670 34840
L48700 34870
L48720 34920
L48720 35060
L48700 35110
L48670 35130
" />
</g>
<g style="fill:#840000; fill-opacity:0.0; 
stroke:#840000; stroke-width:60; stroke-opacity:1; 
stroke-linecap:round; stroke-linejoin:round;">
<g transform="rotate(-90 48400 34000)">
<text x="48400" y="34000"
textLength="540" font-size="660" lengthAdjust="spacingAndGlyphs"
text-anchor="middle" opacity="0">8</text>
</g>
<path d="M48090 34040
L48060 34090
L48040 34110
L47990 34140
L47970 34140
L47920 34110
L47900 34090
L47870 34040
L47870 33950
L47900 33900
L47920 33880
L47970 33850
L47990 33850
L48040 33880
L48060 33900
L48090 33950
L48090 34040
L48110 34090
L48130 34110
L48180 34140
L48280 34140
L48320 34110
L48350 34090
L48370 34040
L48370 33950
L48350 33900
L48320 33880
L48280 33850
L48180 33850
L48130 33880
L48110 33900
L48090 33950
" />
<path d="M46500 34500
L46500 33500
" />
</g>
<g style="fill:#008484; fill-opacity:0.0; 
stroke:#008484; stroke-width:60; stroke-opacity:1; 
stroke-linecap:round; stroke-linejoin:round;">
<g transform="rotate(-90 46500 34700)">
<text x="46500" y="34950"
textLength="960" font-size="660" lengthAdjust="spacingAndGlyphs"
text-anchor="end" opacity="0">5V</text>
</g>
<path d="M46220 35270
L46220 35510
L46460 35530
L46440 35510
L46410 35460
L46410 35340
L46440 35300
L46460 35270
L46510 35250
L46630 35250
L46670 35270
L46700 35300
L46720 35340
L46720 35460
L46700 35510
L46670 35530
" />
<path d="M46220 35110
L46720 34940
L46220 34770
" />
</g>
<g style="fill:#840000; fill-opacity:0.0; 
stroke:#840000; stroke-width:60; stroke-opacity:1; 
stroke-linecap:round; stroke-linejoin:round;">
<g transform="rotate(-90 46400 34000)">
<text x="46400" y="34000"
textLength="540" font-size="660" lengthAdjust="spacingAndGlyphs"
text-anchor="middle" opacity="0">9</text>
</g>
<path d="M46370 34090
L46370 34000
L46350 33950
L46320 33920
L46250 33880
L46160 33850
L45970 33850
L45920 33880
L45900 33900
L45870 33950
L45870 34040
L45900 34090
L45920 34110
L45970 34140
L46090 34140
L46130 34110
L46160 34090
L46180 34040
L46180 33950
L46160 33900
L46130 33880
L46090 33850
" />
</g>
<g style="fill:#008484; fill-opacity:0.0; 
stroke:#008484; stroke-width:60; stroke-opacity:1; 
stroke-linecap:round; stroke-linejoin:round;">
<text x="51500" y="48270"
textLength="1060" font-size="660" lengthAdjust="spacingAndGlyphs"
text-anchor="middle" opacity="0">U1</text>
<path d="M51110 47740
L51110 48150
L51140 48190
L51160 48220
L51210 48240
L51300 48240
L51350 48220
L51380 48190
L51400 48150
L51400 47740
" />
<path d="M51900 48240
L51610 48240
" />
<path d="M51760 48240
L51760 47740
L51710 47810
L51660 47860
L51610 47880
" />
<text x="40500" y="48270"
textLength="5820" font-size="660" lengthAdjust="spacingAndGlyphs"
text-anchor="middle" opacity="0">WeMos_D1_mini</text>
<path d="M37690 47740
L37800 48240
L37900 47880
L38000 48240
L38110 47740
" />
<path d="M38500 48220
L38450 48240
L38350 48240
L38300 48220
L38280 48170
L38280 47980
L38300 47930
L38350 47910
L38450 47910
L38500 47930
L38520 47980
L38520 48030
L38280 48070
" />
<path d="M38730 48240
L38730 47740
L38900 48100
L39070 47740
L39070 48240
" />
<path d="M39380 48240
L39330 48220
L39300 48190
L39280 48150
L39280 48000
L39300 47960
L39330 47930
L39380 47910
L39450 47910
L39500 47930
L39520 47960
L39540 48000
L39540 48150
L39520 48190
L39500 48220
L39450 48240
L39380 48240
" />
<path d="M39730 48220
L39780 48240
L39880 48240
L39920 48220
L39950 48170
L39950 48150
L39920 48100
L39880 48070
L39800 48070
L39760 48050
L39730 48000
L39730 47980
L39760 47930
L39800 47910
L39880 47910
L39920 47930
" />
<path d="M40040 48290
L40420 48290
" />
<path d="M40540 48240
L40540 47740
L40660 47740
L40730 47770
L40780 47810
L40800 47860
L40830 47960
L40830 48030
L40800 48120
L40780 48170
L40730 48220
L40660 48240
L40540 48240
" />
<path d="M41300 48240
L41020 48240
" />
<path d="M41160 48240
L41160 47740
L41110 47810
L41070 47860
L41020 47880
" />
<path d="M41400 48290
L41780 48290
" />
<path d="M41900 48240
L41900 47910
" />
<path d="M41900 47960
L41920 47930
L41970 47910
L42040 47910
L42090 47930
L42110 47980
L42110 48240
" />
<path d="M42110 47980
L42140 47930
L42190 47910
L42260 47910
L42300 47930
L42330 47980
L42330 48240
" />
<path d="M42570 48240
L42570 47910
" />
<path d="M42570 47740
L42540 47770
L42570 47790
L42590 47770
L42570 47740
L42570 47790
" />
<path d="M42800 47910
L42800 48240
" />
<path d="M42800 47960
L42830 47930
L42880 47910
L42950 47910
L43000 47930
L43020 47980
L43020 48240
" />
<path d="M43260 48240
L43260 47910
" />
<path d="M43260 47740
L43230 47770
L43260 47790
L43280 47770
L43260 47740
L43260 47790
" />
</g>
</g>
<g style="fill:#008484; fill-opacity:0.0; 
stroke:#008484; stroke-width:0; stroke-opacity:1; 
stroke-linecap:round; stroke-linejoin:round;">
<g >
</g>
<g style="fill:#840000; fill-opacity:0.0; 
stroke:#840000; stroke-width:0; stroke-opacity:1; 
stroke-linecap:round; stroke-linejoin:round;">
</g>
<g style="fill:#840000; fill-opacity:0.0; 
stroke:#840000; stroke-width:60; stroke-opacity:1; 
stroke-linecap:round; stroke-linejoin:round;">
<path style="fill:#840000; fill-opacity:0.0; 
stroke:#840000; stroke-width:60; stroke-opacity:1; 
stroke-linecap:round; stroke-linejoin:round;fill:none"
d="M 75500,39000
75500,39500
76000,39500
75500,40000
75000,39500
75500,39500
" /> 
</g>
<g style="fill:#008484; fill-opacity:0.0; 
stroke:#008484; stroke-width:60; stroke-opacity:1; 
stroke-linecap:round; stroke-linejoin:round;">
<text x="75550" y="41000"
textLength="1580" font-size="660" lengthAdjust="spacingAndGlyphs"
text-anchor="middle" opacity="0">GND</text>
<path d="M75160 40500
L75120 40470
L75050 40470
L74970 40500
L74930 40540
L74900 40590
L74880 40690
L74880 40760
L74900 40850
L74930 40900
L74970 40950
L75050 40970
L75090 40970
L75160 40950
L75190 40920
L75190 40760
L75090 40760
" />
<path d="M75400 40970
L75400 40470
L75690 40970
L75690 40470
" />
<path d="M75930 40970
L75930 40470
L76050 40470
L76120 40500
L76160 40540
L76190 40590
L76210 40690
L76210 40760
L76190 40850
L76160 40900
L76120 40950
L76050 40970
L75930 40970
" />
</g>
</g>
<g style="fill:#008484; fill-opacity:0.0; 
stroke:#008484; stroke-width:0; stroke-opacity:1; 
stroke-linecap:round; stroke-linejoin:round;">
<g >
</g>
<g style="fill:#840000; fill-opacity:0.0; 
stroke:#840000; stroke-width:0; stroke-opacity:1; 
stroke-linecap:round; stroke-linejoin:round;">
</g>
<g style="fill:#840000; fill-opacity:0.0; 
stroke:#840000; stroke-width:60; stroke-opacity:1; 
stroke-linecap:round; stroke-linejoin:round;">
<path style="fill:#840000; fill-opacity:0.0; 
stroke:#840000; stroke-width:60; stroke-opacity:1; 
stroke-linecap:round; stroke-linejoin:round;fill:none"
d="M 47500,49500
47500,50000
48000,50000
47500,50500
47000,50000
47500,50000
" /> 
</g>
<g style="fill:#008484; fill-opacity:0.0; 
stroke:#008484; stroke-width:60; stroke-opacity:1; 
stroke-linecap:round; stroke-linejoin:round;">
<text x="47550" y="51500"
textLength="1580" font-size="660" lengthAdjust="spacingAndGlyphs"
text-anchor="middle" opacity="0">GND</text>
<path d="M47160 51000
L47120 50970
L47050 50970
L46970 51000
L46930 51040
L46900 51090
L46880 51190
L46880 51260
L46900 51350
L46930 51400
L46970 51450
L47050 51470
L47090 51470
L47160 51450
L47190 51420
L47190 51260
L47090 51260
" />
<path d="M47400 51470
L47400 50970
L47690 51470
L47690 50970
" />
<path d="M47930 51470
L47930 50970
L48050 50970
L48120 51000
L48160 51040
L48190 51090
L48210 51190
L48210 51260
L48190 51350
L48160 51400
L48120 51450
L48050 51470
L47930 51470
" />
</g>
</g>
<g style="fill:#008484; fill-opacity:0.0; 
stroke:#008484; stroke-width:0; stroke-opacity:1; 
stroke-linecap:round; stroke-linejoin:round;">
<g >
</g>
<g style="fill:#840000; fill-opacity:0.0; 
stroke:#840000; stroke-width:0; stroke-opacity:1; 
stroke-linecap:round; stroke-linejoin:round;">
</g>
<g style="fill:#840000; fill-opacity:0.0; 
stroke:#840000; stroke-width:60; stroke-opacity:1; 
stroke-linecap:round; stroke-linejoin:round;">
<path style="fill:#840000; fill-opacity:0.0; 
stroke:#840000; stroke-width:60; stroke-opacity:1; 
stroke-linecap:round; stroke-linejoin:round;fill:none"
d="M 60000,25500
60000,26000
60500,26000
60000,26500
59500,26000
60000,26000
" /> 
</g>
<g style="fill:#008484; fill-opacity:0.0; 
stroke:#008484; stroke-width:60; stroke-opacity:1; 
stroke-linecap:round; stroke-linejoin:round;">
<text x="60050" y="27500"
textLength="1580" font-size="660" lengthAdjust="spacingAndGlyphs"
text-anchor="middle" opacity="0">GND</text>
<path d="M59660 27000
L59620 26970
L59550 26970
L59470 27000
L59430 27040
L59400 27090
L59380 27190
L59380 27260
L59400 27350
L59430 27400
L59470 27450
L59550 27470
L59590 27470
L59660 27450
L59690 27420
L59690 27260
L59590 27260
" />
<path d="M59900 27470
L59900 26970
L60190 27470
L60190 26970
" />
<path d="M60430 27470
L60430 26970
L60550 26970
L60620 27000
L60660 27040
L60690 27090
L60710 27190
L60710 27260
L60690 27350
L60660 27400
L60620 27450
L60550 27470
L60430 27470
" />
</g>
</g>
<g style="fill:#008484; fill-opacity:0.0; 
stroke:#008484; stroke-width:0; stroke-opacity:1; 
stroke-linecap:round; stroke-linejoin:round;">
<g >
</g>
<g style="fill:#840000; fill-opacity:0.0; 
stroke:#840000; stroke-width:0; stroke-opacity:1; 
stroke-linecap:round; stroke-linejoin:round;">
</g>
<g style="fill:#840000; fill-opacity:0.0; 
stroke:#840000; stroke-width:60; stroke-opacity:1; 
stroke-linecap:round; stroke-linejoin:round;">
<path style="fill:#840000; fill-opacity:0.0; 
stroke:#840000; stroke-width:60; stroke-opacity:1; 
stroke-linecap:round; stroke-linejoin:round;fill:none"
d="M 54500,25500
54500,26000
55000,26000
54500,26500
54000,26000
54500,26000
" /> 
</g>
<g style="fill:#008484; fill-opacity:0.0; 
stroke:#008484; stroke-width:60; stroke-opacity:1; 
stroke-linecap:round; stroke-linejoin:round;">
<text x="54550" y="27500"
textLength="1580" font-size="660" lengthAdjust="spacingAndGlyphs"
text-anchor="middle" opacity="0">GND</text>
<path d="M54160 27000
L54120 26970
L54050 26970
L53970 27000
L53930 27040
L53900 27090
L53880 27190
L53880 27260
L53900 27350
L53930 27400
L53970 27450
L54050 27470
L54090 27470
L54160 27450
L54190 27420
L54190 27260
L54090 27260
" />
<path d="M54400 27470
L54400 26970
L54690 27470
L54690 26970
" />
<path d="M54930 27470
L54930 26970
L55050 26970
L55120 27000
L55160 27040
L55190 27090
L55210 27190
L55210 27260
L55190 27350
L55160 27400
L55120 27450
L55050 27470
L54930 27470
" />
</g>
</g>
<g style="fill:#008484; fill-opacity:0.0; 
stroke:#008484; stroke-width:0; stroke-opacity:1; 
stroke-linecap:round; stroke-linejoin:round;">
<g >
</g>
<g style="fill:#840000; fill-opacity:0.0; 
stroke:#840000; stroke-width:0; stroke-opacity:1; 
stroke-linecap:round; stroke-linejoin:round;">
</g>
<g style="fill:#840000; fill-opacity:0.0; 
stroke:#840000; stroke-width:60; stroke-opacity:1; 
stroke-linecap:round; stroke-linejoin:round;">
<path style="fill:#840000; fill-opacity:0.0; 
stroke:#840000; stroke-width:60; stroke-opacity:1; 
stroke-linecap:round; stroke-linejoin:round;fill:none"
d="M 48500,25500
48500,26000
49000,26000
48500,26500
48000,26000
48500,26000
" /> 
</g>
<g style="fill:#008484; fill-opacity:0.0; 
stroke:#008484; stroke-width:60; stroke-opacity:1; 
stroke-linecap:round; stroke-linejoin:round;">
<text x="48550" y="27500"
textLength="1580" font-size="660" lengthAdjust="spacingAndGlyphs"
text-anchor="middle" opacity="0">GND</text>
<path d="M48160 27000
L48120 26970
L48050 26970
L47970 27000
L47930 27040
L47900 27090
L47880 27190
L47880 27260
L47900 27350
L47930 27400
L47970 27450
L48050 27470
L48090 27470
L48160 27450
L48190 27420
L48190 27260
L48090 27260
" />
<path d="M48400 27470
L48400 26970
L48690 27470
L48690 26970
" />
<path d="M48930 27470
L48930 26970
L49050 26970
L49120 27000
L49160 27040
L49190 27090
L49210 27190
L49210 27260
L49190 27350
L49160 27400
L49120 27450
L49050 27470
L48930 27470
" />
</g>
</g>
<g style="fill:#008484; fill-opacity:0.0; 
stroke:#008484; stroke-width:0; stroke-opacity:1; 
stroke-linecap:round; stroke-linejoin:round;">
<g >
</g>
<g style="fill:#840000; fill-opacity:0.0; 
stroke:#840000; stroke-width:0; stroke-opacity:1; 
stroke-linecap:round; stroke-linejoin:round;">
</g>
<g style="fill:#840000; fill-opacity:0.0; 
stroke:#840000; stroke-width:60; stroke-opacity:1; 
stroke-linecap:round; stroke-linejoin:round;">
<path style="fill:#840000; fill-opacity:0.0; 
stroke:#840000; stroke-width:60; stroke-opacity:1; 
stroke-linecap:round; stroke-linejoin:round;fill:none"
d="M 42200,21500
42500,21000
" /> 
<path style="fill:#840000; fill-opacity:0.0; 
stroke:#840000; stroke-width:60; stroke-opacity:1; 
stroke-linecap:round; stroke-linejoin:round;fill:none"
d="M 42500,22000
42500,21000
" /> 
<path style="fill:#840000; fill-opacity:0.0; 
stroke:#840000; stroke-width:60; stroke-opacity:1; 
stroke-linecap:round; stroke-linejoin:round;fill:none"
d="M 42500,21000
42800,21500
" /> 
</g>
<g style="fill:#008484; fill-opacity:0.0; 
stroke:#008484; stroke-width:60; stroke-opacity:1; 
stroke-linecap:round; stroke-linejoin:round;">
<text x="42650" y="20540"
textLength="1580" font-size="660" lengthAdjust="spacingAndGlyphs"
text-anchor="middle" opacity="0">+9V</text>
<path d="M42000 20320
L42380 20320
" />
<path d="M42190 20510
L42190 20130
" />
<path d="M42650 20510
L42740 20510
L42790 20490
L42810 20460
L42860 20390
L42880 20300
L42880 20110
L42860 20060
L42840 20040
L42790 20010
L42690 20010
L42650 20040
L42620 20060
L42600 20110
L42600 20230
L42620 20270
L42650 20300
L42690 20320
L42790 20320
L42840 20300
L42860 20270
L42880 20230
" />
<path d="M43030 20010
L43190 20510
L43360 20010
" />
</g>
</g>
<g style="fill:#008484; fill-opacity:0.0; 
stroke:#008484; stroke-width:0; stroke-opacity:1; 
stroke-linecap:round; stroke-linejoin:round;">
<g >
</g>
<g style="fill:#840000; fill-opacity:0.0; 
stroke:#840000; stroke-width:0; stroke-opacity:1; 
stroke-linecap:round; stroke-linejoin:round;">
</g>
<g style="fill:#840000; fill-opacity:0.0; 
stroke:#840000; stroke-width:200; stroke-opacity:1; 
stroke-linecap:round; stroke-linejoin:round;">
<path style="fill:#840000; fill-opacity:0.0; 
stroke:#840000; stroke-width:200; stroke-opacity:1; 
stroke-linecap:round; stroke-linejoin:round;fill:none"
d="M 59200,24300
60800,24300
" /> 
<path style="fill:#840000; fill-opacity:0.0; 
stroke:#840000; stroke-width:200; stroke-opacity:1; 
stroke-linecap:round; stroke-linejoin:round;fill:none"
d="M 59200,23700
60800,23700
" /> 
</g>
<g style="fill:#840000; fill-opacity:0.0; 
stroke:#840000; stroke-width:60; stroke-opacity:1; 
stroke-linecap:round; stroke-linejoin:round;">
<path d="M60000 23600
L60000 22500
" />
<path d="M60000 24400
L60000 25500
" />
</g>
<g style="fill:#008484; fill-opacity:0.0; 
stroke:#008484; stroke-width:60; stroke-opacity:1; 
stroke-linecap:round; stroke-linejoin:round;">
<text x="61670" y="23810"
textLength="1040" font-size="660" lengthAdjust="spacingAndGlyphs"
text-anchor="middle" opacity="0">C2</text>
<path d="M61580 23730
L61560 23760
L61490 23780
L61440 23780
L61370 23760
L61320 23710
L61300 23660
L61270 23570
L61270 23500
L61300 23400
L61320 23350
L61370 23310
L61440 23280
L61490 23280
L61560 23310
L61580 23330
" />
<path d="M61770 23330
L61800 23310
L61840 23280
L61960 23280
L62010 23310
L62030 23330
L62060 23380
L62060 23420
L62030 23500
L61750 23780
L62060 23780
" />
<text x="61430" y="24720"
textLength="560" font-size="660" lengthAdjust="spacingAndGlyphs"
text-anchor="middle" opacity="0">C</text>
<path d="M61580 24640
L61560 24670
L61480 24690
L61440 24690
L61370 24670
L61320 24620
L61290 24570
L61270 24480
L61270 24410
L61290 24310
L61320 24260
L61370 24220
L61440 24190
L61480 24190
L61560 24220
L61580 24240
" />
</g>
</g>
<g style="fill:#008484; fill-opacity:0.0; 
stroke:#008484; stroke-width:0; stroke-opacity:1; 
stroke-linecap:round; stroke-linejoin:round;">
<g >
</g>
<g style="fill:#840000; fill-opacity:0.0; 
stroke:#840000; stroke-width:0; stroke-opacity:1; 
stroke-linecap:round; stroke-linejoin:round;">
</g>
<g style="fill:#840000; fill-opacity:0.0; 
stroke:#840000; stroke-width:200; stroke-opacity:1; 
stroke-linecap:round; stroke-linejoin:round;">
<path style="fill:#840000; fill-opacity:0.0; 
stroke:#840000; stroke-width:200; stroke-opacity:1; 
stroke-linecap:round; stroke-linejoin:round;fill:none"
d="M 47700,24300
49300,24300
" /> 
<path style="fill:#840000; fill-opacity:0.0; 
stroke:#840000; stroke-width:200; stroke-opacity:1; 
stroke-linecap:round; stroke-linejoin:round;fill:none"
d="M 47700,23700
49300,23700
" /> 
</g>
<g style="fill:#840000; fill-opacity:0.0; 
stroke:#840000; stroke-width:60; stroke-opacity:1; 
stroke-linecap:round; stroke-linejoin:round;">
<path d="M48500 23600
L48500 22500
" />
<path d="M48500 24400
L48500 25500
" />
</g>
<g style="fill:#008484; fill-opacity:0.0; 
stroke:#008484; stroke-width:60; stroke-opacity:1; 
stroke-linecap:round; stroke-linejoin:round;">
<text x="50170" y="23810"
textLength="1040" font-size="660" lengthAdjust="spacingAndGlyphs"
text-anchor="middle" opacity="0">C1</text>
<path d="M50080 23730
L50060 23760
L49990 23780
L49940 23780
L49870 23760
L49820 23710
L49800 23660
L49770 23570
L49770 23500
L49800 23400
L49820 23350
L49870 23310
L49940 23280
L49990 23280
L50060 23310
L50080 23330
" />
<path d="M50560 23780
L50270 23780
" />
<path d="M50420 23780
L50420 23280
L50370 23350
L50320 23400
L50270 23420
" />
<text x="49930" y="24720"
textLength="560" font-size="660" lengthAdjust="spacingAndGlyphs"
text-anchor="middle" opacity="0">C</text>
<path d="M50080 24640
L50060 24670
L49980 24690
L49940 24690
L49870 24670
L49820 24620
L49790 24570
L49770 24480
L49770 24410
L49790 24310
L49820 24260
L49870 24220
L49940 24190
L49980 24190
L50060 24220
L50080 24240
" />
</g>
</g>
<g style="fill:#008484; fill-opacity:0.0; 
stroke:#008484; stroke-width:0; stroke-opacity:1; 
stroke-linecap:round; stroke-linejoin:round;">
<g >
</g>
<g style="fill:#840000; fill-opacity:0.0; 
stroke:#840000; stroke-width:0; stroke-opacity:1; 
stroke-linecap:round; stroke-linejoin:round;">
</g>
<g style="fill:#FFFFC2; fill-opacity:0.0; 
stroke:#FFFFC2; stroke-width:0; stroke-opacity:1; 
stroke-linecap:round; stroke-linejoin:round;">
</g>
<g style="fill:#FFFFC2; fill-opacity:0.6; 
stroke:#FFFFC2; stroke-width:0; stroke-opacity:1; 
stroke-linecap:round; stroke-linejoin:round;">
<rect x="52500" y="21750" width="4000" height="2750" rx="0" />
</g>
<g style="fill:#840000; fill-opacity:0.6; 
stroke:#840000; stroke-width:0; stroke-opacity:1; 
stroke-linecap:round; stroke-linejoin:round;">
</g>
<g style="fill:#840000; fill-opacity:0.0; 
stroke:#840000; stroke-width:100; stroke-opacity:1; 
stroke-linecap:round; stroke-linejoin:round;">
<rect x="52500" y="21750" width="4000" height="2750" rx="0" />
<rect x="52500" y="21750" width="4000" height="2750" rx="0" />
</g>
<g style="fill:#840000; fill-opacity:0.0; 
stroke:#840000; stroke-width:60; stroke-opacity:1; 
stroke-linecap:round; stroke-linejoin:round;">
<path d="M52500 22500
L51500 22500
" />
</g>
<g style="fill:#008484; fill-opacity:0.0; 
stroke:#008484; stroke-width:60; stroke-opacity:1; 
stroke-linecap:round; stroke-linejoin:round;">
<text x="52600" y="22750"
textLength="820" font-size="660" lengthAdjust="spacingAndGlyphs"
text-anchor="start" opacity="0">IN</text>
<path d="M52740 22720
L52740 22220
" />
<path d="M52980 22720
L52980 22220
L53270 22720
L53270 22220
" />
</g>
<g style="fill:#840000; fill-opacity:0.0; 
stroke:#840000; stroke-width:60; stroke-opacity:1; 
stroke-linecap:round; stroke-linejoin:round;">
<text x="52000" y="22400"
textLength="540" font-size="660" lengthAdjust="spacingAndGlyphs"
text-anchor="middle" opacity="0">1</text>
<path d="M52140 22370
L51850 22370
" />
<path d="M52000 22370
L52000 21870
L51950 21940
L51900 21990
L51850 22010
" />
<path d="M54500 24500
L54500 25500
" />
</g>
<g style="fill:#008484; fill-opacity:0.0; 
stroke:#008484; stroke-width:60; stroke-opacity:1; 
stroke-linecap:round; stroke-linejoin:round;">
<g transform="rotate(-90 54500 24400)">
<text x="54500" y="24650"
textLength="1580" font-size="660" lengthAdjust="spacingAndGlyphs"
text-anchor="start" opacity="0">GND</text>
</g>
<path d="M54250 23980
L54220 24030
L54220 24100
L54250 24170
L54290 24220
L54340 24250
L54440 24270
L54510 24270
L54600 24250
L54650 24220
L54700 24170
L54720 24100
L54720 24060
L54700 23980
L54670 23960
L54510 23960
L54510 24060
" />
<path d="M54720 23750
L54220 23750
L54720 23460
L54220 23460
" />
<path d="M54720 23220
L54220 23220
L54220 23100
L54250 23030
L54290 22980
L54340 22960
L54440 22940
L54510 22940
L54600 22960
L54650 22980
L54700 23030
L54720 23100
L54720 23220
" />
</g>
<g style="fill:#840000; fill-opacity:0.0; 
stroke:#840000; stroke-width:60; stroke-opacity:1; 
stroke-linecap:round; stroke-linejoin:round;">
<g transform="rotate(-90 54400 25000)">
<text x="54400" y="25000"
textLength="540" font-size="660" lengthAdjust="spacingAndGlyphs"
text-anchor="middle" opacity="0">2</text>
</g>
<path d="M53920 25140
L53900 25110
L53870 25070
L53870 24950
L53900 24900
L53920 24880
L53970 24850
L54010 24850
L54090 24880
L54370 25160
L54370 24850
" />
<path d="M56500 22500
L57500 22500
" />
</g>
<g style="fill:#008484; fill-opacity:0.0; 
stroke:#008484; stroke-width:60; stroke-opacity:1; 
stroke-linecap:round; stroke-linejoin:round;">
<text x="56400" y="22750"
textLength="1490" font-size="660" lengthAdjust="spacingAndGlyphs"
text-anchor="end" opacity="0">OUT</text>
<path d="M55150 22220
L55250 22220
L55290 22250
L55340 22290
L55370 22390
L55370 22550
L55340 22650
L55290 22700
L55250 22720
L55150 22720
L55100 22700
L55060 22650
L55030 22550
L55030 22390
L55060 22290
L55100 22250
L55150 22220
" />
<path d="M55580 22220
L55580 22630
L55600 22670
L55630 22700
L55670 22720
L55770 22720
L55820 22700
L55840 22670
L55870 22630
L55870 22220
" />
<path d="M56030 22220
L56320 22220
" />
<path d="M56170 22720
L56170 22220
" />
</g>
<g style="fill:#840000; fill-opacity:0.0; 
stroke:#840000; stroke-width:60; stroke-opacity:1; 
stroke-linecap:round; stroke-linejoin:round;">
<text x="57000" y="22400"
textLength="540" font-size="660" lengthAdjust="spacingAndGlyphs"
text-anchor="middle" opacity="0">3</text>
<path d="M56830 21870
L57140 21870
L56970 22060
L57040 22060
L57090 22090
L57110 22110
L57140 22160
L57140 22280
L57110 22320
L57090 22350
L57040 22370
L56900 22370
L56850 22350
L56830 22320
" />
</g>
<g style="fill:#008484; fill-opacity:0.0; 
stroke:#008484; stroke-width:60; stroke-opacity:1; 
stroke-linecap:round; stroke-linejoin:round;">
<text x="54500" y="20350"
textLength="1060" font-size="660" lengthAdjust="spacingAndGlyphs"
text-anchor="middle" opacity="0">U2</text>
<path d="M54110 19820
L54110 20230
L54140 20270
L54160 20300
L54210 20320
L54300 20320
L54350 20300
L54380 20270
L54400 20230
L54400 19820
" />
<path d="M54610 19870
L54640 19850
L54690 19820
L54800 19820
L54850 19850
L54880 19870
L54900 19920
L54900 19960
L54880 20040
L54590 20320
L54900 20320
" />
<text x="54500" y="21260"
textLength="2370" font-size="660" lengthAdjust="spacingAndGlyphs"
text-anchor="middle" opacity="0">L7805</text>
<path d="M53700 21230
L53460 21230
L53460 20730
" />
<path d="M53820 20730
L54150 20730
L53940 21230
" />
<path d="M54410 20950
L54360 20920
L54340 20900
L54320 20850
L54320 20830
L54340 20780
L54360 20760
L54410 20730
L54510 20730
L54550 20760
L54580 20780
L54600 20830
L54600 20850
L54580 20900
L54550 20920
L54510 20950
L54410 20950
L54360 20970
L54340 20990
L54320 21040
L54320 21140
L54340 21180
L54360 21210
L54410 21230
L54510 21230
L54550 21210
L54580 21180
L54600 21140
L54600 21040
L54580 20990
L54550 20970
L54510 20950
" />
<path d="M54910 20730
L54960 20730
L55010 20760
L55030 20780
L55050 20830
L55080 20920
L55080 21040
L55050 21140
L55030 21180
L55010 21210
L54960 21230
L54910 21230
L54860 21210
L54840 21180
L54820 21140
L54790 21040
L54790 20920
L54820 20830
L54840 20780
L54860 20760
L54910 20730
" />
<path d="M55530 20730
L55290 20730
L55270 20970
L55290 20950
L55340 20920
L55460 20920
L55510 20950
L55530 20970
L55550 21020
L55550 21140
L55530 21180
L55510 21210
L55460 21230
L55340 21230
L55290 21210
L55270 21180
" />
</g>
</g>
<g style="fill:#008484; fill-opacity:0.0; 
stroke:#008484; stroke-width:60; stroke-opacity:1; 
stroke-linecap:round; stroke-linejoin:round;">
</g>
<g style="fill:#008400; fill-opacity:0.0; 
stroke:#008400; stroke-width:60; stroke-opacity:1; 
stroke-linecap:round; stroke-linejoin:round;">
<path d="M66000 45500
L70500 45500
" />
<path d="M75500 45500
L80000 45500
" />
<path d="M66000 38000
L70500 38000
" />
<path d="M75500 38000
L80000 38000
" />
<path d="M47500 22500
L48500 22500
" />
<path d="M42500 22500
L43500 22500
" />
<path d="M57500 22500
L60000 22500
" />
<path d="M48500 22500
L51500 22500
" />
<path d="M42500 22000
L42500 22500
" />
</g>
<g style="fill:#840000; fill-opacity:0.0; 
stroke:#840000; stroke-width:60; stroke-opacity:1; 
stroke-linecap:round; stroke-linejoin:round;">
<text x="75810" y="37250"
textLength="2580" font-size="660" lengthAdjust="spacingAndGlyphs"
text-anchor="start" opacity="0">Servo2</text>
<path d="M75930 37200
L76000 37220
L76120 37220
L76170 37200
L76190 37170
L76220 37130
L76220 37080
L76190 37030
L76170 37010
L76120 36980
L76030 36960
L75980 36940
L75950 36910
L75930 36860
L75930 36820
L75950 36770
L75980 36750
L76030 36720
L76140 36720
L76220 36750
" />
<path d="M76620 37200
L76570 37220
L76480 37220
L76430 37200
L76410 37150
L76410 36960
L76430 36910
L76480 36890
L76570 36890
L76620 36910
L76640 36960
L76640 37010
L76410 37050
" />
<path d="M76860 37220
L76860 36890
" />
<path d="M76860 36980
L76880 36940
L76910 36910
L76950 36890
L77000 36890
" />
<path d="M77120 36890
L77240 37220
L77360 36890
" />
<path d="M77620 37220
L77570 37200
L77550 37170
L77530 37130
L77530 36980
L77550 36940
L77570 36910
L77620 36890
L77690 36890
L77740 36910
L77760 36940
L77790 36980
L77790 37130
L77760 37170
L77740 37200
L77690 37220
L77620 37220
" />
<path d="M77980 36770
L78000 36750
L78050 36720
L78170 36720
L78220 36750
L78240 36770
L78260 36820
L78260 36860
L78240 36940
L77950 37220
L78260 37220
" />
</g>
<g style="fill:#840000; fill-opacity:0.0; 
stroke:#840000; stroke-width:100; stroke-opacity:1; 
stroke-linecap:round; stroke-linejoin:round;">
<path style="fill:#840000; fill-opacity:0.0; 
stroke:#840000; stroke-width:100; stroke-opacity:1; 
stroke-linecap:round; stroke-linejoin:round;fill:none"
d="M 75500,37000
75750,37440
78500,37440
78500,37000
78500,36560
75750,36560
Z" /> 
</g>
<g style="fill:#840000; fill-opacity:0.0; 
stroke:#840000; stroke-width:60; stroke-opacity:1; 
stroke-linecap:round; stroke-linejoin:round;">
<text x="51600" y="44750"
textLength="2580" font-size="660" lengthAdjust="spacingAndGlyphs"
text-anchor="start" opacity="0">Servo4</text>
<path d="M51720 44700
L51790 44720
L51910 44720
L51960 44700
L51980 44670
L52010 44630
L52010 44580
L51980 44530
L51960 44510
L51910 44480
L51820 44460
L51770 44440
L51740 44410
L51720 44360
L51720 44320
L51740 44270
L51770 44250
L51820 44220
L51930 44220
L52010 44250
" />
<path d="M52410 44700
L52360 44720
L52270 44720
L52220 44700
L52200 44650
L52200 44460
L52220 44410
L52270 44390
L52360 44390
L52410 44410
L52430 44460
L52430 44510
L52200 44550
" />
<path d="M52650 44720
L52650 44390
" />
<path d="M52650 44480
L52670 44440
L52700 44410
L52740 44390
L52790 44390
" />
<path d="M52910 44390
L53030 44720
L53150 44390
" />
<path d="M53410 44720
L53360 44700
L53340 44670
L53320 44630
L53320 44480
L53340 44440
L53360 44410
L53410 44390
L53480 44390
L53530 44410
L53550 44440
L53580 44480
L53580 44630
L53550 44670
L53530 44700
L53480 44720
L53410 44720
" />
<path d="M54010 44390
L54010 44720
" />
<path d="M53890 44200
L53770 44550
L54080 44550
" />
</g>
<g style="fill:#840000; fill-opacity:0.0; 
stroke:#840000; stroke-width:100; stroke-opacity:1; 
stroke-linecap:round; stroke-linejoin:round;">
<path style="fill:#840000; fill-opacity:0.0; 
stroke:#840000; stroke-width:100; stroke-opacity:1; 
stroke-linecap:round; stroke-linejoin:round;fill:none"
d="M 51500,44500
51500,44940
54250,44940
54500,44500
54250,44060
51500,44060
Z" /> 
</g>
<g style="fill:#840000; fill-opacity:0.0; 
stroke:#840000; stroke-width:60; stroke-opacity:1; 
stroke-linecap:round; stroke-linejoin:round;">
<text x="66310" y="37250"
textLength="2580" font-size="660" lengthAdjust="spacingAndGlyphs"
text-anchor="start" opacity="0">Servo1</text>
<path d="M66430 37200
L66500 37220
L66620 37220
L66670 37200
L66690 37170
L66720 37130
L66720 37080
L66690 37030
L66670 37010
L66620 36980
L66530 36960
L66480 36940
L66450 36910
L66430 36860
L66430 36820
L66450 36770
L66480 36750
L66530 36720
L66640 36720
L66720 36750
" />
<path d="M67120 37200
L67070 37220
L66980 37220
L66930 37200
L66910 37150
L66910 36960
L66930 36910
L66980 36890
L67070 36890
L67120 36910
L67140 36960
L67140 37010
L66910 37050
" />
<path d="M67360 37220
L67360 36890
" />
<path d="M67360 36980
L67380 36940
L67410 36910
L67450 36890
L67500 36890
" />
<path d="M67620 36890
L67740 37220
L67860 36890
" />
<path d="M68120 37220
L68070 37200
L68050 37170
L68030 37130
L68030 36980
L68050 36940
L68070 36910
L68120 36890
L68190 36890
L68240 36910
L68260 36940
L68290 36980
L68290 37130
L68260 37170
L68240 37200
L68190 37220
L68120 37220
" />
<path d="M68760 37220
L68480 37220
" />
<path d="M68620 37220
L68620 36720
L68570 36790
L68530 36840
L68480 36860
" />
</g>
<g style="fill:#840000; fill-opacity:0.0; 
stroke:#840000; stroke-width:100; stroke-opacity:1; 
stroke-linecap:round; stroke-linejoin:round;">
<path style="fill:#840000; fill-opacity:0.0; 
stroke:#840000; stroke-width:100; stroke-opacity:1; 
stroke-linecap:round; stroke-linejoin:round;fill:none"
d="M 66000,37000
66250,37440
69000,37440
69000,37000
69000,36560
66250,36560
Z" /> 
</g>
<g style="fill:#840000; fill-opacity:0.0; 
stroke:#840000; stroke-width:60; stroke-opacity:1; 
stroke-linecap:round; stroke-linejoin:round;">
<text x="51600" y="43750"
textLength="2580" font-size="660" lengthAdjust="spacingAndGlyphs"
text-anchor="start" opacity="0">Servo3</text>
<path d="M51720 43700
L51790 43720
L51910 43720
L51960 43700
L51980 43670
L52010 43630
L52010 43580
L51980 43530
L51960 43510
L51910 43480
L51820 43460
L51770 43440
L51740 43410
L51720 43360
L51720 43320
L51740 43270
L51770 43250
L51820 43220
L51930 43220
L52010 43250
" />
<path d="M52410 43700
L52360 43720
L52270 43720
L52220 43700
L52200 43650
L52200 43460
L52220 43410
L52270 43390
L52360 43390
L52410 43410
L52430 43460
L52430 43510
L52200 43550
" />
<path d="M52650 43720
L52650 43390
" />
<path d="M52650 43480
L52670 43440
L52700 43410
L52740 43390
L52790 43390
" />
<path d="M52910 43390
L53030 43720
L53150 43390
" />
<path d="M53410 43720
L53360 43700
L53340 43670
L53320 43630
L53320 43480
L53340 43440
L53360 43410
L53410 43390
L53480 43390
L53530 43410
L53550 43440
L53580 43480
L53580 43630
L53550 43670
L53530 43700
L53480 43720
L53410 43720
" />
<path d="M53740 43220
L54050 43220
L53890 43410
L53960 43410
L54010 43440
L54030 43460
L54050 43510
L54050 43630
L54030 43670
L54010 43700
L53960 43720
L53820 43720
L53770 43700
L53740 43670
" />
</g>
<g style="fill:#840000; fill-opacity:0.0; 
stroke:#840000; stroke-width:100; stroke-opacity:1; 
stroke-linecap:round; stroke-linejoin:round;">
<path style="fill:#840000; fill-opacity:0.0; 
stroke:#840000; stroke-width:100; stroke-opacity:1; 
stroke-linecap:round; stroke-linejoin:round;fill:none"
d="M 51500,43500
51500,43940
54250,43940
54500,43500
54250,43060
51500,43060
Z" /> 
</g>
<g style="fill:#840000; fill-opacity:0.0; 
stroke:#840000; stroke-width:60; stroke-opacity:1; 
stroke-linecap:round; stroke-linejoin:round;">
<text x="51600" y="41750"
textLength="2580" font-size="660" lengthAdjust="spacingAndGlyphs"
text-anchor="start" opacity="0">Servo2</text>
<path d="M51720 41700
L51790 41720
L51910 41720
L51960 41700
L51980 41670
L52010 41630
L52010 41580
L51980 41530
L51960 41510
L51910 41480
L51820 41460
L51770 41440
L51740 41410
L51720 41360
L51720 41320
L51740 41270
L51770 41250
L51820 41220
L51930 41220
L52010 41250
" />
<path d="M52410 41700
L52360 41720
L52270 41720
L52220 41700
L52200 41650
L52200 41460
L52220 41410
L52270 41390
L52360 41390
L52410 41410
L52430 41460
L52430 41510
L52200 41550
" />
<path d="M52650 41720
L52650 41390
" />
<path d="M52650 41480
L52670 41440
L52700 41410
L52740 41390
L52790 41390
" />
<path d="M52910 41390
L53030 41720
L53150 41390
" />
<path d="M53410 41720
L53360 41700
L53340 41670
L53320 41630
L53320 41480
L53340 41440
L53360 41410
L53410 41390
L53480 41390
L53530 41410
L53550 41440
L53580 41480
L53580 41630
L53550 41670
L53530 41700
L53480 41720
L53410 41720
" />
<path d="M53770 41270
L53790 41250
L53840 41220
L53960 41220
L54010 41250
L54030 41270
L54050 41320
L54050 41360
L54030 41440
L53740 41720
L54050 41720
" />
</g>
<g style="fill:#840000; fill-opacity:0.0; 
stroke:#840000; stroke-width:100; stroke-opacity:1; 
stroke-linecap:round; stroke-linejoin:round;">
<path style="fill:#840000; fill-opacity:0.0; 
stroke:#840000; stroke-width:100; stroke-opacity:1; 
stroke-linecap:round; stroke-linejoin:round;fill:none"
d="M 51500,41500
51500,41940
54250,41940
54500,41500
54250,41060
51500,41060
Z" /> 
</g>
<g style="fill:#840000; fill-opacity:0.0; 
stroke:#840000; stroke-width:60; stroke-opacity:1; 
stroke-linecap:round; stroke-linejoin:round;">
<text x="51600" y="40750"
textLength="2580" font-size="660" lengthAdjust="spacingAndGlyphs"
text-anchor="start" opacity="0">Servo1</text>
<path d="M51720 40700
L51790 40720
L51910 40720
L51960 40700
L51980 40670
L52010 40630
L52010 40580
L51980 40530
L51960 40510
L51910 40480
L51820 40460
L51770 40440
L51740 40410
L51720 40360
L51720 40320
L51740 40270
L51770 40250
L51820 40220
L51930 40220
L52010 40250
" />
<path d="M52410 40700
L52360 40720
L52270 40720
L52220 40700
L52200 40650
L52200 40460
L52220 40410
L52270 40390
L52360 40390
L52410 40410
L52430 40460
L52430 40510
L52200 40550
" />
<path d="M52650 40720
L52650 40390
" />
<path d="M52650 40480
L52670 40440
L52700 40410
L52740 40390
L52790 40390
" />
<path d="M52910 40390
L53030 40720
L53150 40390
" />
<path d="M53410 40720
L53360 40700
L53340 40670
L53320 40630
L53320 40480
L53340 40440
L53360 40410
L53410 40390
L53480 40390
L53530 40410
L53550 40440
L53580 40480
L53580 40630
L53550 40670
L53530 40700
L53480 40720
L53410 40720
" />
<path d="M54050 40720
L53770 40720
" />
<path d="M53910 40720
L53910 40220
L53860 40290
L53820 40340
L53770 40360
" />
</g>
<g style="fill:#840000; fill-opacity:0.0; 
stroke:#840000; stroke-width:100; stroke-opacity:1; 
stroke-linecap:round; stroke-linejoin:round;">
<path style="fill:#840000; fill-opacity:0.0; 
stroke:#840000; stroke-width:100; stroke-opacity:1; 
stroke-linecap:round; stroke-linejoin:round;fill:none"
d="M 51500,40500
51500,40940
54250,40940
54500,40500
54250,40060
51500,40060
Z" /> 
</g>
<g style="fill:#840000; fill-opacity:0.0; 
stroke:#840000; stroke-width:60; stroke-opacity:1; 
stroke-linecap:round; stroke-linejoin:round;">
<text x="75810" y="44750"
textLength="2580" font-size="660" lengthAdjust="spacingAndGlyphs"
text-anchor="start" opacity="0">Servo3</text>
<path d="M75930 44700
L76000 44720
L76120 44720
L76170 44700
L76190 44670
L76220 44630
L76220 44580
L76190 44530
L76170 44510
L76120 44480
L76030 44460
L75980 44440
L75950 44410
L75930 44360
L75930 44320
L75950 44270
L75980 44250
L76030 44220
L76140 44220
L76220 44250
" />
<path d="M76620 44700
L76570 44720
L76480 44720
L76430 44700
L76410 44650
L76410 44460
L76430 44410
L76480 44390
L76570 44390
L76620 44410
L76640 44460
L76640 44510
L76410 44550
" />
<path d="M76860 44720
L76860 44390
" />
<path d="M76860 44480
L76880 44440
L76910 44410
L76950 44390
L77000 44390
" />
<path d="M77120 44390
L77240 44720
L77360 44390
" />
<path d="M77620 44720
L77570 44700
L77550 44670
L77530 44630
L77530 44480
L77550 44440
L77570 44410
L77620 44390
L77690 44390
L77740 44410
L77760 44440
L77790 44480
L77790 44630
L77760 44670
L77740 44700
L77690 44720
L77620 44720
" />
<path d="M77950 44220
L78260 44220
L78100 44410
L78170 44410
L78220 44440
L78240 44460
L78260 44510
L78260 44630
L78240 44670
L78220 44700
L78170 44720
L78030 44720
L77980 44700
L77950 44670
" />
</g>
<g style="fill:#840000; fill-opacity:0.0; 
stroke:#840000; stroke-width:100; stroke-opacity:1; 
stroke-linecap:round; stroke-linejoin:round;">
<path style="fill:#840000; fill-opacity:0.0; 
stroke:#840000; stroke-width:100; stroke-opacity:1; 
stroke-linecap:round; stroke-linejoin:round;fill:none"
d="M 75500,44500
75750,44940
78500,44940
78500,44500
78500,44060
75750,44060
Z" /> 
</g>
<g style="fill:#840000; fill-opacity:0.0; 
stroke:#840000; stroke-width:60; stroke-opacity:1; 
stroke-linecap:round; stroke-linejoin:round;">
<text x="66310" y="44750"
textLength="2580" font-size="660" lengthAdjust="spacingAndGlyphs"
text-anchor="start" opacity="0">Servo4</text>
<path d="M66430 44700
L66500 44720
L66620 44720
L66670 44700
L66690 44670
L66720 44630
L66720 44580
L66690 44530
L66670 44510
L66620 44480
L66530 44460
L66480 44440
L66450 44410
L66430 44360
L66430 44320
L66450 44270
L66480 44250
L66530 44220
L66640 44220
L66720 44250
" />
<path d="M67120 44700
L67070 44720
L66980 44720
L66930 44700
L66910 44650
L66910 44460
L66930 44410
L66980 44390
L67070 44390
L67120 44410
L67140 44460
L67140 44510
L66910 44550
" />
<path d="M67360 44720
L67360 44390
" />
<path d="M67360 44480
L67380 44440
L67410 44410
L67450 44390
L67500 44390
" />
<path d="M67620 44390
L67740 44720
L67860 44390
" />
<path d="M68120 44720
L68070 44700
L68050 44670
L68030 44630
L68030 44480
L68050 44440
L68070 44410
L68120 44390
L68190 44390
L68240 44410
L68260 44440
L68290 44480
L68290 44630
L68260 44670
L68240 44700
L68190 44720
L68120 44720
" />
<path d="M68720 44390
L68720 44720
" />
<path d="M68600 44200
L68480 44550
L68790 44550
" />
</g>
<g style="fill:#840000; fill-opacity:0.0; 
stroke:#840000; stroke-width:100; stroke-opacity:1; 
stroke-linecap:round; stroke-linejoin:round;">
<path style="fill:#840000; fill-opacity:0.0; 
stroke:#840000; stroke-width:100; stroke-opacity:1; 
stroke-linecap:round; stroke-linejoin:round;fill:none"
d="M 66000,44500
66250,44940
69000,44940
69000,44500
69000,44060
66250,44060
Z" /> 
</g>
<g style="fill:#840000; fill-opacity:0.0; 
stroke:#840000; stroke-width:0; stroke-opacity:1; 
stroke-linecap:round; stroke-linejoin:round;">
</g>
<g style="fill:#008400; fill-opacity:0.0; 
stroke:#008400; stroke-width:0; stroke-opacity:1; 
stroke-linecap:round; stroke-linejoin:round;">
</g>
<g style="fill:#008400; fill-opacity:1.0; 
stroke:#008400; stroke-width:100; stroke-opacity:1; 
stroke-linecap:round; stroke-linejoin:round;">
<circle cx="48500" cy="22500" r="200" /> 
</g>
<g style="fill:#008400; fill-opacity:1.0; 
stroke:#008400; stroke-width:0; stroke-opacity:1; 
stroke-linecap:round; stroke-linejoin:round;">
</g>
<g style="fill:#008400; fill-opacity:1.0; 
stroke:#008400; stroke-width:100; stroke-opacity:1; 
stroke-linecap:round; stroke-linejoin:round;">
<circle cx="60000" cy="22500" r="200" /> 
</g> 
</svg>
