<?xml version="1.0" encoding="UTF-8" standalone="no"?>
<!-- Created with Inkscape (http://www.inkscape.org/) -->

<svg
   width="32"
   height="32"
   viewBox="0 0 8.4666662 8.4666662"
   version="1.1"
   id="svg5"
   inkscape:export-filename="line.png"
   inkscape:export-xdpi="96"
   inkscape:export-ydpi="96"
   inkscape:version="1.2.2 (b0a8486541, 2022-12-01)"
   sodipodi:docname="button.svg"
   xmlns:inkscape="http://www.inkscape.org/namespaces/inkscape"
   xmlns:sodipodi="http://sodipodi.sourceforge.net/DTD/sodipodi-0.dtd"
   xmlns:xlink="http://www.w3.org/1999/xlink"
   xmlns="http://www.w3.org/2000/svg"
   xmlns:svg="http://www.w3.org/2000/svg">
  <sodipodi:namedview
     id="namedview7"
     pagecolor="#ffffff"
     bordercolor="#666666"
     borderopacity="1.0"
     inkscape:showpageshadow="2"
     inkscape:pageopacity="0.0"
     inkscape:pagecheckerboard="0"
     inkscape:deskcolor="#d1d1d1"
     inkscape:document-units="px"
     showgrid="false"
     inkscape:zoom="13.023234"
     inkscape:cx="40.850068"
     inkscape:cy="27.834868"
     inkscape:window-width="1887"
     inkscape:window-height="1030"
     inkscape:window-x="0"
     inkscape:window-y="31"
     inkscape:window-maximized="1"
     inkscape:current-layer="layer1" />
  <defs
     id="defs2">
    <linearGradient
       id="linearGradient1017"
       inkscape:swatch="gradient">
      <stop
         style="stop-color:#686868;stop-opacity:1;"
         offset="0.40337181"
         id="stop1013" />
      <stop
         style="stop-color:#979797;stop-opacity:0;"
         offset="1"
         id="stop1015" />
    </linearGradient>
    <linearGradient
       inkscape:collect="always"
       xlink:href="#linearGradient1017"
       id="linearGradient1068"
       x1="0.068021007"
       y1="2.8373621"
       x2="9.6975384"
       y2="7.534493"
       gradientUnits="userSpaceOnUse" />
  </defs>
  <g
     inkscape:label="Ebene 1"
     inkscape:groupmode="layer"
     id="layer1">
    <rect
       style="fill:url(#linearGradient1068);fill-opacity:1;stroke:none;stroke-width:0.499999;stroke-linecap:round;stop-color:#000000"
       id="rect286-6"
       width="8.4666662"
       height="8.4666662"
       x="0"
       y="0"
       rx="1.5874999"
       ry="1.5874999" />
    <rect
       style="font-variation-settings:normal;opacity:1;vector-effect:none;fill:#000000;fill-opacity:1;stroke:none;stroke-width:0.393665;stroke-linecap:round;stroke-linejoin:miter;stroke-miterlimit:4;stroke-dasharray:none;stroke-dashoffset:0;stroke-opacity:1;-inkscape-stroke:none;stop-color:#000000;stop-opacity:1"
       id="rect286"
       width="6.6660757"
       height="6.6660757"
       x="0.90029514"
       y="0.90029514"
       rx="1.2498891"
       ry="1.2498891" />
    <rect
       style="stroke:#ffffff;stroke-width:0.529167;stroke-linecap:round;stop-color:#000000"
       id="rect533"
       width="0.41442537"
       height="0.42461267"
       x="2.443167"
       y="2.346997" />
    <rect
       style="stroke:#ffffff;stroke-width:0.529167;stroke-linecap:round;stop-color:#000000"
       id="rect533-3"
       width="0.41442537"
       height="0.42461267"
       x="3.6411135"
       y="5.4564419" />
    <rect
       style="stroke:#ffffff;stroke-width:0.529167;stroke-linecap:round;stop-color:#000000"
       id="rect533-6"
       width="0.41442537"
       height="0.42461267"
       x="5.1823721"
       y="3.5587413" />
  </g>
</svg>
