{
    "name": "com.raphael.bejeweled.tests",
    "references": [
        "UnityEngine.TestRunner",
        "UnityEditor.TestRunner",
        "com.raphael.bejeweled"
    ],
    "includePlatforms": [],
    "excludePlatforms": [],
    "allowUnsafeCode": false,
    "overrideReferences": true,
    "precompiledReferences": [
        "nunit.framework.dll"
    ],
    "autoReferenced": false,
    "defineConstraints": [
        "UNITY_INCLUDE_TESTS"
    ],
    "versionDefines": [],
    "noEngineReferences": false
}