{
    "path": [
        {
          "direction": "up"
        },
        {
          "direction": "up"
        },
        {
          "direction": "right"
        },
        {
            "direction": "down"
        },
        {
            "direction": "right"
        }
    ]

}