[
    {
        "id": "education-chiot",
        "title": "Éducation Chiot",
        "summary": "Ce programme permet de partir sur de bonnes bases avec votre chiot ou jeune chien ainsi que de développer une relation saine.",
        "content": {
            "age": "2 mois jusqu'à 2 ans",
            "description": "Ce programme permet de partir sur de bonnes bases avec votre chiot ou jeune chien ainsi que de développer une relation saine. En séances, nous verrons : <ul><li>le cadre de vie à la maison (propreté, solitude, mordillements, règles à mettre en place)</li><li>les ordres de base (assis, coucher, panier, au pied)</li><li>les bases du rappel</li><li>la sociabilisation et la socialisation</li><li>la marche en laisse</li></ul>",
            "prices": [
                "448€ (+ frais de déplacements au delà de 35km de Lusignan) pour 8 séances."
            ]
        },
        "image": "/programme_chiot.jpg"
    },
    {
        "id": "education",
        "title": "Éducation",
        "summary": "Ce programme est fait pour les chiens qui ne rencontrent pas de troubles du comportements mais plutôt un manque d'éducation, de cadre et d'obéissance.",
        "content": {
            "age": "2 ans",
            "description": "Ce programme est fait pour les chiens qui ne rencontrent pas de troubles du comportements mais qui ont des problèmes d'éducation : chien qui tire en laisse, chien qui ne revient pas au rappel, etc... En séances, nous verrons : <ul><li>le cadre de vie à la maison</li><li>la marche en laisse</li><li>les ordres de base (assis, coucher, marche au pied, panier, ...)</li><li>les rencontres en extérieur</li><li>le rappel</li></ul>Plusieurs forfaits disponibles, je conseillerai lors du bilan celui qui sera le plus approprié.",
            "prices": [
                "224€ (+ frais de déplacements au delà de 35km de Lusignan) pour 4 séances",
                "336€ (+ frais de déplacements au delà de 35km de Lusignan) pour 6 séances",
                "448€ (+ frais de déplacements au delà de 35km de Lusignan) pour 8 séances"
            ]
        },
        "image": "/programme_adulte.jpg"
    },
    {
        "id": "reeducation",
        "title": "Rééducation",
        "summary": "Pour la rééducation, nous définirons ensemble le nombre de séances/ou bien forfait nécessaires pour atteindre vos objectifs.",
        "content": {
            "description": "La rééducation est faite pour les chiens présentant des troubles du comportement comme l'agressivité humain/chien, chien peureux, chien anxieux, chien adulte pas propre, aboiements récurrents, chien destructeur, etc. <br/> Pour la rééducation, nous définirons ensemble le nombre de séances/ou bien forfait nécessaires pouratteindre vos objectifs/améliorer la situation.",
            "prices": [
                "60€ (+ frais de déplacements au delà de 35km de Lusignan) pour 1 séance",
                "224€ (+ frais de déplacements au delà de 35km de Lusignan) pour 4 séances",
                "336€ (+ frais de déplacements au delà de 35km de Lusignan) pour 6 séances",
                "448€ (+ frais de déplacements au delà de 35km de Lusignan) pour 8 séances"
            ]
        },
        "image": "/comportement.jpg"
    },
    {
        "id": "garde",
        "title": "Garde à domicile",
        "summary": "La garde à domicile est proposée pour les chiens déjà clients ou non.",
        "content": {
            "description": "La garde à domicile est proposée pour tous les chiens : chiot, chien adulte, chien avec des problèmes de comportement. <br/><br/> Pendant la garde, l'éducation de votre chien est maintenue. Une balade en matinée et en après-midi seront proposées (min 2h et adaptée au chien). Les chiens qui ne s'entendent pas avec leurs congénères sont sortis individuellement en balade. <br/><br/>Pour le début de la garde, soit le chien est amené par vos soins à mon domicile, soit je viens le chercher chez vous (des frais de déplacements sont alors à prévoir à partir de 35km de Lusignan). Idem pour la fin de la garde. <br/><br/> Bien entendu, vous avez des nouvelles tous les jours de votre chien, notamment avec des vidéos !",
            "prices": [
                "30€ par jour."
            ]
        },
        "image": "/garde.jpg"
    }
]