<?xml version="1.0" encoding="utf-8"?>
<!-- Generator: Adobe Illustrator 23.0.0, SVG Export Plug-In . SVG Version: 6.00 Build 0)  -->
<svg version="1.1" id="Calque_1" xmlns="http://www.w3.org/2000/svg" xmlns:xlink="http://www.w3.org/1999/xlink" x="0px" y="0px"
	 viewBox="0 0 500 500" style="enable-background:new 0 0 500 500;" xml:space="preserve">
<style type="text/css">
	.st0{fill:#FFFFFF;}
	.st1{fill:#0067DC;}
	.st2{fill:#E20000;}
	.st3{fill:#FF0000;}
</style>
<g>
	<ellipse transform="matrix(0.9325 -0.3612 0.3612 0.9325 -113.1595 97.0297)" cx="203" cy="351.3" rx="63.6" ry="78.4"/>
	<g>
		
			<ellipse transform="matrix(0.9325 -0.3612 0.3612 0.9325 -112.6249 96.9298)" class="st0" cx="203" cy="349.8" rx="26.6" ry="34"/>
	</g>
	<g>
		<path d="M84.6,292.1l35.5,29.6c0,0-17.8,29.6,41.4,94.7c-20.7,0-62.2-5.9-79.9-50.3C69.8,333.5,69.8,292.1,84.6,292.1z"/>
	</g>
	<g>
		<path class="st1" d="M123.1,315.7c0,0-91.8-74-103.6-91.8s-32.6-82.9,35.5-94.7c0,0,35.5,3,44.4,3c-1.5,1.5-13.3,4.4-13.3,4.4
			h17.8l-20.7,8.9l50.3,3L95,157.4l38.5,3L92,166.2l41.4,5.9L92,178.1l44.4,3L92,187l53.3,5.9l-50.3,3l50.3,5.9l-59.2,5.9l65.1,5.9
			l-50.3,8.9l53.3,5.9l-47.4,8.9l53.3,3l-44.4,5.9l44.4,5.9l-32.6,3l29.6,5.9l-29.6,5.9l29.6,5.9l-23.7,3l11.8,3l-14.8,3l11.8,5.9
			l-14.8,3c0,0,5.9,3,5.9,3S123.1,315.7,123.1,315.7z"/>
	</g>
	<path d="M200,376.4c-0.3,0-0.5-0.1-0.7-0.2c-21.3-12.2-18.5-39.7-18.5-39.9c0.1-0.8,0.8-1.4,1.6-1.3c0.8,0.1,1.4,0.8,1.3,1.6
		c0,0.3-2.6,25.8,17,37c0.7,0.4,1,1.3,0.6,2C201.1,376.1,200.6,376.4,200,376.4z"/>
	<path d="M270.2,412.7c-0.4,0-0.8-0.2-1.1-0.5c-0.5-0.6-0.5-1.6,0.2-2.1c0.2-0.2,23.5-20.4,15.3-46.6c-0.2-0.8,0.2-1.6,1-1.9
		c0.8-0.2,1.6,0.2,1.9,1c8.8,28-15.9,49.5-16.2,49.7C270.9,412.6,270.5,412.7,270.2,412.7z"/>
	<path d="M290.3,404.5c-0.4,0-0.9-0.2-1.2-0.6c-0.5-0.7-0.4-1.6,0.3-2.1c0.2-0.1,11-8.9,5.4-34c-0.2-0.8,0.3-1.6,1.1-1.8
		c0.8-0.2,1.6,0.3,1.8,1.1c6.1,27.3-6,36.6-6.5,37C291,404.4,290.6,404.5,290.3,404.5z"/>
	<polygon class="st2" points="64.1,113.8 50.2,93 80.5,99.7 79.8,102.6 56.8,97.4 66.6,112.1 	"/>
	<path class="st2" d="M462,262.4c-0.7,0-1.3-0.5-1.5-1.3c-13.1-83.9-51.9-118.7-68.5-133.6c-2.1-1.9-3.8-3.4-5.1-4.7
		C338.8,84,293.7,70.2,253.1,82.1c-67.3,19.7-97.3,101.6-97.6,102.4c-0.2,0.6-0.7,1-1.4,1c-0.6,0-1.2-0.4-1.4-0.9
		c-8.1-20.2-8.9-37.9-2.4-52.6c4.7-10.7,12.3-17.5,18.2-21.6l-5.3,1.1c-0.6,0.1-1.2-0.1-1.5-0.6c-0.3-0.5-0.3-1.1,0-1.6l9.4-14.2
		l-22.5,7.5c-0.6,0.2-1.2,0-1.6-0.4c-0.4-0.4-0.5-1-0.3-1.6l7.3-17l-26,13c-0.5,0.3-1.2,0.2-1.6-0.2s-0.6-1-0.5-1.5l5-17.6
		L95.6,93.6c-0.7,0.3-1.6,0-2-0.7c-0.3-0.7,0-1.6,0.7-2l38.5-17.8c0.5-0.2,1.1-0.2,1.6,0.2c0.4,0.4,0.6,1,0.5,1.5l-5,17.5l26.6-13.3
		c0.6-0.3,1.2-0.2,1.7,0.2c0.5,0.4,0.6,1.1,0.3,1.7l-7.6,17.7l23.5-7.8c0.6-0.2,1.3,0,1.6,0.5c0.4,0.5,0.4,1.2,0.1,1.7l-9.9,14.8
		l11.3-2.3c0.7-0.2,1.5,0.3,1.7,1c0.2,0.7-0.2,1.5-0.9,1.8c-0.2,0.1-17.4,6.7-25.3,24.8c-5.7,13.1-5.4,28.8,1.1,46.7
		c6.8-16.3,37.7-83,98.1-100.7c41.5-12.2,87.5,1.8,136.6,41.4c1.4,1.4,3.1,2.9,5.1,4.7c16.8,15.1,56.2,50.4,69.4,135.3
		c0.1,0.8-0.4,1.6-1.2,1.7C462.2,262.4,462.1,262.4,462,262.4z"/>
	<path class="st2" d="M324.2,364.2c-0.3,0-0.8-0.1-1.3-0.5c-0.3-0.2-0.6-0.5-1.1-1c-4.6-4.6-26.7-9.8-34.8-11.4l0.6-2.9
		c1,0.2,21.9,4.4,32,9.4c-3.3-4.8-8.1-11.3-9.7-12.9c-1.4-1.4-1.1-4,0.8-6.3c5.8-6.9,21.9-8.4,48.4,9.9c4.1,2.8,6.7,4.5,8.5,5.6
		c-5.2-5.9-18.4-18.5-31.1-29.9l-2.4-2.1l3.1-0.4c1.7-0.2,42.3-5.8,63.3,12.2c2.9,2.4,4.3,3.1,4.9,3.3c-0.1-0.9-0.7-3.2-3.1-7.3
		c-6.5-11.1-22.1-28.7-38.6-32l0.6-2.9c22.6,4.5,42.7,33.2,44,41.4c0.3,2.1-0.5,3.1-1.2,3.5c-1.7,1-4.3-0.2-8.5-3.8
		c-16.7-14.3-47.7-12.8-57.8-11.9c33.9,30.6,32.3,32.6,31.4,33.8c-1.1,1.4-2.3,1.7-14.9-7c-23.2-16.1-37.7-16.4-43.6-11.3
		c-1.8,1.5-1.9,2.9-1.8,3.2c0.1,0.1,15.5,18.5,13.2,20.9C325.2,363.8,324.8,364.2,324.2,364.2z"/>
	<g>
		<path class="st3" d="M177.8,263.9l-23.7-77c0,0,38.5-145,180.6-100.6c-14.8,0-23.7,5.9-23.7,5.9l59.2,5.9l-47.4,3l50.3,5.9
			l-53.3,5.9l79.9,3l-82.9,5.9l97.7,5.9l-91.8,3l94.7,8.9l-103.6,3l103.6,5.9l-106.6,5.9l124.3,3l-103.6,3l44.4,3l-17.8,3l71,5.9
			c0,0-59.2,5.9-62.2,5.9s65.1,3,65.1,3l-47.4,5.9l50.3,3l-56.2,5.9h44.4l-41.4,5.9l38.5,3l-41.4,5.9H391l-17.8,3l68.1,8.9
			l-17.8,5.9H462l-53.3,3l26.6,8.9l-56.2,3l71,11.8l-47.4,5.9l47.4,3l-32.6,3l35.5,3l-29.6,5.9h47.4l-65.1,5.9l68.1,3l-79.9,8.9
			l106.6,5.9H399.9l91.8,8.9l-109.5-5.9l29.6,5.9h-50.3l41.4,5.9l-53.3,8.9H391l-56.2,5.9l8.9,5.9H314l5.9,8.9l-17.8-3v8.9l-20.7-3
			C281.5,346.8,260.7,246.2,177.8,263.9z"/>
	</g>
</g>
</svg>
