<?xml version="1.0" encoding="utf-8"?>
<!-- Generator: Adobe Illustrator 23.0.0, SVG Export Plug-In . SVG Version: 6.00 Build 0)  -->
<svg version="1.1" id="Calque_1" xmlns="http://www.w3.org/2000/svg" xmlns:xlink="http://www.w3.org/1999/xlink" x="0px" y="0px"
	 viewBox="0 0 841.9 402.5" style="enable-background:new 0 0 841.9 402.5;" xml:space="preserve">
<style type="text/css">
	.st0{fill:none;}
	.st1{fill:#09A9B6;}
	.st2{fill:#FEE616;}
	.st3{fill:#FFFFFF;}
	.st4{fill:#56572E;}
	.st5{fill:#85BC31;}
	.st6{fill:#A17E53;}
	.st7{fill:#9FD8EE;}
	.st8{fill:#162B34;}
	.st9{fill:#F4BD07;}
	.st10{fill:#7A3938;}
	.st11{fill:#9CA93C;}
	.st12{fill:#A3AD77;}
	.st13{fill:#184757;}
	.st14{fill:#15ACBA;}
	.st15{fill:#EC643F;}
	.st16{fill:#E3E9A6;}
	.st17{fill:#AA3241;}
	.st18{fill:#EC6160;}
	.st19{fill:#2B5A6A;}
	.st20{fill:#EB5D1D;}
	.st21{fill:#1C4B62;}
	.st22{fill:#F18619;}
	.st23{fill:#1B3B6A;}
	.st24{fill:#0759A3;}
	.st25{fill:#AC9F9A;}
	.st26{fill:#6A6361;}
</style>
<g>
	<rect x="62.1" y="267.1" class="st0" width="18" height="21.6"/>
	<rect x="62.1" y="295.3" class="st0" width="18" height="21.6"/>
	<rect x="36.1" y="295.3" class="st0" width="18" height="21.6"/>
	<polygon class="st0" points="-1.1,150.6 -1.1,201.3 32,201.3 32,251.6 97.2,251.6 97.2,308.4 97.2,375.7 24.8,375.7 -1.1,375.7 
		-1.1,393.7 197.8,393.7 197.8,150.6 	"/>
	<rect x="36.1" y="323.5" class="st0" width="18" height="21.6"/>
	<rect x="62.1" y="323.5" class="st0" width="18" height="21.6"/>
	<rect x="36.1" y="267.1" class="st0" width="18" height="21.6"/>
</g>
<g>
	<g>
		<g>
			<path class="st1" d="M772.5,243.8v-55.6h-38.3v-36.9h-39.6v65.1h-41.9V286h-34.5v20.6v71.1v3.4h146.7h76.9v-74.5v-62.8H772.5z
				 M796,347.2h-19.1v-23.9H796V347.2z M796,316h-19.1v-23.9H796V316z M796,284.9h-19.1V261H796V284.9z M823.6,347.2h-19.1v-23.9
				h19.1V347.2z M823.6,316h-19.1v-23.9h19.1V316z M823.6,284.9h-19.1V261h19.1V284.9z"/>
			<path class="st1" d="M548.8,65.3h-38.3V28.4h-39.6v65.1H429V163h-34.5v20.6v71.1v93.1h146.7h76.9V183.7v-62.8h-69.3V65.3z
				 M580.8,138.1h19.1v23.9h-19.1V138.1z M580.8,169.2h19.1v23.9h-19.1V169.2z M580.8,200.4h19.1v23.9h-19.1V200.4z M553.2,138.1
				h19.1v23.9h-19.1V138.1z M553.2,169.2h19.1v23.9h-19.1V169.2z M553.2,200.4h19.1v23.9h-19.1V200.4z"/>
		</g>
		<path class="st2" d="M480.6,86.3c0,35.7-27.8,64.7-62.1,64.7c-34.3,0-62.1-29-62.1-64.7c0-35.7,27.8-64.7,62.1-64.7
			C452.8,21.6,480.6,50.6,480.6,86.3z"/>
		<path class="st3" d="M301.8,113.4c-1.8,0-3.6,0.1-5.3,0.4c0-0.1,0-0.3,0-0.4c0-22.6-17.6-40.9-39.2-40.9c-6.1,0-11.9,1.5-17.1,4.1
			c-7.1-16.9-23.2-28.7-42.1-28.7c-24,0-43.6,19.2-45.7,43.6c-1.9-0.2-3.7-0.4-5.7-0.4c-24.5,0-44.4,20.7-44.4,46.3v16.5h2.9h82.9
			h63.1H263h77.5C340.5,131.5,323.2,113.4,301.8,113.4z"/>
		<path class="st3" d="M601.4,77.7c1.4,0,2.7,0.1,4.1,0.3c0-0.1,0-0.2,0-0.3c0-17.4,13.5-31.5,30.2-31.5c4.7,0,9.2,1.1,13.2,3.1
			c5.4-13,17.9-22.1,32.4-22.1c18.4,0,33.6,14.7,35.2,33.6c1.4-0.2,2.9-0.3,4.4-0.3c18.9,0,34.2,16,34.2,35.6v12.7h-2.2h-63.9h-48.6
			h-8.9h-59.7C571.5,91.7,584.9,77.7,601.4,77.7z"/>
		<g>
			<rect x="287.5" y="235.5" class="st4" width="7.1" height="42.5"/>
			<polygon class="st4" points="269.5,225.5 289.6,262.8 289.6,255.1 279.5,235.5 			"/>
			<path class="st5" d="M264.7,215.9c0,6.7,2.4,12.8,6.4,17.4c4.5,5.2,11.1,8.5,18.4,8.5c13.7,0,24.9-11.6,24.9-25.9
				c0-14.3-11.1-25.9-24.9-25.9C275.8,190,264.7,201.6,264.7,215.9z"/>
		</g>
		<g>
			<rect x="640.9" y="303.9" class="st4" width="7.1" height="42.5"/>
			<polygon class="st4" points="622.9,293.9 643,331.3 643,323.6 632.9,303.9 			"/>
			<path class="st5" d="M618.1,284.3c0,6.7,2.4,12.8,6.4,17.4c4.5,5.2,11.1,8.5,18.4,8.5c13.7,0,24.9-11.6,24.9-25.9
				c0-14.3-11.1-25.9-24.9-25.9C629.2,258.4,618.1,270,618.1,284.3z"/>
		</g>
		<path class="st1" d="M210.1,164.7v-40.8h-28.2V96.7h-29.1v47.8h-30.8v51.1H96.7v15.2v24.7H34V180H-1.1v192.8h27.6h76.9v-74.5
			v-15.1h101.2h56.5v-72.4v-46.1H210.1z M140.2,154h8v14.6h-8V154z M57.6,338.9H38.4V315h19.1V338.9z M57.6,307.7H38.4v-23.9h19.1
			V307.7z M57.6,276.6H38.4v-23.9h19.1V276.6z M85.2,338.9H66.1V315h19.1V338.9z M85.2,307.7H66.1v-23.9h19.1V307.7z M85.2,276.6
			H66.1v-23.9h19.1V276.6z M111.1,238.8h-7.8v-3.2h-0.2v-11.4h8V238.8z M111.1,218h-8v-14.6h8V218z M122.9,238.8h-8v-14.6h8V238.8z
			 M122.9,218h-8v-14.6h8V218z M136.3,189.4h-8v-14.6h8V189.4z M136.3,168.6h-8V154h8V168.6z M140.2,174.8h8v14.6h-8V174.8z
			 M154.5,263.1h-8v-14.6h8V263.1z M154.5,242.3h-8v-14.6h8V242.3z M166.3,263.1h-8v-14.6h8V263.1z M166.3,242.3h-8v-14.6h8V242.3z
			 M179.7,213.8h-8v-14.6h8V213.8z M179.7,193h-8v-14.6h8V193z M191.5,213.8h-8v-14.6h8V213.8z M191.5,193h-8v-14.6h8V193z
			 M227.4,240.6h-14.1v-17.5h14.1V240.6z M227.4,217.7h-14.1v-17.5h14.1V217.7z M227.4,194.8h-14.1v-17.5h14.1V194.8z M247.7,240.6
			h-14.1v-17.5h14.1V240.6z M247.7,217.7h-14.1v-17.5h14.1V217.7z M247.7,194.8h-14.1v-17.5h14.1V194.8z"/>
		<g>
			<path class="st6" d="M261,159.4v-0.1h0c-0.2-13.4-10.1-24.4-22.7-25.6v-6.4h8.8v-4.5h-8.8v-7h-4.5v7h-9v4.5h9v6.3
				c-12.9,1.1-23.1,12.4-23.1,26.1c0,0.6,0,1.2,0.1,1.8v181.2H261V160.1c0-0.1,0-0.2,0-0.4C261,159.6,261,159.5,261,159.4z"/>
			<path class="st7" d="M226.8,184.3c0,2.6-2,4.7-4.6,4.7l0,0c-2.5,0-4.6-2.1-4.6-4.7v-9.2c0-2.6,2-4.7,4.6-4.7l0,0
				c2.5,0,4.6,2.1,4.6,4.7V184.3z"/>
			<path class="st7" d="M240.4,184.3c0,2.6-2,4.7-4.6,4.7l0,0c-2.5,0-4.6-2.1-4.6-4.7v-9.2c0-2.6,2-4.7,4.6-4.7l0,0
				c2.5,0,4.6,2.1,4.6,4.7V184.3z"/>
			<path class="st7" d="M254,184.3c0,2.6-2,4.7-4.6,4.7l0,0c-2.5,0-4.6-2.1-4.6-4.7v-9.2c0-2.6,2-4.7,4.6-4.7l0,0
				c2.5,0,4.6,2.1,4.6,4.7V184.3z"/>
			<path class="st7" d="M226.8,209.1c0,2.6-2,4.7-4.6,4.7l0,0c-2.5,0-4.6-2.1-4.6-4.7v-9.2c0-2.6,2-4.7,4.6-4.7l0,0
				c2.5,0,4.6,2.1,4.6,4.7V209.1z"/>
			<path class="st7" d="M240.4,209.1c0,2.6-2,4.7-4.6,4.7l0,0c-2.5,0-4.6-2.1-4.6-4.7v-9.2c0-2.6,2-4.7,4.6-4.7l0,0
				c2.5,0,4.6,2.1,4.6,4.7V209.1z"/>
			<path class="st7" d="M254,209.1c0,2.6-2,4.7-4.6,4.7l0,0c-2.5,0-4.6-2.1-4.6-4.7v-9.2c0-2.6,2-4.7,4.6-4.7l0,0
				c2.5,0,4.6,2.1,4.6,4.7V209.1z"/>
			<path class="st7" d="M226.8,233.9c0,2.6-2,4.7-4.6,4.7l0,0c-2.5,0-4.6-2.1-4.6-4.7v-9.2c0-2.6,2-4.7,4.6-4.7l0,0
				c2.5,0,4.6,2.1,4.6,4.7V233.9z"/>
			<path class="st7" d="M240.4,233.9c0,2.6-2,4.7-4.6,4.7l0,0c-2.5,0-4.6-2.1-4.6-4.7v-9.2c0-2.6,2-4.7,4.6-4.7l0,0
				c2.5,0,4.6,2.1,4.6,4.7V233.9z"/>
			<path class="st7" d="M254,233.9c0,2.6-2,4.7-4.6,4.7l0,0c-2.5,0-4.6-2.1-4.6-4.7v-9.2c0-2.6,2-4.7,4.6-4.7l0,0
				c2.5,0,4.6,2.1,4.6,4.7V233.9z"/>
			<path class="st7" d="M226.8,258.7c0,2.6-2,4.7-4.6,4.7l0,0c-2.5,0-4.6-2.1-4.6-4.7v-9.2c0-2.6,2-4.7,4.6-4.7l0,0
				c2.5,0,4.6,2.1,4.6,4.7V258.7z"/>
			<path class="st7" d="M240.4,258.7c0,2.6-2,4.7-4.6,4.7l0,0c-2.5,0-4.6-2.1-4.6-4.7v-9.2c0-2.6,2-4.7,4.6-4.7l0,0
				c2.5,0,4.6,2.1,4.6,4.7V258.7z"/>
			<path class="st7" d="M254,258.7c0,2.6-2,4.7-4.6,4.7l0,0c-2.5,0-4.6-2.1-4.6-4.7v-9.2c0-2.6,2-4.7,4.6-4.7l0,0
				c2.5,0,4.6,2.1,4.6,4.7V258.7z"/>
			<path class="st7" d="M226.8,283.5c0,2.6-2,4.7-4.6,4.7l0,0c-2.5,0-4.6-2.1-4.6-4.7v-9.2c0-2.6,2-4.7,4.6-4.7l0,0
				c2.5,0,4.6,2.1,4.6,4.7V283.5z"/>
			<path class="st7" d="M240.4,283.5c0,2.6-2,4.7-4.6,4.7l0,0c-2.5,0-4.6-2.1-4.6-4.7v-9.2c0-2.6,2-4.7,4.6-4.7l0,0
				c2.5,0,4.6,2.1,4.6,4.7V283.5z"/>
			<path class="st7" d="M254,283.5c0,2.6-2,4.7-4.6,4.7l0,0c-2.5,0-4.6-2.1-4.6-4.7v-9.2c0-2.6,2-4.7,4.6-4.7l0,0
				c2.5,0,4.6,2.1,4.6,4.7V283.5z"/>
			<rect x="210.7" y="159.7" class="st7" width="50.3" height="3"/>
			<rect x="210.7" y="215.5" class="st7" width="50.3" height="3"/>
			<rect x="210.7" y="265.2" class="st7" width="50.3" height="3"/>
		</g>
		<g>
			<g>
				<rect x="517.9" y="304.1" class="st8" width="66.6" height="43.7"/>
				<polygon class="st9" points="508,304.1 517.9,304.1 584.5,304.1 584.5,274.1 518.8,274.1 				"/>
			</g>
			<g>
				<polygon class="st10" points="605.7,239.6 578.4,209.9 552.6,239.6 552.6,348.8 605.7,348.8 				"/>
				<polygon class="st11" points="620.6,245.7 579,200.3 536.9,245.7 544.1,252.8 578.8,216.2 613.5,252.8 				"/>
				<g>
					<g>
						<rect x="560.2" y="248.8" class="st3" width="15.9" height="19.9"/>
						<rect x="562.9" y="252.1" class="st12" width="10.6" height="13.2"/>
					</g>
					<g>
						<rect x="581.8" y="248.8" class="st3" width="15.9" height="19.9"/>
						<rect x="584.5" y="252.1" class="st12" width="10.6" height="13.2"/>
					</g>
				</g>
				<g>
					<g>
						<rect x="560.2" y="272" class="st3" width="15.9" height="19.9"/>
						<rect x="562.9" y="275.3" class="st12" width="10.6" height="13.2"/>
					</g>
					<g>
						<rect x="581.8" y="272" class="st3" width="15.9" height="19.9"/>
						<rect x="584.5" y="275.3" class="st12" width="10.6" height="13.2"/>
					</g>
				</g>
				<g>
					<g>
						<rect x="560.2" y="295.2" class="st3" width="15.9" height="19.9"/>
						<rect x="562.9" y="298.5" class="st12" width="10.6" height="13.2"/>
						<rect x="572.3" y="318.2" class="st3" width="12.7" height="28.7"/>
						<rect x="574.9" y="320.7" class="st12" width="7.4" height="25.4"/>
						<polygon class="st3" points="583.3,326 583.3,324.9 579.2,324.9 579.2,319.7 577.9,319.7 577.9,324.9 573.5,324.9 573.5,326 
							577.9,326 577.9,329.3 573.5,329.3 573.5,330.3 577.9,330.3 577.9,333.6 573.5,333.6 573.5,334.7 577.9,334.7 577.9,338 
							573.5,338 573.5,339 577.9,339 577.9,342.4 573.5,342.4 573.5,343.4 577.9,343.4 577.9,346 579.2,346 579.2,343.4 
							583.3,343.4 583.3,342.4 579.2,342.4 579.2,339 583.3,339 583.3,338 579.2,338 579.2,334.7 583.3,334.7 583.3,333.6 
							579.2,333.6 579.2,330.3 583.3,330.3 583.3,329.3 579.2,329.3 579.2,326 						"/>
					</g>
					<g>
						<rect x="581.8" y="295.2" class="st3" width="15.9" height="19.9"/>
						<rect x="584.5" y="298.5" class="st12" width="10.6" height="13.2"/>
					</g>
				</g>
			</g>
		</g>
		<g>
			<rect x="534.4" y="304.7" class="st4" width="7.1" height="42.5"/>
			<polygon class="st4" points="559.6,294.7 539.5,332.1 539.5,324.4 549.5,304.7 			"/>
			<path class="st5" d="M564.3,285.1c0,6.7-2.4,12.8-6.4,17.4c-4.5,5.2-11.1,8.5-18.4,8.5c-13.7,0-24.9-11.6-24.9-25.9
				c0-14.3,11.1-25.9,24.9-25.9C553.2,259.2,564.3,270.8,564.3,285.1z"/>
		</g>
		<g>
			<g>
				<rect x="423.2" y="249.5" class="st8" width="66.6" height="43.7"/>
				<polygon class="st9" points="413.3,249.5 423.2,249.5 489.8,249.5 489.8,219.5 424.1,219.5 				"/>
			</g>
			<g>
				<polygon class="st13" points="511,184.9 483.7,155.3 457.9,184.9 457.9,294.2 511,294.2 				"/>
				<polygon class="st11" points="525.9,191.1 484.2,145.7 442.2,191.1 449.3,198.2 484.1,161.6 518.8,198.2 				"/>
				<g>
					<g>
						<rect x="465.5" y="194.2" class="st3" width="15.9" height="19.9"/>
						<rect x="468.1" y="197.5" class="st14" width="10.6" height="13.2"/>
					</g>
					<g>
						<rect x="487.1" y="194.2" class="st3" width="15.9" height="19.9"/>
						<rect x="489.8" y="197.5" class="st14" width="10.6" height="13.2"/>
					</g>
				</g>
				<g>
					<g>
						<rect x="465.5" y="217.4" class="st3" width="15.9" height="19.9"/>
						<rect x="468.1" y="220.7" class="st14" width="10.6" height="13.2"/>
					</g>
					<g>
						<rect x="487.1" y="217.4" class="st3" width="15.9" height="19.9"/>
						<rect x="489.8" y="220.7" class="st14" width="10.6" height="13.2"/>
					</g>
				</g>
				<g>
					<g>
						<rect x="465.5" y="240.6" class="st3" width="15.9" height="19.9"/>
						<rect x="468.1" y="243.9" class="st14" width="10.6" height="13.2"/>
					</g>
					<g>
						<rect x="487.1" y="240.6" class="st3" width="15.9" height="19.9"/>
						<rect x="489.8" y="243.9" class="st14" width="10.6" height="13.2"/>
					</g>
				</g>
			</g>
		</g>
		<g>
			<g>
				<rect x="653.7" y="156.3" class="st9" width="92.9" height="189.5"/>
				<g>
					<rect x="669.4" y="169.9" class="st15" width="60.6" height="9.3"/>
					<rect x="669.4" y="186.6" class="st15" width="60.6" height="9.3"/>
					<rect x="669.4" y="203.3" class="st15" width="60.6" height="9.3"/>
					<rect x="669.4" y="219.9" class="st15" width="60.6" height="9.3"/>
					<rect x="669.4" y="236.6" class="st15" width="60.6" height="9.3"/>
					<rect x="669.4" y="253.2" class="st15" width="60.6" height="9.3"/>
					<rect x="669.4" y="269.9" class="st15" width="60.6" height="9.3"/>
					<rect x="669.4" y="286.6" class="st15" width="60.6" height="9.3"/>
					<rect x="669.4" y="303.2" class="st15" width="60.6" height="9.3"/>
					<rect x="669.4" y="319.9" class="st15" width="60.6" height="9.3"/>
					<rect x="669.4" y="336.5" class="st15" width="60.6" height="9.3"/>
				</g>
			</g>
			<rect x="657.6" y="169.9" class="st15" width="5.6" height="42.6"/>
			<rect x="657.6" y="236.6" class="st15" width="5.6" height="42.6"/>
			<rect x="735.2" y="169.9" class="st15" width="5.6" height="42.6"/>
			<rect x="735.2" y="236.6" class="st15" width="5.6" height="42.6"/>
		</g>
		<g>
			<rect x="202" y="292.8" class="st16" width="119.6" height="53.4"/>
			<path class="st17" d="M274.3,346.4V318c0-4.1-3.2-7.5-7.2-7.5h-14.3c-4,0-7.2,3.3-7.2,7.5v28.4"/>
			<g>
				<polygon class="st18" points="334.4,302.4 192.1,302.4 202.9,272.5 321.8,272.5 				"/>
				<g>
					<rect x="257.6" y="272.5" class="st0" width="8.4" height="30"/>
					<polygon class="st0" points="334.4,302.4 331.7,296 331.7,302.4 					"/>
					<rect x="313.2" y="272.5" class="st0" width="8.4" height="30"/>
					<rect x="276.1" y="272.5" class="st0" width="8.4" height="30"/>
					<polygon class="st0" points="202,302.4 210.3,302.4 210.3,272.5 202.9,272.5 202,275 					"/>
					<rect x="294.6" y="272.5" class="st0" width="8.4" height="30"/>
					<rect x="239" y="272.5" class="st0" width="8.4" height="30"/>
					<rect x="220.5" y="272.5" class="st0" width="8.4" height="30"/>
					<polygon class="st17" points="192.1,302.4 202,302.4 202,275 					"/>
					<rect x="210.3" y="272.5" class="st17" width="10.2" height="30"/>
					<rect x="228.9" y="272.5" class="st17" width="10.2" height="30"/>
					<rect x="247.4" y="272.5" class="st17" width="10.2" height="30"/>
					<rect x="265.9" y="272.5" class="st17" width="10.2" height="30"/>
					<rect x="284.5" y="272.5" class="st17" width="10.2" height="30"/>
					<rect x="303" y="272.5" class="st17" width="10.2" height="30"/>
					<polygon class="st17" points="331.7,302.4 331.7,296 321.8,272.5 321.5,272.5 321.5,302.4 					"/>
				</g>
			</g>
		</g>
		<g>
			<rect x="313.2" y="153" class="st19" width="104.1" height="193.5"/>
			<g>
				<g>
					<rect x="324.9" y="166.2" class="st16" width="22" height="34.1"/>
					<rect x="354.2" y="166.2" class="st16" width="22" height="34.1"/>
					<rect x="383.6" y="166.2" class="st16" width="22" height="34.1"/>
				</g>
				<g>
					<rect x="324.9" y="206.9" class="st16" width="22" height="34.2"/>
					<rect x="354.2" y="206.9" class="st16" width="22" height="34.2"/>
					<rect x="383.6" y="206.9" class="st16" width="22" height="34.2"/>
				</g>
				<g>
					<rect x="324.9" y="247.7" class="st16" width="22" height="34.1"/>
					<rect x="354.2" y="247.7" class="st16" width="22" height="34.1"/>
					<rect x="383.6" y="247.7" class="st16" width="22" height="34.1"/>
				</g>
				<g>
					<rect x="324.9" y="288.5" class="st16" width="22" height="34.1"/>
					<rect x="354.2" y="288.5" class="st16" width="22" height="34.1"/>
					<rect x="383.6" y="288.5" class="st16" width="22" height="34.1"/>
				</g>
			</g>
		</g>
		<g>
			<rect x="315.3" y="304.7" class="st4" width="7.1" height="42.5"/>
			<polygon class="st4" points="297.3,294.7 317.4,332.1 317.4,324.4 307.3,304.7 			"/>
			<path class="st5" d="M292.5,285.1c0,6.7,2.4,12.8,6.4,17.4c4.5,5.2,11.1,8.5,18.4,8.5c13.7,0,24.9-11.6,24.9-25.9
				c0-14.3-11.1-25.9-24.9-25.9C303.6,259.2,292.5,270.8,292.5,285.1z"/>
		</g>
		<g>
			<g>
				<polygon class="st20" points="445.7,292.8 391.3,292.8 391.3,301.9 395.6,301.9 395.6,346.6 440.3,346.6 440.3,301.9 
					445.7,301.9 				"/>
				<rect x="408.5" y="310.8" class="st21" width="17.7" height="36.2"/>
			</g>
			<g>
				<polygon class="st22" points="519.3,257.4 429.3,257.4 429.3,272.5 436.5,272.5 436.5,346.3 510.4,346.3 510.4,272.5 
					519.3,272.5 				"/>
				<rect x="457.9" y="309.2" class="st21" width="29.3" height="37.7"/>
			</g>
			<g>
				<rect x="443" y="276.6" class="st21" width="10.1" height="13.5"/>
				<rect x="459.5" y="276.6" class="st21" width="10.1" height="13.5"/>
				<rect x="476" y="276.6" class="st21" width="10.1" height="13.5"/>
				<rect x="492.5" y="276.6" class="st21" width="10.1" height="13.5"/>
			</g>
		</g>
		<g>
			<g>
				<rect x="91.1" y="292.8" class="st23" width="119.6" height="53.4"/>
				<g>
					<polygon class="st9" points="223.5,302.4 81.2,302.4 92,272.5 210.9,272.5 					"/>
					<g>
						<rect x="146.7" y="272.5" class="st0" width="8.4" height="30"/>
						<polygon class="st0" points="223.5,302.4 220.8,296 220.8,302.4 						"/>
						<rect x="202.3" y="272.5" class="st0" width="8.4" height="30"/>
						<rect x="165.2" y="272.5" class="st0" width="8.4" height="30"/>
						<polygon class="st0" points="91.1,302.4 99.4,302.4 99.4,272.5 92,272.5 91.1,275 						"/>
						<rect x="183.7" y="272.5" class="st0" width="8.4" height="30"/>
						<rect x="128.1" y="272.5" class="st0" width="8.4" height="30"/>
						<rect x="109.6" y="272.5" class="st0" width="8.4" height="30"/>
					</g>
				</g>
			</g>
			<g>
				<polygon class="st24" points="178.9,237.9 151.6,208.2 125.8,237.9 125.8,347.1 178.9,347.1 				"/>
				<polygon class="st9" points="193.8,244 152.1,198.6 110.1,244 117.2,251.2 152,214.6 186.7,251.2 				"/>
				<g>
					<g>
						<rect x="133.4" y="247.2" class="st3" width="15.9" height="19.9"/>
						<rect x="136" y="250.5" class="st14" width="10.6" height="13.2"/>
					</g>
					<g>
						<rect x="155" y="247.2" class="st3" width="15.9" height="19.9"/>
						<rect x="157.7" y="250.5" class="st14" width="10.6" height="13.2"/>
					</g>
				</g>
				<g>
					<g>
						<rect x="133.4" y="270.4" class="st3" width="15.9" height="19.9"/>
						<rect x="136" y="273.7" class="st14" width="10.6" height="13.2"/>
					</g>
					<g>
						<rect x="155" y="270.4" class="st3" width="15.9" height="19.9"/>
						<rect x="157.7" y="273.7" class="st14" width="10.6" height="13.2"/>
					</g>
				</g>
				<g>
					<g>
						<rect x="133.4" y="293.6" class="st3" width="15.9" height="19.9"/>
						<rect x="136" y="296.9" class="st14" width="10.6" height="13.2"/>
					</g>
					<g>
						<rect x="155" y="293.6" class="st3" width="15.9" height="19.9"/>
						<rect x="157.7" y="296.9" class="st14" width="10.6" height="13.2"/>
					</g>
				</g>
			</g>
		</g>
	</g>
	<g>
		<rect x="-1.1" y="346.6" class="st25" width="849.6" height="57.1"/>
		<rect x="-1.1" y="358.4" class="st26" width="849.6" height="45.3"/>
		<g>
			<path class="st9" d="M60.1,378.1c0,1.6-0.8,3-1.8,3H20.8c-1,0-1.8-1.3-1.8-3l0,0c0-1.6,0.8-3,1.8-3h37.5
				C59.3,375.1,60.1,376.5,60.1,378.1L60.1,378.1z"/>
			<path class="st9" d="M144.9,378.1c0,1.6-0.8,3-1.8,3h-37.5c-1,0-1.8-1.3-1.8-3l0,0c0-1.6,0.8-3,1.8-3h37.5
				C144.1,375.1,144.9,376.5,144.9,378.1L144.9,378.1z"/>
			<path class="st9" d="M229.6,378.1c0,1.6-0.8,3-1.8,3h-37.5c-1,0-1.8-1.3-1.8-3l0,0c0-1.6,0.8-3,1.8-3h37.5
				C228.8,375.1,229.6,376.5,229.6,378.1L229.6,378.1z"/>
			<path class="st9" d="M314.4,378.1c0,1.6-0.8,3-1.8,3h-37.5c-1,0-1.8-1.3-1.8-3l0,0c0-1.6,0.8-3,1.8-3h37.5
				C313.6,375.1,314.4,376.5,314.4,378.1L314.4,378.1z"/>
			<path class="st9" d="M399.1,378.1c0,1.6-0.8,3-1.8,3h-37.5c-1,0-1.8-1.3-1.8-3l0,0c0-1.6,0.8-3,1.8-3h37.5
				C398.4,375.1,399.1,376.5,399.1,378.1L399.1,378.1z"/>
			<path class="st9" d="M483.9,378.1c0,1.6-0.8,3-1.8,3h-37.5c-1,0-1.8-1.3-1.8-3l0,0c0-1.6,0.8-3,1.8-3h37.5
				C483.1,375.1,483.9,376.5,483.9,378.1L483.9,378.1z"/>
			<path class="st9" d="M568.7,378.1c0,1.6-0.8,3-1.8,3h-37.5c-1,0-1.8-1.3-1.8-3l0,0c0-1.6,0.8-3,1.8-3h37.5
				C567.9,375.1,568.7,376.5,568.7,378.1L568.7,378.1z"/>
			<path class="st9" d="M653.4,378.1c0,1.6-0.8,3-1.8,3h-37.5c-1,0-1.8-1.3-1.8-3l0,0c0-1.6,0.8-3,1.8-3h37.5
				C652.6,375.1,653.4,376.5,653.4,378.1L653.4,378.1z"/>
			<path class="st9" d="M738.2,378.1c0,1.6-0.8,3-1.8,3h-37.5c-1,0-1.8-1.3-1.8-3l0,0c0-1.6,0.8-3,1.8-3h37.5
				C737.4,375.1,738.2,376.5,738.2,378.1L738.2,378.1z"/>
			<path class="st9" d="M822.9,378.1c0,1.6-0.8,3-1.8,3h-37.5c-1,0-1.8-1.3-1.8-3l0,0c0-1.6,0.8-3,1.8-3h37.5
				C822.2,375.1,822.9,376.5,822.9,378.1L822.9,378.1z"/>
		</g>
	</g>
</g>
</svg>
