<?xml version="1.0" encoding="utf-8"?>
<!-- Generator: Adobe Illustrator 23.0.0, SVG Export Plug-In . SVG Version: 6.00 Build 0)  -->
<svg version="1.1" id="Calque_1" xmlns="http://www.w3.org/2000/svg" xmlns:xlink="http://www.w3.org/1999/xlink" x="0px" y="0px"
	 viewBox="0 0 500 500" style="enable-background:new 0 0 500 500;" xml:space="preserve">
<style type="text/css">
	.st0{fill:#AB0D0D;stroke:#AB0D0D;stroke-miterlimit:10;}
</style>
<g>
	<path class="st0" d="M406,30v442H106V30H406 M407,29H105v444h302V29L407,29z"/>
	<g>
		<path class="st0" d="M65.5,472.5v-443h39v443H65.5z M84.5,436.5c-4.4,0-8,3.6-8,8s3.6,8,8,8s8-3.6,8-8S88.9,436.5,84.5,436.5z
			 M84.5,410.5c-4.4,0-8,3.6-8,8s3.6,8,8,8s8-3.6,8-8S88.9,410.5,84.5,410.5z M84.5,384.5c-4.4,0-8,3.6-8,8s3.6,8,8,8s8-3.6,8-8
			S88.9,384.5,84.5,384.5z M84.5,358.5c-4.4,0-8,3.6-8,8s3.6,8,8,8s8-3.6,8-8S88.9,358.5,84.5,358.5z M84.5,332.5c-4.4,0-8,3.6-8,8
			s3.6,8,8,8s8-3.6,8-8S88.9,332.5,84.5,332.5z M84.5,306.5c-4.4,0-8,3.6-8,8s3.6,8,8,8s8-3.6,8-8S88.9,306.5,84.5,306.5z
			 M84.5,280.5c-4.4,0-8,3.6-8,8s3.6,8,8,8s8-3.6,8-8S88.9,280.5,84.5,280.5z M84.5,254.5c-4.4,0-8,3.6-8,8s3.6,8,8,8s8-3.6,8-8
			S88.9,254.5,84.5,254.5z M84.5,228.5c-4.4,0-8,3.6-8,8s3.6,8,8,8s8-3.6,8-8S88.9,228.5,84.5,228.5z M84.5,202.5c-4.4,0-8,3.6-8,8
			s3.6,8,8,8s8-3.6,8-8S88.9,202.5,84.5,202.5z M84.5,176.5c-4.4,0-8,3.6-8,8s3.6,8,8,8s8-3.6,8-8S88.9,176.5,84.5,176.5z
			 M84.5,150.5c-4.4,0-8,3.6-8,8s3.6,8,8,8s8-3.6,8-8S88.9,150.5,84.5,150.5z M84.5,124.5c-4.4,0-8,3.6-8,8s3.6,8,8,8s8-3.6,8-8
			S88.9,124.5,84.5,124.5z M84.5,98.5c-4.4,0-8,3.6-8,8s3.6,8,8,8s8-3.6,8-8S88.9,98.5,84.5,98.5z M84.5,72.5c-4.4,0-8,3.6-8,8
			s3.6,8,8,8s8-3.6,8-8S88.9,72.5,84.5,72.5z M84.5,46.5c-4.4,0-8,3.6-8,8s3.6,8,8,8s8-3.6,8-8S88.9,46.5,84.5,46.5z"/>
		<path class="st0" d="M104,30v442H66V30H104 M84.5,63c4.7,0,8.5-3.8,8.5-8.5S89.2,46,84.5,46S76,49.8,76,54.5S79.8,63,84.5,63
			 M84.5,89c4.7,0,8.5-3.8,8.5-8.5S89.2,72,84.5,72S76,75.8,76,80.5S79.8,89,84.5,89 M84.5,115c4.7,0,8.5-3.8,8.5-8.5
			S89.2,98,84.5,98s-8.5,3.8-8.5,8.5S79.8,115,84.5,115 M84.5,141c4.7,0,8.5-3.8,8.5-8.5s-3.8-8.5-8.5-8.5s-8.5,3.8-8.5,8.5
			S79.8,141,84.5,141 M84.5,167c4.7,0,8.5-3.8,8.5-8.5s-3.8-8.5-8.5-8.5s-8.5,3.8-8.5,8.5S79.8,167,84.5,167 M84.5,193
			c4.7,0,8.5-3.8,8.5-8.5s-3.8-8.5-8.5-8.5s-8.5,3.8-8.5,8.5S79.8,193,84.5,193 M84.5,219c4.7,0,8.5-3.8,8.5-8.5s-3.8-8.5-8.5-8.5
			s-8.5,3.8-8.5,8.5S79.8,219,84.5,219 M84.5,245c4.7,0,8.5-3.8,8.5-8.5s-3.8-8.5-8.5-8.5s-8.5,3.8-8.5,8.5S79.8,245,84.5,245
			 M84.5,271c4.7,0,8.5-3.8,8.5-8.5s-3.8-8.5-8.5-8.5s-8.5,3.8-8.5,8.5S79.8,271,84.5,271 M84.5,297c4.7,0,8.5-3.8,8.5-8.5
			s-3.8-8.5-8.5-8.5s-8.5,3.8-8.5,8.5S79.8,297,84.5,297 M84.5,323c4.7,0,8.5-3.8,8.5-8.5s-3.8-8.5-8.5-8.5s-8.5,3.8-8.5,8.5
			S79.8,323,84.5,323 M84.5,349c4.7,0,8.5-3.8,8.5-8.5s-3.8-8.5-8.5-8.5s-8.5,3.8-8.5,8.5S79.8,349,84.5,349 M84.5,375
			c4.7,0,8.5-3.8,8.5-8.5s-3.8-8.5-8.5-8.5s-8.5,3.8-8.5,8.5S79.8,375,84.5,375 M84.5,401c4.7,0,8.5-3.8,8.5-8.5s-3.8-8.5-8.5-8.5
			s-8.5,3.8-8.5,8.5S79.8,401,84.5,401 M84.5,427c4.7,0,8.5-3.8,8.5-8.5s-3.8-8.5-8.5-8.5s-8.5,3.8-8.5,8.5S79.8,427,84.5,427
			 M84.5,453c4.7,0,8.5-3.8,8.5-8.5s-3.8-8.5-8.5-8.5s-8.5,3.8-8.5,8.5S79.8,453,84.5,453 M105,29H65v444h40V29L105,29z M84.5,62
			c-4.1,0-7.5-3.4-7.5-7.5s3.4-7.5,7.5-7.5s7.5,3.4,7.5,7.5S88.6,62,84.5,62L84.5,62z M84.5,88c-4.1,0-7.5-3.4-7.5-7.5
			s3.4-7.5,7.5-7.5s7.5,3.4,7.5,7.5S88.6,88,84.5,88L84.5,88z M84.5,114c-4.1,0-7.5-3.4-7.5-7.5s3.4-7.5,7.5-7.5s7.5,3.4,7.5,7.5
			S88.6,114,84.5,114L84.5,114z M84.5,140c-4.1,0-7.5-3.4-7.5-7.5s3.4-7.5,7.5-7.5s7.5,3.4,7.5,7.5S88.6,140,84.5,140L84.5,140z
			 M84.5,166c-4.1,0-7.5-3.4-7.5-7.5s3.4-7.5,7.5-7.5s7.5,3.4,7.5,7.5S88.6,166,84.5,166L84.5,166z M84.5,192
			c-4.1,0-7.5-3.4-7.5-7.5s3.4-7.5,7.5-7.5s7.5,3.4,7.5,7.5S88.6,192,84.5,192L84.5,192z M84.5,218c-4.1,0-7.5-3.4-7.5-7.5
			s3.4-7.5,7.5-7.5s7.5,3.4,7.5,7.5S88.6,218,84.5,218L84.5,218z M84.5,244c-4.1,0-7.5-3.4-7.5-7.5s3.4-7.5,7.5-7.5s7.5,3.4,7.5,7.5
			S88.6,244,84.5,244L84.5,244z M84.5,270c-4.1,0-7.5-3.4-7.5-7.5s3.4-7.5,7.5-7.5s7.5,3.4,7.5,7.5S88.6,270,84.5,270L84.5,270z
			 M84.5,296c-4.1,0-7.5-3.4-7.5-7.5s3.4-7.5,7.5-7.5s7.5,3.4,7.5,7.5S88.6,296,84.5,296L84.5,296z M84.5,322
			c-4.1,0-7.5-3.4-7.5-7.5s3.4-7.5,7.5-7.5s7.5,3.4,7.5,7.5S88.6,322,84.5,322L84.5,322z M84.5,348c-4.1,0-7.5-3.4-7.5-7.5
			s3.4-7.5,7.5-7.5s7.5,3.4,7.5,7.5S88.6,348,84.5,348L84.5,348z M84.5,374c-4.1,0-7.5-3.4-7.5-7.5s3.4-7.5,7.5-7.5s7.5,3.4,7.5,7.5
			S88.6,374,84.5,374L84.5,374z M84.5,400c-4.1,0-7.5-3.4-7.5-7.5s3.4-7.5,7.5-7.5s7.5,3.4,7.5,7.5S88.6,400,84.5,400L84.5,400z
			 M84.5,426c-4.1,0-7.5-3.4-7.5-7.5s3.4-7.5,7.5-7.5s7.5,3.4,7.5,7.5S88.6,426,84.5,426L84.5,426z M84.5,452
			c-4.1,0-7.5-3.4-7.5-7.5s3.4-7.5,7.5-7.5s7.5,3.4,7.5,7.5S88.6,452,84.5,452L84.5,452z"/>
	</g>
	<g>
		<path class="st0" d="M407.5,472.5v-443h39v443H407.5z M426.5,436.5c-4.4,0-8,3.6-8,8s3.6,8,8,8s8-3.6,8-8S430.9,436.5,426.5,436.5
			z M426.5,410.5c-4.4,0-8,3.6-8,8s3.6,8,8,8s8-3.6,8-8S430.9,410.5,426.5,410.5z M426.5,384.5c-4.4,0-8,3.6-8,8s3.6,8,8,8
			s8-3.6,8-8S430.9,384.5,426.5,384.5z M426.5,358.5c-4.4,0-8,3.6-8,8s3.6,8,8,8s8-3.6,8-8S430.9,358.5,426.5,358.5z M426.5,332.5
			c-4.4,0-8,3.6-8,8s3.6,8,8,8s8-3.6,8-8S430.9,332.5,426.5,332.5z M426.5,306.5c-4.4,0-8,3.6-8,8s3.6,8,8,8s8-3.6,8-8
			S430.9,306.5,426.5,306.5z M426.5,280.5c-4.4,0-8,3.6-8,8s3.6,8,8,8s8-3.6,8-8S430.9,280.5,426.5,280.5z M426.5,254.5
			c-4.4,0-8,3.6-8,8s3.6,8,8,8s8-3.6,8-8S430.9,254.5,426.5,254.5z M426.5,228.5c-4.4,0-8,3.6-8,8s3.6,8,8,8s8-3.6,8-8
			S430.9,228.5,426.5,228.5z M426.5,202.5c-4.4,0-8,3.6-8,8s3.6,8,8,8s8-3.6,8-8S430.9,202.5,426.5,202.5z M426.5,176.5
			c-4.4,0-8,3.6-8,8s3.6,8,8,8s8-3.6,8-8S430.9,176.5,426.5,176.5z M426.5,150.5c-4.4,0-8,3.6-8,8s3.6,8,8,8s8-3.6,8-8
			S430.9,150.5,426.5,150.5z M426.5,124.5c-4.4,0-8,3.6-8,8s3.6,8,8,8s8-3.6,8-8S430.9,124.5,426.5,124.5z M426.5,98.5
			c-4.4,0-8,3.6-8,8s3.6,8,8,8s8-3.6,8-8S430.9,98.5,426.5,98.5z M426.5,72.5c-4.4,0-8,3.6-8,8s3.6,8,8,8s8-3.6,8-8
			S430.9,72.5,426.5,72.5z M426.5,46.5c-4.4,0-8,3.6-8,8s3.6,8,8,8s8-3.6,8-8S430.9,46.5,426.5,46.5z"/>
		<path class="st0" d="M446,30v442h-38V30H446 M426.5,63c4.7,0,8.5-3.8,8.5-8.5s-3.8-8.5-8.5-8.5s-8.5,3.8-8.5,8.5
			S421.8,63,426.5,63 M426.5,89c4.7,0,8.5-3.8,8.5-8.5s-3.8-8.5-8.5-8.5s-8.5,3.8-8.5,8.5S421.8,89,426.5,89 M426.5,115
			c4.7,0,8.5-3.8,8.5-8.5s-3.8-8.5-8.5-8.5s-8.5,3.8-8.5,8.5S421.8,115,426.5,115 M426.5,141c4.7,0,8.5-3.8,8.5-8.5
			s-3.8-8.5-8.5-8.5s-8.5,3.8-8.5,8.5S421.8,141,426.5,141 M426.5,167c4.7,0,8.5-3.8,8.5-8.5s-3.8-8.5-8.5-8.5s-8.5,3.8-8.5,8.5
			S421.8,167,426.5,167 M426.5,193c4.7,0,8.5-3.8,8.5-8.5s-3.8-8.5-8.5-8.5s-8.5,3.8-8.5,8.5S421.8,193,426.5,193 M426.5,219
			c4.7,0,8.5-3.8,8.5-8.5s-3.8-8.5-8.5-8.5s-8.5,3.8-8.5,8.5S421.8,219,426.5,219 M426.5,245c4.7,0,8.5-3.8,8.5-8.5
			s-3.8-8.5-8.5-8.5s-8.5,3.8-8.5,8.5S421.8,245,426.5,245 M426.5,271c4.7,0,8.5-3.8,8.5-8.5s-3.8-8.5-8.5-8.5s-8.5,3.8-8.5,8.5
			S421.8,271,426.5,271 M426.5,297c4.7,0,8.5-3.8,8.5-8.5s-3.8-8.5-8.5-8.5s-8.5,3.8-8.5,8.5S421.8,297,426.5,297 M426.5,323
			c4.7,0,8.5-3.8,8.5-8.5s-3.8-8.5-8.5-8.5s-8.5,3.8-8.5,8.5S421.8,323,426.5,323 M426.5,349c4.7,0,8.5-3.8,8.5-8.5
			s-3.8-8.5-8.5-8.5s-8.5,3.8-8.5,8.5S421.8,349,426.5,349 M426.5,375c4.7,0,8.5-3.8,8.5-8.5s-3.8-8.5-8.5-8.5s-8.5,3.8-8.5,8.5
			S421.8,375,426.5,375 M426.5,401c4.7,0,8.5-3.8,8.5-8.5s-3.8-8.5-8.5-8.5s-8.5,3.8-8.5,8.5S421.8,401,426.5,401 M426.5,427
			c4.7,0,8.5-3.8,8.5-8.5s-3.8-8.5-8.5-8.5s-8.5,3.8-8.5,8.5S421.8,427,426.5,427 M426.5,453c4.7,0,8.5-3.8,8.5-8.5
			s-3.8-8.5-8.5-8.5s-8.5,3.8-8.5,8.5S421.8,453,426.5,453 M447,29h-40v444h40V29L447,29z M426.5,62c-4.1,0-7.5-3.4-7.5-7.5
			s3.4-7.5,7.5-7.5s7.5,3.4,7.5,7.5S430.6,62,426.5,62L426.5,62z M426.5,88c-4.1,0-7.5-3.4-7.5-7.5s3.4-7.5,7.5-7.5s7.5,3.4,7.5,7.5
			S430.6,88,426.5,88L426.5,88z M426.5,114c-4.1,0-7.5-3.4-7.5-7.5s3.4-7.5,7.5-7.5s7.5,3.4,7.5,7.5S430.6,114,426.5,114L426.5,114z
			 M426.5,140c-4.1,0-7.5-3.4-7.5-7.5s3.4-7.5,7.5-7.5s7.5,3.4,7.5,7.5S430.6,140,426.5,140L426.5,140z M426.5,166
			c-4.1,0-7.5-3.4-7.5-7.5s3.4-7.5,7.5-7.5s7.5,3.4,7.5,7.5S430.6,166,426.5,166L426.5,166z M426.5,192c-4.1,0-7.5-3.4-7.5-7.5
			s3.4-7.5,7.5-7.5s7.5,3.4,7.5,7.5S430.6,192,426.5,192L426.5,192z M426.5,218c-4.1,0-7.5-3.4-7.5-7.5s3.4-7.5,7.5-7.5
			s7.5,3.4,7.5,7.5S430.6,218,426.5,218L426.5,218z M426.5,244c-4.1,0-7.5-3.4-7.5-7.5s3.4-7.5,7.5-7.5s7.5,3.4,7.5,7.5
			S430.6,244,426.5,244L426.5,244z M426.5,270c-4.1,0-7.5-3.4-7.5-7.5s3.4-7.5,7.5-7.5s7.5,3.4,7.5,7.5S430.6,270,426.5,270
			L426.5,270z M426.5,296c-4.1,0-7.5-3.4-7.5-7.5s3.4-7.5,7.5-7.5s7.5,3.4,7.5,7.5S430.6,296,426.5,296L426.5,296z M426.5,322
			c-4.1,0-7.5-3.4-7.5-7.5s3.4-7.5,7.5-7.5s7.5,3.4,7.5,7.5S430.6,322,426.5,322L426.5,322z M426.5,348c-4.1,0-7.5-3.4-7.5-7.5
			s3.4-7.5,7.5-7.5s7.5,3.4,7.5,7.5S430.6,348,426.5,348L426.5,348z M426.5,374c-4.1,0-7.5-3.4-7.5-7.5s3.4-7.5,7.5-7.5
			s7.5,3.4,7.5,7.5S430.6,374,426.5,374L426.5,374z M426.5,400c-4.1,0-7.5-3.4-7.5-7.5s3.4-7.5,7.5-7.5s7.5,3.4,7.5,7.5
			S430.6,400,426.5,400L426.5,400z M426.5,426c-4.1,0-7.5-3.4-7.5-7.5s3.4-7.5,7.5-7.5s7.5,3.4,7.5,7.5S430.6,426,426.5,426
			L426.5,426z M426.5,452c-4.1,0-7.5-3.4-7.5-7.5s3.4-7.5,7.5-7.5s7.5,3.4,7.5,7.5S430.6,452,426.5,452L426.5,452z"/>
	</g>
</g>
<rect x="128" y="62" class="st0" width="46" height="5"/>
<rect x="128" y="73" class="st0" width="105" height="5"/>
<rect x="128" y="84" class="st0" width="74" height="5"/>
<rect x="128" y="175" class="st0" width="90" height="5"/>
<rect x="128" y="243" class="st0" width="90" height="5"/>
<rect x="128" y="303" class="st0" width="90" height="5"/>
<rect x="128" y="323" class="st0" width="90" height="5"/>
<rect x="128" y="343" class="st0" width="90" height="5"/>
<rect x="128" y="363" class="st0" width="90" height="5"/>
<rect x="128" y="383" class="st0" width="90" height="5"/>
<rect x="278" y="243" class="st0" width="90" height="5"/>
<rect x="278" y="303" class="st0" width="90" height="5"/>
<rect x="278" y="323" class="st0" width="90" height="5"/>
<rect x="278" y="343" class="st0" width="90" height="5"/>
<rect x="278" y="363" class="st0" width="90" height="5"/>
<rect x="278" y="383" class="st0" width="90" height="5"/>
<rect x="128" y="192" class="st0" width="249" height="5"/>
<rect x="128" y="209" class="st0" width="249" height="5"/>
<rect x="128" y="226" class="st0" width="249" height="5"/>
</svg>
