Place,Name,BirthYear,Division,Sex,Equipment,Team,Country,BodyweightKg,WeightClassKg,Squat1Kg,Squat2Kg,Squat3Kg,Best3SquatKg,Bench1Kg,Bench2Kg,Bench3Kg,Best3BenchKg,Deadlift1Kg,Deadlift2Kg,Deadlift3Kg,Best3DeadliftKg,TotalKg,Event,BirthDate
1,Ali Abbas,1996,Open,M,Raw,NZL,New Zealand,58.95,59,185,197.5,-205,197.5,110,115,-120,115,220,230,-237.5,230,542.5,SBD,
2,Kenneth Kaden Chin Yu Wai,1990,Open,M,Raw,MAS,Malaysia,58.9,59,157.5,-167.5,167.5,167.5,92.5,97.5,102.5,102.5,197.5,212.5,220,220,490,SBD,
1,Yuki Kashima,1996,Open,M,Raw,AUS,Australia,66,66,-210,215,-230,215,150,157.5,160.5,160.5,220,235,250,250,625.5,SBD,
2,Judah Pelaco,1997,Open,M,Raw,NZL,New Zealand,65.5,66,175,185,190,190,130,-137.5,137.5,137.5,227.5,237.5,-245,237.5,565,SBD,
3,Conor Gelston,1989,Open,M,Raw,NI,N.Ireland,64.4,66,170,180,187.5,187.5,105,110,112.5,112.5,202.5,212.5,-215,212.5,512.5,SBD,
4,Sidhant Nitin Kudalkar,1998,Open,M,Raw,IND,India,64.4,66,160,-177.5,-177.5,160,85,95,-100,95,170,192.5,-220,192.5,447.5,SBD,
G,Sheng Choong Kwan,1994,Open,M,Raw,NZL-B,New Zealand,65.4,66,180,190,195,195,120,125,-127.5,125,207.5,220,-227.5,220,540,SBD,
1,Leonardo Sucitra,1995,Open,M,Raw,AUS,Australia,73.7,74,250,263,268.5,268.5,150,155,160,160,280,295,308.5,308.5,737,SBD,
2,Kavwa Sichone,1989,Open,M,Raw,NZL,New Zealand,73.7,74,250,-257.5,-260,250,165,172.5,-180,172.5,275,287.5,-302.5,287.5,710,SBD,
3,Leo King,1989,Open,M,Raw,CAN,Canada,73.3,74,220,230,237.5,237.5,122.5,127.5,130,130,240,262.5,-275,262.5,630,SBD,
4,John Bermudez #1,1996,Open,M,Raw,WAL,Wales,73.4,74,180,,,180,150,160,-165,160,220,235,-237.5,235,575,SBD,
5,Kyle Burnett,1993,Open,M,Raw,SCO,Scotland,72.25,74,190,200,-205,200,122.5,127.5,-132.5,127.5,215,227.5,235,235,562.5,SBD,
DQ,Sam Dew,1986,Open,M,Raw,WAL,Wales,73.6,74,245,257.5,263.5,263.5,-160,-160,-160,-160,245,260,-265,260,,SBD,
1,Timothy Monigatti,1996,Open,M,Raw,NZL,New Zealand,82.55,83,275,290,-300,290,177.5,182.5,185,185,307.5,325,-330,325,800,SBD,
2,Ansu Singh,1992,Open,M,Raw,IND,India,83,83,240,255,260,260,125,135,140,140,260,275,287.5,287.5,687.5,SBD,
3,Tyler Edmondson,1998,Open,M,Raw,AUS,Australia,81.4,83,215,230,-237.5,230,140,147.5,152.5,152.5,265,272.5,287.5,287.5,670,SBD,
4,Quentin Chan,1995,Open,M,Raw,CAN,Canada,82.6,83,222.5,232.5,237.5,237.5,145,152.5,157.5,157.5,247.5,260,-270,260,655,SBD,
5,Jason Knowles,1997,Open,M,Raw,RSA,South Africa,81.65,83,235,-242.5,-242.5,235,140,-145,-145,140,205,220,-230,220,595,SBD,
6,Oliver James #1,1997,Open,M,Raw,ENG,England,82.85,83,205,215,220,220,122.5,-130,-130,122.5,230,240,-257.5,240,582.5,SBD,
7,Grant O'Donoghue,1999,Open,M,Raw,RSA,South Africa,81.15,83,207.5,212.5,-220,212.5,117.5,122.5,-127.5,122.5,235,242.5,-250,242.5,577.5,SBD,
8,Michael Elias,1987,Open,M,Raw,WAL,Wales,79.7,83,190,-197.5,197.5,197.5,127.5,132.5,-135,132.5,220,235,242.5,242.5,572.5,SBD,
9,Adam Johnson,1993,Open,M,Raw,NI,N.Ireland,80.7,83,207.5,215,-217.5,215,115,-120,-120,115,215,-220,220,220,550,SBD,
10,Chandan Kumar Singh,1998,Open,M,Raw,IND,India,81.6,83,185,-192.5,192.5,192.5,-115,117.5,122.5,122.5,225,235,-240,235,550,SBD,
11,Peter Vauls,1992,Open,M,Raw,NI,N.Ireland,82.7,83,187.5,-197.5,-197.5,187.5,122.5,130,-140,130,215,222.5,-230,222.5,540,SBD,
G,Jak Tan,1993,Open,M,Raw,NZL-B,New Zealand,81.2,83,220,235,242.5,242.5,127.5,132.5,-135,132.5,250,267.5,280,280,655,SBD,
1,Carlos Petterson-Grifith,1994,Open,M,Raw,GUY,Guyana,92.6,93,-305,305,-315,305,147.5,160,-165,160,325,-335,-335,325,790,SBD,
2,Jamie King #1,1993,Open,M,Raw,NZL,New Zealand,92.6,93,272.5,292.5,-302.5,292.5,167.5,175,177.5,177.5,295,315,-322.5,315,785,SBD,
3,Sibusiso Sishi,1985,Open,M,Raw,RSA,South Africa,91.15,93,220,235,250,250,150,160,165,165,260,277.5,292.5,292.5,707.5,SBD,
4,Carlo Hung,1999,Open,M,Raw,CAN,Canada,91.7,93,217.5,227.5,235,235,175,180,-182.5,180,272.5,282.5,290,290,705,SBD,
5,William Smith #2,1998,Open,M,Raw,SCO,Scotland,91.1,93,245,255,265,265,150,157.5,160,160,260,270,275,275,700,SBD,
6,Billy Watson #3,1995,Open,M,Raw,ENG,England,92.25,93,265,277.5,285,285,160,167.5,-170,167.5,240,-265,-265,240,692.5,SBD,
7,Robert Perry,1987,Open,M,Raw,CAN,Canada,91.35,93,207.5,212.5,215,215,155,160,162.5,162.5,255,270,285,285,662.5,SBD,
8,Danny Evans,1991,Open,M,Raw,ENG,England,92.45,93,235,250,255,255,127.5,135,-140,135,242.5,255,270,270,660,SBD,
9,Karl Strangward-Morgan,1992,Open,M,Raw,WAL,Wales,87.2,93,230,240,-242.5,240,145,-155,155,155,250,-265,-265,250,645,SBD,
10,Ethan Jones,2000,Open,M,Raw,WAL,Wales,85,93,185,200,210,210,130,140,-145,140,245,267.5,275,275,625,SBD,
11,Toby Clarke,1994,Open,M,Raw,NI,N.Ireland,92.05,93,190,202.5,210,210,120,125,-127.5,125,220,232.5,-240,232.5,567.5,SBD,
12,Jordan Gregory #1,1996,Open,M,Raw,NI,N.Ireland,91.4,93,175,185,190,190,100,107.5,112.5,112.5,225,235,-250,235,537.5,SBD,
G,Lee McLeod,1996,Open,M,Raw,NZL-B,New Zealand,86.8,93,230,247.5,255,255,150,160,165,165,275,290,300,300,720,SBD,
1,Tom Chaplin,1993,Open,M,Raw,AUS,Australia,104.7,105,267.5,282.5,290,290,182.5,190,192.5,192.5,280,-300,300,300,782.5,SBD,
2,Maui Koopu,1997,Open,M,Raw,NZL,New Zealand,104.65,105,280,295,-300,295,180,185,190,190,277.5,295,-300,295,780,SBD,
3,Declan Giltjes,2000,Open,M,Raw,AUS,Australia,104.45,105,260,272.5,280,280,152.5,157.5,162.5,162.5,287.5,302.5,-307.5,302.5,745,SBD,
4,Louis Keightley-Smith,1994,Open,M,Raw,ENG,England,104.85,105,245,255,262.5,262.5,175,-182.5,182.5,182.5,265,280,290,290,735,SBD,
5,Joe Feeney,1998,Open,M,Raw,ENG,England,104.4,105,255,267.5,275,275,165,175,177.5,177.5,265,272.5,-280,272.5,725,SBD,
6,Bjorn Williams,1985,Open,M,Raw,GUY,Guyana,100.35,105,220,-227.5,-227.5,220,147.5,157.5,165,165,280,300,305,305,690,SBD,
7,Cye Maddocks,1995,Open,M,Raw,IMN,Isle of Man,97.5,105,-175,175,185,185,95,102.5,-110,102.5,185,195,207.5,207.5,495,SBD,
G,Eddie Dawkins,1989,Open,M,Raw,NZL-B,New Zealand,103.4,105,260,272.5,282.5,282.5,165,-170,-170,165,300,315,-327.5,315,762.5,SBD,
G,Marius Tonu'u,1996,Open,M,Raw,NZL-B,New Zealand,104.65,105,245,260,-265,260,175,180,-182.5,180,267.5,285,295,295,735,SBD,
1,Aaron Hills,1989,Open,M,Raw,NZL,New Zealand,117.15,120,260,275,280,280,182.5,190,195,195,302.5,317.5,325,325,800,SBD,
2,Francis Sanders,1991,Open,M,Raw,WAL,Wales,117.75,120,275,290,295,295,170,177.5,-180,177.5,300,320,-330,320,792.5,SBD,
3,Curtis McLaren,1993,Open,M,Raw,ENG,England,116.5,120,280,-290,292.5,292.5,155,162.5,167.5,167.5,315,-332.5,-340,315,775,SBD,
4,Chris Aslan,1992,Open,M,Raw,AUS,Australia,115.95,120,275,290,295,295,165,172.5,177.5,177.5,275,290,-302.5,290,762.5,SBD,
5,Wesley McGuinness,1989,Open,M,Raw,ENG,England,105.05,120,230,245,255,255,175,185,-190,185,235,-255,-255,235,675,SBD,
6,Dan Yuill,1989,Open,M,Raw,WAL,Wales,114.7,120,210,225,-232.5,225,160,-170,170,170,240,250,-255,250,645,SBD,
G,Carl Malosi-Solomona,1996,Open,M,Raw,NZL-B,New Zealand,119.9,120,240,-252.5,-255,240,142.5,-145,-145,142.5,300,320,330,330,712.5,SBD,
1,Terry Malofou,1998,Open,M,Raw,NZL,New Zealand,147.5,120+,315,332.5,-340,332.5,230,242.5,-245,242.5,350,371,-380.5,371,946,SBD,
2,Kierran Leith,1995,Open,M,Raw,SCO,Scotland,152,120+,330,-350,350,350,160,175,185,185,300,330,-350,330,865,SBD,
3,Brian Kravtsov,1996,Open,M,Raw,CAN,Canada,132.35,120+,295,305,-310,305,162.5,170,-172.5,170,242.5,270,-295,270,745,SBD,
4,Josh Jones #3,1994,Open,M,Raw,WAL,Wales,152.45,120+,245,-255,-265,245,152.5,160,-162.5,160,240,-252.5,-252.5,240,645,SBD,
G,Stanley Cocker,1992,Open,M,Raw,NZL-B,New Zealand,136.55,120+,315,-332.5,-350,315,200,212.5,220,220,350,-367.5,-371.5,350,885,SBD,
1,Luke Talley #1,2006,Sub-Juniors,M,Raw,AUS,Australia,50.9,53,160,165,170,170,90,96.5,-100,96.5,110,117.5,125,125,391.5,SBD,
1,Benjamin Crowley,2004,Sub-Juniors,M,Raw,AUS,Australia,61.9,66,140,150,160,160,125,-132.5,-138.5,125,180,190,200,200,485,SBD,
2,Hamo Lee,2004,Sub-Juniors,M,Raw,NZL,New Zealand,63.95,66,162.5,170,175,175,87.5,90,-95,90,177.5,185,190,190,455,SBD,
1,Nicolas Muir,2004,Sub-Juniors,M,Raw,AUS,Australia,73.45,74,170,185,190,190,117.5,122.5,125,125,207.5,-220,225,225,540,SBD,
2,Nyima Tsering,2004,Sub-Juniors,M,Raw,NZL,New Zealand,72.75,74,180,192.5,202.5,202.5,100,-107.5,-107.5,100,190,-207.5,210,210,512.5,SBD,
3,Ollie Bubb,2005,Sub-Juniors,M,Raw,NZL,New Zealand,70.95,74,147.5,155,162.5,162.5,92.5,97.5,100,100,200,215,220,220,482.5,SBD,
4,Isaac Grimsey,2004,Sub-Juniors,M,Raw,AUS,Australia,73.1,74,140,-147.5,147.5,147.5,85,87.5,-90,87.5,190,202.5,207.5,207.5,442.5,SBD,
5,Sean Miller #4,2004,Sub-Juniors,M,Raw,IMN,Isle of Man,68.1,74,120,130,-140,130,80,85,-90,85,180,-190,200,200,415,SBD,
1,Thomas Scanlon,2005,Sub-Juniors,M,Raw,NZL,New Zealand,77.65,83,217.5,227.5,-237.5,227.5,-142.5,142.5,145,145,272.5,285,290,290,662.5,SBD,
2,Zachariah Cummings,2004,Sub-Juniors,M,Raw,NZL,New Zealand,82.3,83,240,252.5,-257.5,252.5,137.5,-142.5,-142.5,137.5,255,267.5,-270,267.5,657.5,SBD,
3,Joel Lucas,2005,Sub-Juniors,M,Raw,AUS,Australia,80.55,83,180,195,-205,195,100,105,110,110,190,200,205,205,510,SBD,
G,Alex Timmins,2005,Sub-Juniors,M,Raw,NZL-B,New Zealand,81.35,83,-177.5,185,190,190,115,120,-122.5,120,187.5,195,-200,195,505,SBD,
1,Tyrone Fouche,2004,Sub-Juniors,M,Raw,NZL,New Zealand,91.25,93,180,190,-200,190,105,110,115,115,242.5,257.5,262.5,262.5,567.5,SBD,
2,James Mann,2004,Sub-Juniors,M,Raw,WAL,Wales,91.8,93,197.5,-210,-212.5,197.5,137.5,145,150,150,200,215,220,220,567.5,SBD,
3,Rexon Noronha,2005,Sub-Juniors,M,Raw,IND,India,91.9,93,180,200,215,215,100,-110,110,110,200,222.5,-240,222.5,547.5,SBD,
1,Ahmed Shehata,2004,Sub-Juniors,M,Raw,NZL,New Zealand,103.1,105,245,260,270,270,183,193,-200,193,280,295,300,300,763,SBD,
2,Nathaniel Lyons,2004,Sub-Juniors,M,Raw,AUS,Australia,104.8,105,220,242.5,-250,242.5,165,-172.5,172.5,172.5,230,250,-270,250,665,SBD,
1,Hōne Williams,2006,Sub-Juniors,M,Raw,NZL,New Zealand,138,120+,250,260,270,270,145,152.5,157.5,157.5,245,260,273,273,700.5,SBD,
1,Deion Harichandran,1999,Juniors,M,Raw,AUS,Australia,58.55,59,165,175,182.5,182.5,110,115,-120,115,205,227.5,-240,227.5,525,SBD,
2,Eiman De Ocampo,2000,Juniors,M,Raw,NZL,New Zealand,59,59,150,160,165,165,87.5,92.5,97.5,97.5,200,207.5,-212.5,207.5,470,SBD,
3,Mateen Amirrudin,2000,Juniors,M,Raw,BRU,Brunei,58.35,59,127.5,140,145,145,65,70,-75,70,172.5,185,190,190,405,SBD,
4,Matthew Scanlan,2003,Juniors,M,Raw,NI,N.Ireland,53.65,59,-117.5,117.5,-122.5,117.5,85,-90,-90,85,180,185,-187.5,185,387.5,SBD,
1,Toai-Cong Trinh,1999,Juniors,M,Raw,AUS,Australia,66,66,195,202.5,205,205,137.5,143,145.5,145.5,220,235,242.5,242.5,593,SBD,
2,Jackson Sue,2000,Juniors,M,Raw,NZL,New Zealand,65.95,66,192.5,-202.5,-202.5,192.5,122.5,130,-135,130,230,245,250,250,572.5,SBD,
3,Kieren Carter,1999,Juniors,M,Raw,WAL,Wales,64.5,66,160,172.5,-180,172.5,-110,115,120,120,195,210,-217.5,210,502.5,SBD,
4,Lachlan Rickards,2000,Juniors,M,Raw,NZL,New Zealand,65.3,66,165,172.5,-177.5,172.5,95,-100,100,100,207.5,-217.5,-217.5,207.5,480,SBD,
1,Ben Calder-Lee,2001,Juniors,M,Raw,NZL,New Zealand,73.5,74,220,232.5,240,240,137.5,145,147.5,147.5,245,257.5,267.5,267.5,655,SBD,
2,Lenex Lu,2000,Juniors,M,Raw,AUS,Australia,73.4,74,140,232.5,-235,232.5,127.5,135,142.5,142.5,245,262.5,-280,262.5,637.5,SBD,
3,Keyan Babaei-Somaghi,2000,Juniors,M,Raw,AUS,Australia,73.75,74,212.5,225,235,235,137.5,-145,-145,137.5,240,257.5,-272.5,257.5,630,SBD,
G,Josh Stoddard,2000,Juniors,M,Raw,NZL-B,New Zealand,72.6,74,207.5,222.5,-227.5,222.5,112.5,120,-122.5,120,205,220,-227.5,220,562.5,SBD,
1,Max Mansell-Rowe,2000,Juniors,M,Raw,ENG,England,82.2,83,235,242.5,250,250,150,-155,-155,150,295,-305,307.5,307.5,707.5,SBD,
2,Matthew Leung Cheuk-Kwan,1999,Juniors,M,Raw,AUS,Australia,82.75,83,245,260,267.5,267.5,152.5,160,165,165,242.5,260,275,275,707.5,SBD,
3,Matt Trainor,2000,Juniors,M,Raw,NZL,New Zealand,82.45,83,255,-265,-265,255,157.5,165,170,170,265,277.5,-290,277.5,702.5,SBD,
4,Ranier Cortez,2001,Juniors,M,Raw,AUS,Australia,82.6,83,215,230,-242.5,230,147.5,162.5,170,170,255,275,-297.5,275,675,SBD,
5,Kinan Cheung,2001,Juniors,M,Raw,NZL,New Zealand,81.9,83,205,220,225,225,150,157.5,160,160,220,235,242.5,242.5,627.5,SBD,
7,Ciar White,2001,Juniors,M,Raw,SCO,Scotland,81.95,83,207.5,217.5,-222.5,217.5,120,125,-127.5,125,250,262.5,-275,262.5,605,SBD,
8,Django Kinley,2002,Juniors,M,Raw,IMN,Isle of Man,80.25,83,175,185,192.5,192.5,120,127.5,130,130,210,225,-230,225,547.5,SBD,
9,Luke Easton,1999,Juniors,M,Raw,ENG,England,80.55,83,180,187.5,190,190,117.5,122.5,-125,122.5,220,-230,230,230,542.5,SBD,
10,Louie Warren #1,2000,Juniors,M,Raw,WAL,Wales,82.45,83,165,172.5,177.5,177.5,110,115,-120,115,220,235,-250,235,527.5,SBD,
11,Daniel Allen,1999,Juniors,M,Raw,NI,N.Ireland,80.45,83,177.5,190,200,200,100,107.5,112.5,112.5,197.5,212.5,-225,212.5,525,SBD,
G,Paora Winika,2000,Juniors,M,Raw,NZL-B,New Zealand,82.6,83,215,220,-227.5,220,145,150,152.5,152.5,232.5,245,255,255,627.5,SBD,
1,Matt Silvey,2000,Juniors,M,Raw,NZL,New Zealand,92,93,252.5,265,275,275,157.5,162.5,167.5,167.5,310,322.5,330.5,330.5,773,SBD,
2,Janson Trinh,2000,Juniors,M,Raw,AUS,Australia,91.7,93,-255,265,275,275,182.5,188.5,-193.5,188.5,280,300,-315,300,763.5,SBD,
3,MacDonald Munyaka,1999,Juniors,M,Raw,NZL,New Zealand,91.4,93,235,245,252.5,252.5,185,-192.5,192.5,192.5,290,300,310,310,755,SBD,
4,Kevin Belonio,1999,Juniors,M,Raw,CAN,Canada,91.75,93,265,275,280,280,145,152.5,157.5,157.5,267.5,280,292.5,292.5,730,SBD,
5,Curtis Nelson,1999,Juniors,M,Raw,CAN,Canada,89.8,93,262.5,-272.5,272.5,272.5,-165,165,167.5,167.5,255,265,-270,265,705,SBD,
7,Nicholas Morrison,2000,Juniors,M,Raw,AUS,Australia,90.45,93,232.5,247.5,-255,247.5,132.5,137.5,-142.5,137.5,260,277.5,-290,277.5,662.5,SBD,
8,Lewis Runge,2003,Juniors,M,Raw,IMN,Isle of Man,88.6,93,207.5,212.5,215,215,117.5,125,130,130,215,225,235,235,580,SBD,
9,Joshua Morgan,2003,Juniors,M,Raw,WAL,Wales,90.75,93,180,190,195,195,115,117.5,-120,117.5,210,225,232.5,232.5,545,SBD,
10,Ethan Payne #1,2003,Juniors,M,Raw,WAL,Wales,90.8,93,130,140,145,145,92.5,-97.5,-97.5,92.5,150,165,170,170,407.5,SBD,
G,Raynan Mishra,2000,Juniors,M,Raw,NZL-B,New Zealand,91.5,93,240,255,265,265,147.5,-157.5,160,160,292.5,305,317.5,317.5,742.5,SBD,
G,Thomas Delamore,1999,Juniors,M,Raw,NZL-B,New Zealand,92.45,93,245,255,265,265,140,-145,145,145,265,277.5,290,290,700,SBD,
1,Lucas Wiseman,1999,Juniors,M,Raw,CAN,Canada,103.65,105,-280,280,-292.5,280,155,162.5,165,165,290,305,320,320,765,SBD,
2,Jacob Pickel,1999,Juniors,M,Raw,CAN,Canada,94.95,105,262.5,275,282.5,282.5,172.5,180,-182.5,180,280,290,300,300,762.5,SBD,
3,Heath Graham,2002,Juniors,M,Raw,NZL,New Zealand,104.05,105,265,280,290,290,172.5,180,185,185,287.5,-302.5,-302.5,287.5,762.5,SBD,
4,Alexander Fomin,1999,Juniors,M,Raw,AUS,Australia,102.2,105,230,247.5,257.5,257.5,172.5,182.5,-185,182.5,282.5,302.5,-317.5,302.5,742.5,SBD,
6,Quintin Dickerson-Gillett,2001,Juniors,M,Raw,NZL,New Zealand,104.3,105,247.5,-260,260,260,162.5,167.5,-170,167.5,-290,290,-305,290,717.5,SBD,
7,Jack Gilchrist,1999,Juniors,M,Raw,NI,N.Ireland,100,105,242.5,265,-272.5,265,150,157.5,-165,157.5,275,292.5,-297.5,292.5,715,SBD,
8,Prameesh Singh,2000,Juniors,M,Raw,IND,India,103.75,105,230,240,-250,240,160,167.5,-180,167.5,245,260,265,265,672.5,SBD,
9,Tarrin Wilson,2001,Juniors,M,Raw,ENG,England,102.35,105,215,225,230,230,145,150,155,155,245,262.5,270,270,655,SBD,
10,Ieuan Barry,2000,Juniors,M,Raw,WAL,Wales,102.4,105,200,215,-220,215,142.5,152.5,155,155,220,240,255,255,625,SBD,
11,Luke Hicks,2000,Juniors,M,Raw,WAL,Wales,97.5,105,180,192.5,200,200,120,125,130,130,220,240,255,255,585,SBD,
12,Samuel Cane,2002,Juniors,M,Raw,ENG,England,103.1,105,-225,225,-240,225,110,-120,120,120,-225,232.5,-250,232.5,577.5,SBD,
G,Raffy Dio,2001,Juniors,M,Raw,NZL-B,New Zealand,101.85,105,255,267.5,275,275,157.5,-165,-165,157.5,260,280,290,290,722.5,SBD,
1,Dylan Morgan #1,2002,Juniors,M,Raw,WAL,Wales,114.55,120,250,267.5,-272.5,267.5,135,142.5,-145,142.5,250,265,-275,265,675,SBD,
2,Mustafa Faran Baig,2000,Juniors,M,Raw,PAK,Pakistan,106.5,120,215,235,250,250,125,135,-142.5,135,240,255,-270,255,640,SBD,
1,Tyler Jahnke,2000,Juniors,M,Raw,NZL,New Zealand,156.65,120+,300,-315,320,320,145,-155,155,155,320,335,-345,335,810,SBD,
1,Mahesh Patil,1976,Masters 1,M,Raw,IND,India,58.4,59,100,120,130,130,55,65,70,70,120,140,150,150,350,SBD,
1,Andrei Richardson,1978,Masters 1,M,Raw,NZL,New Zealand,65.55,66,155,165,170,170,105,110,-112.5,110,190,200,205,205,485,SBD,
1,David Cooper #1,1977,Masters 1,M,Raw,NZL,New Zealand,82.2,83,197.5,210,215,215,120,125,127.5,127.5,235,247.5,257.5,257.5,600,SBD,
2,Sekar Dandapani,1973,Masters 1,M,Raw,IND,India,81.6,83,200,210,220,220,110,120,-122.5,120,210,230,-257.5,230,570,SBD,
1,Elvis Browne,1975,Masters 1,M,Raw,ENG,England,90,93,190,215,225,225,127.5,135,140,140,270,280,290,290,655,SBD,
2,Ross Carlyle,1978,Masters 1,M,Raw,ENG,England,92.2,93,190,202.5,210,210,147.5,157.5,160,160,245,260,-277.5,260,630,SBD,
3,Alex Flint,1978,Masters 1,M,Raw,NZL,New Zealand,92.7,93,202.5,212.5,222.5,222.5,137.5,145,-147.5,145,235,250,-252.5,250,617.5,SBD,
4,Reon Juskowiak,1981,Masters 1,M,Raw,SCO,Scotland,91.3,93,220,227.5,232.5,232.5,120,127.5,-130,127.5,250,-260,-260,250,610,SBD,
5,Richard Best,1975,Masters 1,M,Raw,NZL,New Zealand,88.6,93,182.5,192.5,-200,192.5,137.5,142.5,-145,142.5,205,217.5,-225,217.5,552.5,SBD,
1,Edwin Ng,1979,Masters 1,M,Raw,NZL,New Zealand,103.4,105,240,255,265,265,135,142.5,145,145,255,272.5,280,280,690,SBD,
2,Pete Bevington,1979,Masters 1,M,Raw,NZL,New Zealand,104.4,105,245,260,270,270,145,155,-160,155,242.5,257.5,-262.5,257.5,682.5,SBD,
3,Rana Rattan Singh,1979,Masters 1,M,Raw,IND,India,100.55,105,230,-240,,230,100,110,120,120,260,270,-280,270,620,SBD,
4,David Noma,1982,Masters 1,M,Raw,CAN,Canada,98.25,105,210,220,225,225,147.5,152.5,-155,152.5,215,222.5,-242.5,222.5,600,SBD,
1,David Jones #1,1981,Masters 1,M,Raw,NZL,New Zealand,115.4,120,212.5,230,240,240,125,135,-137.5,135,250,-270,-270,250,625,SBD,
1,Simon Breetzke,1978,Masters 1,M,Raw,RSA,South Africa,139,120+,260,280,287.5,287.5,177.5,185,,185,250,270,-280,270,742.5,SBD,
2,Jason Anderson,1979,Masters 1,M,Raw,NZL,New Zealand,145.7,120+,242.5,252.5,260,260,137.5,145,-150,145,275,300,-307.5,300,705,SBD,
3,Craig Smith #1,1978,Masters 1,M,Raw,NZL,New Zealand,132.4,120+,195,210,220,220,150,160,-165,160,250,270,280,280,660,SBD,
1,David Hrynkow,1964,Masters 2,M,Raw,CAN,Canada,65.35,66,112.5,120,122.5,122.5,85,-90,90,90,175,185,-195,185,397.5,SBD,
2,Andy Liddle,1970,Masters 2,M,Raw,ENG,England,64.6,66,125,135,140,140,85,90,-92.5,90,150,160,-167.5,160,390,SBD,
1,Tecwyn Williamson,1966,Masters 2,M,Raw,NZL,New Zealand,73.85,74,192.5,207.5,213,213,110,120,122.5,122.5,205,220,-232.5,220,555.5,SBD,
2,Joe McCullough,1966,Masters 2,M,Raw,CAN,Canada,72.9,74,175,-182.5,182.5,182.5,110,-115,-115,110,205,210,215,215,507.5,SBD,
3,Jagannath Poorathankandy,1968,Masters 2,M,Raw,IND,India,70.7,74,150,165,-170,165,95,102.5,105,105,180,-200,200,200,470,SBD,
1,Rob Dyke,1972,Masters 2,M,Raw,CAN,Canada,81.1,83,175,182.5,187.5,187.5,145,150.5,153,153,205,212.5,217.5,217.5,558,SBD,
2,Robb Graham,1968,Masters 2,M,Raw,NZL,New Zealand,80.65,83,165,175,182.5,182.5,95,100,105,105,215,232.5,245,245,532.5,SBD,
3,Jim Rossborough,1972,Masters 2,M,Raw,NI,N.Ireland,81.1,83,170,182.5,187.5,187.5,130,-135,135,135,190,210,-220,210,532.5,SBD,
4,Anand Mandia,1971,Masters 2,M,Raw,IND,India,82.8,83,-165,165,175,175,120,-125,125,125,200,-210,,200,500,SBD,
1,Craig McMillan,1969,Masters 2,M,Raw,NZL,New Zealand,92.45,93,210,222.5,230,230,132.5,140,-142.5,140,247.5,260,262.5,262.5,632.5,SBD,
2,Simon Kelsall,1970,Masters 2,M,Raw,NZL,New Zealand,92.9,93,205,220,230,230,145,152.5,-157.5,152.5,225,240,250,250,632.5,SBD,
3,Mark Fennessy,1967,Masters 2,M,Raw,ENG,England,89.9,93,170,180,187.5,187.5,105,110,-115,110,215,230,237.5,237.5,535,SBD,
4,Chris Jones #3,1966,Masters 2,M,Raw,ENG,England,89.2,93,175,185,192.5,192.5,110,117.5,120,120,200,-217.5,220,220,532.5,SBD,
5,Alan Ridgard,1966,Masters 2,M,Raw,RSA,South Africa,89.9,93,175,187.5,-195,187.5,105,112.5,-117.5,112.5,185,202.5,215,215,515,SBD,
1,Les Laban,1969,Masters 2,M,Raw,NZL,New Zealand,105,105,220,230,-237.5,230,137.5,145,-150,145,250,270,275,275,650,SBD,
2,Leon Brown,1966,Masters 2,M,Raw,CAN,Canada,103,105,225,-240,-240,225,180,190,197.5,197.5,140,182.5,225,225,647.5,SBD,
3,Fergus Stewart,1964,Masters 2,M,Raw,AUS,Australia,98.05,105,155,165,170,170,85,90,-95,90,180,190,200,200,460,SBD,
1,Justin Crowley,1965,Masters 2,M,Raw,AUS,Australia,105.1,120,230,240,250,250,140,152.5,162.5,162.5,230,245,-250,245,657.5,SBD,
2,Denis Bensch,1965,Masters 2,M,Raw,RSA,South Africa,118.25,120,200,225,232.5,232.5,125,135,140,140,210,220,232.5,232.5,605,SBD,
3,Nick Doelman,1972,Masters 2,M,Raw,CAN,Canada,118.7,120,-195,195,-207.5,195,130,135,140,140,220,232.5,235,235,570,SBD,
4,David Samworth,1969,Masters 2,M,Raw,ENG,England,116.65,120,165,175,180,180,95,102.5,107.5,107.5,200,215,220,220,507.5,SBD,
1,Carl Muller,1967,Masters 2,M,Raw,NZL,New Zealand,149.15,120+,235,252.5,265,265,152.5,162.5,170,170,212.5,225,-232.5,225,660,SBD,
2,David Lock,1972,Masters 2,M,Raw,ENG,England,127.75,120+,210,222.5,230,230,140,150,-162.5,150,215,230,240,240,620,SBD,
3,Paul Gattsche,1968,Masters 2,M,Raw,NZL,New Zealand,130.45,120+,150,170,185,185,190,205,-216,205,170,190,-202.5,190,580,SBD,
1,John Crawford-Smith,1962,Masters 3,M,Raw,NZL,New Zealand,73,74,132.5,142.5,145,145,80,82.5,85,85,162.5,170,180,180,410,SBD,
2,Philip Crosbie,1957,Masters 3,M,Raw,NZL,New Zealand,73.2,74,132.5,142.5,-150,142.5,70,75,-77.5,75,160,170,-180,170,387.5,SBD,
1,Simon Butterworth,1958,Masters 3,M,Raw,AUS,Australia,101.75,105,120,132.5,147.5,147.5,92.5,-100,100,100,180,195,207.5,207.5,455,SBD,
1,Abbas Pordel,1961,Masters 3,M,Raw,AUS,Australia,115.9,120,155,165,175,175,160,170,-181,170,175,185,,185,530,SBD,
1,Rick Lewis #1,1960,Masters 3,M,Raw,AUS,Australia,131.05,120+,210,230,-250,230,120,130,135,135,270,-287.5,,270,635,SBD,
2,Geoffrey Holmes,1961,Masters 3,M,Raw,NZL,New Zealand,138.75,120+,205,215,225,225,105,110,112.5,112.5,205,220,235,235,572.5,SBD,
1,Barry Patchett,1945,Masters 4,M,Raw,NZL,New Zealand,70.7,74,100,105,107.5,107.5,-75,75,80,80,-125,125,130,130,317.5,SBD,
1,Harish Kumar Kudroli,1952,Masters 4,M,Raw,IND,India,80.4,83,-100,-100,100,100,70,,,70,110,,,110,280,SBD,
1,Bryan Barrett #1,1952,Masters 4,M,Raw,NZL,New Zealand,91,93,167.5,175,180,180,95,100,102.5,102.5,207.5,215,220,220,502.5,SBD,
1,Ryan Stewart #1,1985,Special Olympics,M,Raw,NZL,New Zealand,58.75,59,95,102.5,107.5,107.5,75,77.5,-80,77.5,140,145,-150,145,330,SBD,
2,Daniel McGauley,1990,Special Olympics,M,Raw,ENG,England,55.75,59,100,-110,110,110,70,75,77.5,77.5,80,100,-110,100,287.5,SBD,
1,Jack Carroll,1991,Special Olympics,M,Raw,AUS,Australia,67.85,74,105,112.5,-117.5,112.5,75,80,-82.5,80,130,140,160,160,352.5,SBD,
1,James Wilson #1,1992,Special Olympics,M,Raw,NZL,New Zealand,80.95,83,170,180,185,185,100,105,110,110,192.5,-202.5,205,205,500,SBD,
1,Bradley Caffell,1997,Special Olympics,M,Raw,NZL,New Zealand,88.85,93,165,-175,180,180,112.5,117.5,-122.5,117.5,180,190,200,200,497.5,SBD,
2,Ryan Doherty,1995,Special Olympics,M,Raw,NZL,New Zealand,89.2,93,125,130,-135,130,92.5,97.5,-102.5,97.5,142.5,147.5,-152.5,147.5,375,SBD,
3,Patrick Holmes,1995,Special Olympics,M,Raw,NZL,New Zealand,89,93,115,125,132.5,132.5,65,70,72.5,72.5,120,130,-135,130,335,SBD,
1,Martin Smith #3,1981,Special Olympics,M,Raw,AUS,Australia,55.15,59,75,-80,-80,75,57.5,-60,-60,57.5,90,95,102.5,102.5,235,SBD,
1,S.krupa Rao,1998,Open,M,Single-ply,IND,India,65.6,66,232.5,240,247.5,247.5,112.5,117.5,120,120,242.5,-262.5,275.5,275.5,643,SBD,
1,Luke Homer,1996,Open,M,Single-ply,CAN,Canada,73.8,74,310,317.5,323,323,-180,180,-182.5,180,275,290,303,303,806,SBD,
2,Shailandra Sevetiya,1995,Open,M,Single-ply,IND,India,72.4,74,275,-290,-290,275,160,-180,-180,160,240,275,-290,275,710,SBD,
1,Ansu Singh,1992,Open,M,Single-ply,IND,India,82,83,300,322.5,-337.5,322.5,155,165,170,170,270,295,305,305,797.5,SBD,
2,Ian Chock,1993,Open,M,Single-ply,NZL,New Zealand,78.7,83,265,275,-282.5,275,180,-192.5,192.5,192.5,265,280,-295,280,747.5,SBD,
1,Carlos Petterson-Grifith,1994,Open,M,Single-ply,GUY,Guyana,92.2,93,310,-335,340,340,160,-170,,160,330,350,-372,350,850,SBD,
2,Thomas Morgan #1,1996,Open,M,Single-ply,WAL,Wales,91.6,93,265,280,287.5,287.5,215,-225,-245,215,225,245,257.5,257.5,760,SBD,
3,Evan McCloy,1987,Open,M,Single-ply,AUS,Australia,92.7,93,270,-285,-300,270,220,-280,-280,220,240,260,-272.5,260,750,SBD,
1,Christian Torley,1991,Open,M,Single-ply,AUS,Australia,102.8,105,325,340,-345,340,190,200,-210,200,240,255,260,260,800,SBD,
2,Lachlan Green,1990,Open,M,Single-ply,AUS,Australia,104.1,105,305,315,-325,315,225,-245,-245,225,225,242.5,-257.5,242.5,782.5,SBD,
3,Joseph Shaw,1998,Open,M,Single-ply,ENG,England,104.7,105,-260,270,-280,270,190,200,-212.5,200,210,230,250,250,720,SBD,
1,Rajarathinam A,1997,Open,M,Single-ply,IND,India,114.6,120,302.5,330,-350,330,165,-185,-185,165,240,270,302.5,302.5,797.5,SBD,
1,Shaik Saquib Basha,1996,Open,M,Single-ply,IND,India,131.9,120+,-315,330,-350,330,225,237.5,247.5,247.5,310,-335,-335,310,887.5,SBD,
2,Paritesh Pal,1999,Open,M,Single-ply,IND,India,148.45,120+,-250,250,-280,250,140,160,180,180,200,,,200,630,SBD,
1,Dinesh R,2006,Sub-Juniors,M,Single-ply,IND,India,64.45,66,170,200,-218,200,110,117.5,120,120,197.5,218,-225,218,538,SBD,
1,Jayamaruthy M,2004,Sub-Juniors,M,Single-ply,IND,India,73.35,74,235,253,-262.5,253,132.5,137.5,-140,137.5,245,-265,-265,245,635.5,SBD,
1,Rexon Noronha,2005,Sub-Juniors,M,Single-ply,IND,India,92.15,93,245,257.5,271,271,-100,120,130,130,210,225,240,240,641,SBD,
1,Sheik Abdulla S,2001,Juniors,M,Single-ply,IND,India,58.1,59,190,200,210,210,105,115,120,120,150,170,,170,500,SBD,
1,Sumit Singh Thakur,1999,Juniors,M,Single-ply,IND,India,71.95,74,245,250,-255,250,140,-147.5,147.5,147.5,250,255,-257.5,255,652.5,SBD,
2,Alex V Minj,2000,Juniors,M,Single-ply,IND,India,72.45,74,230,-247.5,247.5,247.5,165,-170,-170,165,220,237.5,-245,237.5,650,SBD,
1,Anil Kumar B,2000,Juniors,M,Single-ply,IND,India,80.25,83,-250,-250,250,250,150,160,170,170,225,237.5,242.5,242.5,662.5,SBD,
1,Durga Prasad M,2002,Juniors,M,Single-ply,IND,India,89.25,93,250,257.5,-265,257.5,150,160,170,170,220,227.5,240,240,667.5,SBD,
1,Vijay Kaweti Sagar,2000,Juniors,M,Single-ply,IND,India,109.5,120,230,-260,-260,230,130,137.5,142.5,142.5,-200,210,-225,210,582.5,SBD,
1,Hanumanthe Gowda,1976,Masters 1,M,Single-ply,IND,India,58.2,59,-140,140,142.5,142.5,95,102.5,107.5,107.5,165,175,177.5,177.5,427.5,SBD,
1,Satish Kharvi D K,1976,Masters 1,M,Single-ply,IND,India,64.5,66,180,202.5,-205,202.5,-115,115,125,125,195,215,225,225,552.5,SBD,
1,Roshan Ferrao,1979,Masters 1,M,Single-ply,IND,India,82.1,83,245,-260,260,260,110,-117.5,117.5,117.5,230,242.5,-250,242.5,620,SBD,
1,Venktesh Narayan Prabhu,1982,Masters 1,M,Single-ply,IND,India,90.6,93,245,-265,265,265,145,152.5,160,160,245,265,275,275,700,SBD,
2,Jitendra Yadav,1982,Masters 1,M,Single-ply,IND,India,84.75,93,230,240,250,250,-160,160,180,180,210,225,235,235,665,SBD,
1,Vishal Umbalkar,1978,Masters 1,M,Single-ply,IND,India,100.65,105,-240,240,250,250,170,177.5,-182.5,177.5,250,265,,265,692.5,SBD,
2,Raj Wasnik,1981,Masters 1,M,Single-ply,IND,India,99.1,105,-200,200,215,215,120,130,,130,170,-172.5,190,190,535,SBD,
1,Shetye Rajesh,1981,Masters 1,M,Single-ply,IND,India,115.4,120,-180,180,-200,180,95,105,112.5,112.5,180,200,207.5,207.5,500,SBD,
1,David Hrynkow,1964,Masters 2,M,Single-ply,CAN,Canada,65.5,66,137.5,145,152.5,152.5,80,90,-95,90,180,190,202.5,202.5,445,SBD,
1,Tanaji Patil,1966,Masters 2,M,Single-ply,IND,India,82.8,83,200,215,225,225,125,135,142.5,142.5,195,215,-222.5,215,582.5,SBD,
1,Jiwan Singh Bisht,1968,Masters 2,M,Single-ply,IND,India,90.15,93,250,270,,270,-130,-130,130,130,230,260,275,275,675,SBD,
2,Ravichandran D,1971,Masters 2,M,Single-ply,IND,India,84.15,93,170,190,-210,190,60,80,95,95,170,190,205,205,490,SBD,
1,Shivaramalingam G,1965,Masters 2,M,Single-ply,IND,India,108.6,120,140,,,140,120,,,120,180,,,180,440,SBD,
1,Stephen King #1,1962,Masters 3,M,Single-ply,NZL,New Zealand,82.6,83,205,225,-248,225,95,102.5,107.5,107.5,180,192.5,200,200,532.5,SBD,
1,Tony Urlich,1960,Masters 3,M,Single-ply,NZL,New Zealand,97.9,105,-150,150,160,160,110,115,-120,115,180,190,200,200,475,SBD,
2,Dinanth Sahni Shyam,1959,Masters 3,M,Single-ply,IND,India,94.35,105,100,115,130,130,85,95,100,100,140,150,160,160,390,SBD,
1,Abbas Pordel,1961,Masters 3,M,Single-ply,AUS,Australia,115.45,120,165,175,182.5,182.5,185.03,205.03,215.03,215.03,185,205,220,220,617.5,SBD,
1,Max Bristow,1944,Masters 4,M,Single-ply,AUS,Australia,67.95,74,-110,-120,120,120,60,70,72.5,72.5,165,180,-185,180,372.5,SBD,
1,Harish Kumar Kudroli,1952,Masters 4,M,Single-ply,IND,India,80.7,83,110,-120,-130,110,80,-90,90,90,130,135,-140,135,335,SBD,
1,Mick Ellender,1945,Masters 4,M,Single-ply,ENG,England,93.8,105,80,100,120,120,105,115,120,120,175,190,-200,190,430,SBD,
1,Jessie Lee,1997,Open,F,Raw,ENG,England,46.4,47,107.5,115,-117.5,115,57.5,62.5,65,65,137.5,147.5,153.5,153.5,333.5,SBD,
2,Lenka Pilnikova,1983,Open,F,Raw,ENG,England,46.7,47,107.5,115,117.5,117.5,70,75,-77.5,75,135,-142.5,-142.5,135,327.5,SBD,
3,Jackie Caldona,1989,Open,F,Raw,AUS,Australia,46.9,47,105,112.5,117.5,117.5,62.5,65,-67.5,65,120,132.5,137.5,137.5,320,SBD,
1,Megan-Li Smith,1996,Open,F,Raw,NZL,New Zealand,51.6,52,152.5,160,163.5,163.5,82.5,87.5,90,90,-170,170,-185,170,423.5,SBD,
2,Kavishi Kariyawasam,1993,Open,F,Raw,NZL,New Zealand,51.95,52,150,156.5,160.5,160.5,72.5,75,-77.5,75,172.5,-180,-190,172.5,408,SBD,
G,Suzan Premji,1984,Open,F,Raw,NZL-B,New Zealand,51.55,52,125,130,135,135,70,-75,-75,70,155,-162.5,-162.5,155,360,SBD,
1,Evie Corrigan,1996,Open,F,Raw,NZL,New Zealand,55.9,57,155,160,165,165,90,95,97.5,97.5,187.5,197.5,205.5,205.5,468,SBD,
2,Kayla Casey,1987,Open,F,Raw,CAN,Canada,55.7,57,137.5,142.5,145,145,87.5,92.5,-97.5,92.5,157.5,167.5,172.5,172.5,410,SBD,
3,Jodie Cook #1,1988,Open,F,Raw,ENG,England,56.35,57,130,137.5,-142.5,137.5,85,90,-92.5,90,-160,160,-175,160,387.5,SBD,
4,Jodie Hoey,1996,Open,F,Raw,SCO,Scotland,55.15,57,102.5,-115,117.5,117.5,55,60,-65,60,132.5,142.5,150,150,327.5,SBD,
G,Catherine Shon,1992,Open,F,Raw,NZL-B,New Zealand,56.5,57,137.5,145,150,150,80,-82.5,-82.5,80,167.5,172.5,-182.5,172.5,402.5,SBD,
1,Emily zur Linden,1987,Open,F,Raw,CAN,Canada,61.55,63,167.5,175,177.5,177.5,95,-100,100,100,185,192.5,194,194,471.5,SBD,
2,Makeda Vidal,1995,Open,F,Raw,ENG,England,60.75,63,170,177.5,180,180,80,85,-87.5,85,185,193.5,197.5,197.5,462.5,SBD,
3,Charlotte MacPherson,1995,Open,F,Raw,ENG,England,62.95,63,165,175,-180,175,92.5,-97.5,97.5,97.5,190,-195.5,-199.5,190,462.5,SBD,
4,Gillian Hurndell,1990,Open,F,Raw,NZL,New Zealand,61.05,63,140,150,-155,150,77.5,82.5,85,85,152.5,162.5,-170,162.5,397.5,SBD,
5,Amelia Krishna,1992,Open,F,Raw,RSA,South Africa,62.3,63,125,-132.5,132.5,132.5,50,-55,-55,50,145,155,165,165,347.5,SBD,
6,Sarah Strickland,1997,Open,F,Raw,CAN,Canada,62.95,63,97.5,102.5,110,110,67.5,72.5,75,75,117.5,127.5,132.5,132.5,317.5,SBD,
7,Stephanie Leece,1991,Open,F,Raw,IMN,Isle of Man,61.7,63,95,105,-110,105,45,47.5,-52.5,47.5,135,-145,-145,135,287.5,SBD,
8,Eliza Solarska,1995,Open,F,Raw,NI,N.Ireland,62.5,63,90,-105,105,105,50,-55,-55,50,125,132.5,-137.5,132.5,287.5,SBD,
9,Jo-Ann Corr,1993,Open,F,Raw,IMN,Isle of Man,58.8,63,85,92.5,-100,92.5,40,42.5,-47.5,42.5,100,110,-120,110,245,SBD,
1,Holly Bryans,1994,Open,F,Raw,ENG,England,68.3,69,160,170,-175.5,170,107.5,110.5,111.5,111.5,182.5,192.5,-202.5,192.5,474,SBD,
2,Lisa Kitigawa,1991,Open,F,Raw,CAN,Canada,68.15,69,147.5,155,160,160,80,-85,-85,80,175,182.5,185,185,425,SBD,
3,Lagi Naomi Fruean,1990,Open,F,Raw,NZL,New Zealand,68.15,69,140,147.5,152.5,152.5,-85,85,-90,85,170,180,187.5,187.5,425,SBD,
4,Karen Lai,1994,Open,F,Raw,ENG,England,67.8,69,145,152.5,-155,152.5,90,95,97.5,97.5,162.5,172.5,-177.5,172.5,422.5,SBD,
5,Amy Ng,1990,Open,F,Raw,CAN,Canada,65.6,69,125,130,135,135,77.5,82.5,-85,82.5,165,170,177.5,177.5,395,SBD,
6,Em Hanrahan,1998,Open,F,Raw,NZL,New Zealand,65.95,69,140,145,147.5,147.5,77.5,80,82.5,82.5,155,165,-172.5,165,395,SBD,
7,Ruth Moore,1988,Open,F,Raw,NI,N.Ireland,66.5,69,135,145,-152.5,145,70,-75,-75,70,162.5,172.5,177.5,177.5,392.5,SBD,
8,Katie Roberts,1989,Open,F,Raw,WAL,Wales,68.45,69,135,142.5,147.5,147.5,100,102.5,105,105,132.5,140,-147.5,140,392.5,SBD,
G,Alyssa-Joy Spence,1986,Open,F,Raw,NZL-B,New Zealand,67.4,69,147.5,157.5,162.5,162.5,85,87.5,-95,87.5,165,180,190,190,440,SBD,
1,Karlina Tongotea,1992,Open,F,Raw,NZL,New Zealand,75.25,76,210,219,223,223,117.5,122,-126,122,240.5,248,255,255,600,SBD,
2,Danielle Reid-Clavelle,1992,Open,F,Raw,CAN,Canada,75.2,76,175.5,180,182.5,182.5,85,90,95,95,182.5,190,-197.5,190,467.5,SBD,
3,Caryl McQuilling,1991,Open,F,Raw,WAL,Wales,73.95,76,152.5,162.5,167.5,167.5,85,-90,-90,85,170,180,187.5,187.5,440,SBD,
4,Rachele Griffin,1994,Open,F,Raw,AUS,Australia,73.3,76,142.5,152.5,157.5,157.5,82.5,87.5,90,90,172.5,185,-190,185,432.5,SBD,
5,Morgan Gladden,1990,Open,F,Raw,SCO,Scotland,73.1,76,152.5,160,-167.5,160,90,92.5,-95,92.5,162.5,175,-182.5,175,427.5,SBD,
6,Natasha Eaton,1992,Open,F,Raw,WAL,Wales,74.6,76,142.5,152.5,-157.5,152.5,82.5,-87.5,-87.5,82.5,147.5,162.5,170,170,405,SBD,
7,Hashilah Husaimee,1996,Open,F,Raw,BRU,Brunei,75.55,76,130,137.5,142.5,142.5,-82.5,82.5,85,85,152.5,162.5,-170,162.5,390,SBD,
8,Elizabeth Young,1984,Open,F,Raw,IMN,Isle of Man,71.4,76,100,110,-117.5,110,45,47.5,-50,47.5,130,137.5,142.5,142.5,300,SBD,
G,Nicole Smith,1993,Open,F,Raw,NZL-B,New Zealand,75.65,76,175,185,190,190,105,107.5,110,110,165,175,-182.5,175,475,SBD,
1,Claire Nunan,1993,Open,F,Raw,NZL,New Zealand,83.45,84,172.5,182.5,-187.5,182.5,107.5,112.5,115,115,200,207.5,215,215,512.5,SBD,
2,Rashenna Grzybowski,1995,Open,F,Raw,CAN,Canada,79.85,84,180,187.5,-192.5,187.5,92.5,97.5,100,100,190,200,-207.5,200,487.5,SBD,
3,Claire Tocher,1984,Open,F,Raw,SCO,Scotland,83.2,84,140,145,-150,145,100,-102.5,102.5,102.5,170,180,-187.5,180,427.5,SBD,
4,Niamh Carey,1993,Open,F,Raw,NI,N.Ireland,81.6,84,125,135,-140,135,52.5,57.5,-60,57.5,150,160,-170,160,352.5,SBD,
G,Kiri Hema,1988,Open,F,Raw,NZL-B,New Zealand,79.9,84,140,145,150,150,85,90,95,95,170,177.5,-187.5,177.5,422.5,SBD,
G,Hema Govind,1996,Open,F,Raw,NZL-B,New Zealand,83.65,84,185,192.5,198.5,198.5,100,105,-107.5,105,185,195,207.5,207.5,511,SBD,
1,Brittany Schlater,1991,Open,F,Raw,CAN,Canada,122.75,84+,232.5,242.5,250.5,250.5,135,142.5,149,149,-232.5,232.5,-262,232.5,632,SBD,
2,Rebecca Coggle,1983,Open,F,Raw,ENG,England,139.85,84+,185,205,-212.5,205,110,117.5,-125,117.5,155,-167.5,-177.5,155,477.5,SBD,
3,Aimee Christensen,1991,Open,F,Raw,NZL,New Zealand,144.7,84+,150,157.5,-160,157.5,100,105,-107.5,105,170,182.5,-187.5,182.5,445,SBD,
4,Rebecca Blenkin,1990,Open,F,Raw,AUS,Australia,122.45,84+,155,-165,170,170,90,95,-100,95,165,177.5,-185,177.5,442.5,SBD,
5,Abigail Matthews,1991,Open,F,Raw,WAL,Wales,137.9,84+,145,-157.5,-170,145,87.5,90,92.5,92.5,145,157.5,-170,157.5,395,SBD,
1,Teagan Lindsay,2006,Sub-Juniors,F,Raw,IMN,Isle of Man,49.95,52,67.5,72.5,-80,72.5,30,35,37.5,37.5,87.5,95,100,100,210,SBD,
2,Isobel Morris,2006,Sub-Juniors,F,Raw,IMN,Isle of Man,47.85,52,67.5,-75,-75,67.5,27.5,30,32.5,32.5,87.5,-92.5,-92.5,87.5,187.5,SBD,
1,Zaviera McMillan,2005,Sub-Juniors,F,Raw,NZL,New Zealand,56.85,57,112.5,-120.5,120.5,120.5,60,65,67.5,67.5,117.5,125,132.5,132.5,320.5,SBD,
1,Muskan Sheikh Khan,2004,Sub-Juniors,F,Raw,IND,India,61.55,63,90,100,105,105,50,55,57.5,57.5,105,-120,120,120,282.5,SBD,
1,Yasmin Bhadha,2004,Sub-Juniors,F,Raw,NZL,New Zealand,63.85,69,-120,-120,120,120,62.5,65,67,67,172.5,178,181,181,368,SBD,
2,Anna Jamieson,2006,Sub-Juniors,F,Raw,NZL,New Zealand,67.75,69,120,125,130,130,-60,60,62.5,62.5,125,132.5,-137.5,132.5,325,SBD,
1,Roechelle Van der Merwe,2006,Sub-Juniors,F,Raw,RSA,South Africa,71.8,76,122.5,130,132.5,132.5,57.5,62.5,65,65,140,150,155.5,155.5,353,SBD,
DQ,Tiggy Sadler-Barker,2005,Sub-Juniors,F,Raw,AUS,Australia,72.75,76,-135,-135,-135,-135,80,85,-90,85,127.5,137.5,145,145,,SBD,
1,Nagam Gnana Divya,2005,Sub-Juniors,F,Raw,IND,India,92.35,84+,-130,-150,150,150,40,50,55,55,130,150,155,155,360,SBD,
DQ,Shelby Dahler,2005,Sub-Juniors,F,Raw,AUS,Australia,138,84+,-145,-155,-155,-145,75,82.5,-87.5,82.5,125,-135,135,135,,SBD,
1,Duratul Ain,2000,Juniors,F,Raw,BRU,Brunei,40.85,43,85,90,-92.5,90,40,45,-47.5,45,115,122.5,-130,122.5,257.5,SBD,
1,Molly Clark,2000,Juniors,F,Raw,SCO,Scotland,50.6,52,110,115,120,120,80,85,-90,85,125,-135,-135,125,330,SBD,
2,Hana Stephen,2000,Juniors,F,Raw,ENG,England,51.8,52,97.5,-102.5,102.5,102.5,62.5,67.5,70,70,122.5,130,-135,130,302.5,SBD,
3,Milly Wong,2000,Juniors,F,Raw,NZL,New Zealand,51.45,52,100,105,-107.5,105,55,-57.5,57.5,57.5,120,127.5,135,135,297.5,SBD,
4,Kathryn Marron,2000,Juniors,F,Raw,NI,N.Ireland,50.15,52,100,-107.5,-107.5,100,52.5,-57.5,-57.5,52.5,117.5,130,142.5,142.5,295,SBD,
1,Dana Ye-Lee,1999,Juniors,F,Raw,NZL,New Zealand,55.75,57,135,140,145,145,-95,95,-100,95,152.5,162.5,167.5,167.5,407.5,SBD,
2,Sara Fiorvento,1999,Juniors,F,Raw,CAN,Canada,56,57,115,122.5,-125,122.5,65,70,72.5,72.5,125,135,142.5,142.5,337.5,SBD,
1,Thuy Vy Pham,2000,Juniors,F,Raw,AUS,Australia,61.5,63,147.5,155,-161,155,82.5,-85,85,85,165,170,-175,170,410,SBD,
2,Zoe Perkins,2002,Juniors,F,Raw,NZL,New Zealand,62.9,63,137.5,145,150,150,75,80,82.5,82.5,152.5,162.5,167.5,167.5,400,SBD,
3,Megan Janes,2003,Juniors,F,Raw,CAN,Canada,62.3,63,122.5,130,-132.5,130,85,90,-92.5,90,150,157.5,-165,157.5,377.5,SBD,
4,Lizzy Roberts,1999,Juniors,F,Raw,CAN,Canada,62.35,63,122.5,130,132.5,132.5,67.5,72.5,75,75,140,147.5,160,160,367.5,SBD,
5,Sophie Black,2000,Juniors,F,Raw,SCO,Scotland,57.6,63,-130,130,140,140,60,62.5,-65,62.5,-155,155,-162.5,155,357.5,SBD,
6,Kavitha D,2000,Juniors,F,Raw,IND,India,62.45,63,-125,125,127.5,127.5,60,65,-67.5,65,110,-120,125,125,317.5,SBD,
7,Beca Morgan,2002,Juniors,F,Raw,WAL,Wales,58.9,63,110,-115,-115,110,60,-65,65,65,110,125,-135,125,300,SBD,
1,Veronica Manning,1999,Juniors,F,Raw,NZL,New Zealand,68.4,69,122.5,130,132.5,132.5,85,87,-88,87,165,175,183,183,402.5,SBD,
2,Sally Corrigan,1999,Juniors,F,Raw,AUS,Australia,68.5,69,125,132.5,137.5,137.5,80,85,90,90,152.5,162.5,175,175,402.5,SBD,
3,Lily Carpenter,1999,Juniors,F,Raw,NZL,New Zealand,68.6,69,132.5,140.5,143,143,70,75,-77.5,75,152.5,165.5,177,177,395,SBD,
1,Madi McQuoid,1999,Juniors,F,Raw,NZL,New Zealand,74.5,76,100,110,-112.5,110,95,98,-100,98,185,195.5,200,200,408,SBD,
2,Olivia White,2001,Juniors,F,Raw,RSA,South Africa,73,76,145,155,-160,155,85,-90,90,90,155,162.5,-170,162.5,407.5,SBD,
3,Michelle Irvine,1999,Juniors,F,Raw,CAN,Canada,72.5,76,125,132.5,-140,132.5,65,70,72.5,72.5,145,155,162.5,162.5,367.5,SBD,
1,Charlotte Worley,2001,Juniors,F,Raw,NZL,New Zealand,83.6,84,165,172.5,175,175,102.5,-107.5,-107.5,102.5,182.5,192.5,200,200,477.5,SBD,
2,Harriet Waite,2001,Juniors,F,Raw,ENG,England,83.15,84,150,165,172.5,172.5,72.5,77.5,-80,77.5,160,172.5,180,180,430,SBD,
3,Sam Edgar,2000,Juniors,F,Raw,SCO,Scotland,81.55,84,147.5,-160,-160,147.5,77.5,-80,-80,77.5,175,187.5,-192.5,187.5,412.5,SBD,
4,Pratheeksha G. Naik,2000,Juniors,F,Raw,IND,India,83.2,84,120,-122.5,-122.5,120,65,,,65,140,,,140,325,SBD,
1,Rawinia Luka,2000,Juniors,F,Raw,NZL,New Zealand,107.6,84+,170,180,190,190,90,95,100,100,175,190,-200,190,480,SBD,
2,Moumita Ghosh,2002,Juniors,F,Raw,IND,India,100.55,84+,155,170,180,180,75,82.5,90,90,150,170,180,180,450,SBD,
3,Caitlin Davies,2001,Juniors,F,Raw,WAL,Wales,125.2,84+,155,-165,165,165,80,85,-87.5,85,155,165,-172.5,165,415,SBD,
4,Karin du Plessis,2000,Juniors,F,Raw,RSA,South Africa,105.65,84+,140,152.5,-157.5,152.5,77.5,82.5,-85,82.5,125,135,147.5,147.5,382.5,SBD,
5,Breana Andrews,1999,Juniors,F,Raw,CAN,Canada,100.15,84+,170,-175,-175,170,67.5,-70,-70,67.5,75,100,142.5,142.5,380,SBD,
6,Yashika Sharma,2001,Juniors,F,Raw,IND,India,89.4,84+,120,-125,-125,120,-50,50,55,55,120,-140,-140,120,295,SBD,
1,Natalie Bartolo,1981,Masters 1,F,Raw,AUS,Australia,51.9,52,102.5,107.5,112.5,112.5,57.5,62.5,65,65,125,132.5,137.5,137.5,315,SBD,
2,Neeta Metha,1977,Masters 1,F,Raw,IND,India,50.45,52,92.5,95,-102.5,95,50,55,-60,55,115,122.5,-130,122.5,272.5,SBD,
1,Megan Jeffery,1981,Masters 1,F,Raw,NZL,New Zealand,56.4,57,95,100,105,105,80,82.5,85,85,130,137.5,-145,137.5,327.5,SBD,
2,Ekta Vishnoi,1974,Masters 1,F,Raw,IND,India,55.6,57,105,110,115,115,55,57.5,-60,57.5,130,140,142.5,142.5,315,SBD,
3,Emma Stott,1974,Masters 1,F,Raw,ENG,England,56.55,57,-97.5,97.5,-100,97.5,60,62.5,-67.5,62.5,105,110,-117.5,110,270,SBD,
4,Emma Morris #1,1980,Masters 1,F,Raw,IMN,Isle of Man,52.35,57,70,75,80,80,37.5,40,-42.5,40,107.5,115,120,120,240,SBD,
1,Meaghan Trovato,1979,Masters 1,F,Raw,AUS,Australia,61.9,63,-120,120,125,125,70,75,77.5,77.5,137.5,145,-152.5,145,347.5,SBD,
2,Letitia Lau,1981,Masters 1,F,Raw,ENG,England,62.15,63,100,105,110,110,60,65,-67.5,65,120,132.5,140,140,315,SBD,
3,Kerry Lindsay,1973,Masters 1,F,Raw,IMN,Isle of Man,60.55,63,80,87.5,95,95,40,-42.5,42.5,42.5,100,107.5,-112.5,107.5,245,SBD,
1,Roshelle Jessop,1975,Masters 1,F,Raw,NZL,New Zealand,68.6,69,135,142.5,145,145,90,92.5,-95.5,92.5,177.5,187.5,190.5,190.5,428,SBD,
2,Melanie Green,1980,Masters 1,F,Raw,AUS,Australia,67.7,69,135,142.5,147.5,147.5,77.5,82.5,85,85,180,190,-195.5,190,422.5,SBD,
3,Alexa Sperske,1982,Masters 1,F,Raw,CAN,Canada,68.45,69,143,149,-151,149,72.5,75,-77.5,75,177.5,187.5,-191,187.5,411.5,SBD,
1,Ajanta Hilton,1978,Masters 1,F,Raw,ENG,England,75,76,125,130.5,133,133,65,70.5,-72.5,70.5,150,163,169.5,169.5,373,SBD,
2,Pia Marangoni,1978,Masters 1,F,Raw,RSA,South Africa,74.1,76,125,132.5,-138,132.5,65,-67.5,-67.5,65,145,161,-169,161,358.5,SBD,
3,Delyth Jones,1982,Masters 1,F,Raw,WAL,Wales,72.5,76,120,130,-140,130,70,72.5,75,75,130,137.5,-142.5,137.5,342.5,SBD,
4,Katie Sciffer,1980,Masters 1,F,Raw,AUS,Australia,75.55,76,110,-117.5,117.5,117.5,67.5,70,72.5,72.5,135,142.5,150,150,340,SBD,
1,Marie Wagner,1982,Masters 1,F,Raw,CAN,Canada,82.5,84,177.5,-183.5,183.5,183.5,95,100,-103,100,182.5,187.5,-195,187.5,471,SBD,
2,Janelle Abbott,1981,Masters 1,F,Raw,NZL,New Zealand,81.75,84,150,-160,160,160,92.5,100,102.5,102.5,155,167.5,-177.5,167.5,430,SBD,
3,Penelope Shearer,1981,Masters 1,F,Raw,AUS,Australia,83,84,142.5,147.5,150,150,70,-75,75,75,162.5,170,177.5,177.5,402.5,SBD,
4,Raina Ferris-Bretherton,1975,Masters 1,F,Raw,NZL,New Zealand,81,84,135,140,-147.5,140,80,-85,-85,80,175,180,-185,180,400,SBD,
5,Abbi Bosward-Fielding,1981,Masters 1,F,Raw,AUS,Australia,82.35,84,137.5,142.5,150,150,70,75,-77.5,75,160,170,-177.5,170,395,SBD,
6,Lisa Grant #2,1977,Masters 1,F,Raw,IMN,Isle of Man,82.55,84,130,135,-140,135,65,67.5,-70,67.5,180,190,-200,190,392.5,SBD,
G,Fiona Park,1977,Masters 1,F,Raw,NZL-B,New Zealand,82.35,84,125,130,135,135,77.5,-80,-80,77.5,140,145,-150,145,357.5,SBD,
G,Elizabeth Hall,1974,Masters 1,F,Raw,NZL-B,New Zealand,82.3,84,125,135,-140,135,60,62.5,65,65,127.5,137.5,150,150,350,SBD,
1,Siobhan Taylor,1978,Masters 1,F,Raw,ENG,England,116.45,84+,160,172.5,180,180,90,100,102.5,102.5,175,-185,-192.5,175,457.5,SBD,
2,Trina Bennett,1973,Masters 1,F,Raw,NZL,New Zealand,91.4,84+,155,162.5,167.5,167.5,75,80,82.5,82.5,175,185,190,190,440,SBD,
3,Nicola Berger,1979,Masters 1,F,Raw,NZL,New Zealand,114.5,84+,160,170,177.5,177.5,75,77.5,80,80,175,182.5,-190,182.5,440,SBD,
4,Tracy O'Callaghan,1978,Masters 1,F,Raw,WAL,Wales,101.3,84+,165,-175,175,175,-75,75,80,80,170,180,-190,180,435,SBD,
1,Angelina Lane,1969,Masters 2,F,Raw,WAL,Wales,51.85,52,85,90,-92.5,90,47.5,52.5,55,55,112.5,120,125,125,270,SBD,
2,Vinutha Raghunath,1968,Masters 2,F,Raw,IND,India,50.75,52,100,105,-110,105,47.5,-52.5,-55,47.5,115,-122.5,-122.5,115,267.5,SBD,
1,Linda Jensen,1965,Masters 2,F,Raw,AUS,Australia,56.25,57,100,-105,105,105,57.5,60,-62.5,60,135,145,150,150,315,SBD,
2,Anna Clarke,1968,Masters 2,F,Raw,NZL,New Zealand,56.15,57,95,-102.5,-105,95,57.5,-60,-60,57.5,122.5,130,135,135,287.5,SBD,
1,Karen Humphreys,1963,Masters 2,F,Raw,NZL,New Zealand,61.15,63,102.5,107.5,112.5,112.5,57.5,60,62.5,62.5,125,130,132.5,132.5,307.5,SBD,
2,Annette Forker,1966,Masters 2,F,Raw,NI,N.Ireland,61.9,63,90,-97.5,97.5,97.5,55,57.5,-60,57.5,115,122.5,127.5,127.5,282.5,SBD,
3,Rachel Spragg,1970,Masters 2,F,Raw,ENG,England,62.65,63,-90,95,102.5,102.5,60,-65,-65,60,105,-112.5,-112.5,105,267.5,SBD,
4,Vilma Saldanha,1969,Masters 2,F,Raw,IND,India,61.9,63,85,90,-95,90,47.5,52.5,-55,52.5,115,120,-125,120,262.5,SBD,
1,Michelle Breen,1971,Masters 2,F,Raw,NI,N.Ireland,65.4,69,115,117.5,120,120,50,52.5,-57.5,52.5,135,142.5,147.5,147.5,320,SBD,
2,Michelle Wilson,1971,Masters 2,F,Raw,AUS,Australia,68.25,69,110,117.5,120,120,62.5,65,-67.5,65,-120,-120,120,120,305,SBD,
3,Tree Grennan,1966,Masters 2,F,Raw,ENG,England,67.25,69,82.5,92.5,100,100,42.5,47.5,50,50,110,120,122.5,122.5,272.5,SBD,
1,Kylie Dwyer,1970,Masters 2,F,Raw,AUS,Australia,71.2,76,115,125,-127.5,125,65,-70,-70,65,145,155,158.5,158.5,348.5,SBD,
2,Carole Condon,1965,Masters 2,F,Raw,AUS,Australia,74.7,76,115,122.5,127.5,127.5,67.5,-70,-70,67.5,142.5,150,-158,150,345,SBD,
1,Ranjita Mishra,1969,Masters 2,F,Raw,IND,India,82.05,84,125,135,-148,135,65,-72.5,72.5,72.5,150,165,167.5,167.5,375,SBD,
2,Melissa Seiuli,1969,Masters 2,F,Raw,NZL,New Zealand,80.65,84,120,125,135,135,75,80,-82.5,80,142.5,150,157.5,157.5,372.5,SBD,
3,Claire Hendy,1968,Masters 2,F,Raw,WAL,Wales,82.95,84,107.5,-115,115,115,57.5,65,67.5,67.5,122.5,132.5,140,140,322.5,SBD,
4,Sue Taylor,1963,Masters 2,F,Raw,NZL,New Zealand,82.35,84,87.5,92.5,97.5,97.5,52.5,55,-57.5,55,130,137.5,142.5,142.5,295,SBD,
1,Ime Telea,1972,Masters 2,F,Raw,NZL,New Zealand,110.15,84+,150,160,175,175,102.5,110,112.5,112.5,190,202.5,212.5,212.5,500,SBD,
2,Ali Cosner,1971,Masters 2,F,Raw,NZL,New Zealand,103,84+,140,-152.5,155,155,85,92.5,97.5,97.5,185,195,202.5,202.5,455,SBD,
3,Joanne Laird,1972,Masters 2,F,Raw,ENG,England,125.35,84+,140,152.5,162.5,162.5,90,95,100,100,155,165,170,170,432.5,SBD,
4,Elaine Jackson #2,1969,Masters 2,F,Raw,ENG,England,116.7,84+,122.5,130,137.5,137.5,72.5,80,-85,80,165,175,-190,175,392.5,SBD,
5,Angela Lauder,1970,Masters 2,F,Raw,SCO,Scotland,88.4,84+,115,122.5,-130,122.5,75,-80,-80,75,150,160,-190,160,357.5,SBD,
1,Trish Muldrock,1954,Masters 3,F,Raw,NZL,New Zealand,46.2,47,70,-75,75,75,55,57.5,-60,57.5,117.5,122.5,-128.5,122.5,255,SBD,
1,Julianne Taylor,1959,Masters 3,F,Raw,NZL,New Zealand,51.9,52,87.5,92.5,97.5,97.5,52.5,55,-57.5,55,95,102.5,110,110,262.5,SBD,
1,Lesley Procter,1956,Masters 3,F,Raw,NZL,New Zealand,74.05,76,100,107.5,-112.5,107.5,62.5,-67.5,-67.5,62.5,135,142.5,-147.5,142.5,312.5,SBD,
DQ,Teresa Millynn,1954,Masters 3,F,Raw,AUS,Australia,72.4,76,-77.5,-80,-80,-77.5,-37.5,,,,,,,,,SBD,
1,Tracy Chipping,1961,Masters 3,F,Raw,NZL,New Zealand,82.85,84,-125.5,130.5,135.5,135.5,67.5,70,75,75,140,150,158.5,158.5,369,SBD,
2,Peta Day,1959,Masters 3,F,Raw,AUS,Australia,82.85,84,125,135,138,138,60,65,-67.5,65,147.5,158,160,160,363,SBD,
1,Marion Baird,1957,Masters 3,F,Raw,AUS,Australia,112.85,84+,65,75,82.5,82.5,47.5,50,52.5,52.5,115,120,125,125,260,SBD,
1,Cherry Wilson,1950,Masters 4,F,Raw,NZL,New Zealand,56.4,57,75,80,-84,80,37.5,40,42.5,42.5,100,107.5,112.5,112.5,235,SBD,
1,Kajal Bhakare,1997,Open,F,Single-ply,IND,India,43.2,47,100,-122.5,130,130,-70,70,85,85,110,120,135,135,350,SBD,
1,Kaminee Boste,1999,Open,F,Single-ply,IND,India,50.55,52,120,150,170,170,75,-85,90,90,120,140,150,150,410,SBD,
1,Ramalakshmi Jajula,1989,Open,F,Single-ply,IND,India,56,57,145,155,165,165,100,-105,-105,100,150,160,165,165,430,SBD,
1,Sudha Kumari,1979,Open,F,Single-ply,IND,India,62.35,63,140,152.5,-162.5,152.5,95,105,112.5,112.5,140,-150,,140,405,SBD,
2,Santhoshi Majhi,1982,Open,F,Single-ply,IND,India,57.9,63,145,-160,-160,145,65,-70,70,70,150,160,170,170,385,SBD,
1,Chantelle Du Toit,1985,Open,F,Single-ply,RSA,South Africa,74.8,76,160,170.5,175.5,175.5,103,106.5,108,108,155,165,-170,165,448.5,SBD,
2,Joanne Henry #1,1987,Open,F,Single-ply,AUS,Australia,73.6,76,165,175,-180,175,-90,90,-97.5,90,160,172.5,180,180,445,SBD,
1,Vummualla Mallika Yadav,1994,Open,F,Single-ply,IND,India,83.75,84,180,210,236,236,70,85,95,95,190,205,215.5,215.5,546.5,SBD,
1,Prateeksha Baban Gaikwad,1991,Open,F,Single-ply,IND,India,84.7,84+,190,-210,210,210,110,125,130,130,170,185,-192.5,185,525,SBD,
1,Krity Raj Singh,2005,Sub-Juniors,F,Single-ply,IND,India,55,57,92.5,95,-110,95,40,55,-62.5,55,105,112.5,117.5,117.5,267.5,SBD,
1,E Sruthi,2004,Sub-Juniors,F,Single-ply,IND,India,73.75,76,110,-125,-130,110,60,65,67.5,67.5,130,145,160,160,337.5,SBD,
1,N. Mani Sravani,2004,Sub-Juniors,F,Single-ply,IND,India,103.55,84+,140,160,172.5,172.5,75,87.5,97.5,97.5,120,132.5,-142.5,132.5,402.5,SBD,
2,Reshieal Roshni Monteiro,2005,Sub-Juniors,F,Single-ply,IND,India,,84+,-125,135,-140,135,80,90,-105,90,120,132.5,140,140,365,SBD,
1,Logapriya S,2000,Juniors,F,Single-ply,IND,India,51.75,52,130,140,-150,140,50,65,70,70,120,130,140,140,350,SBD,
2,Debosree Sarkar,2000,Juniors,F,Single-ply,IND,India,51.35,52,90,100,105,105,45,50,55,55,100,110,117.5,117.5,277.5,SBD,
1,Shaik Sadiya Almas,2002,Juniors,F,Single-ply,IND,India,55.9,57,160,177.5,-187.5,177.5,65,70,-77.5,70,150,163,170,170,417.5,SBD,
1,Kavitha K,2000,Juniors,F,Single-ply,IND,India,57.6,63,100,120,135,135,55,65,70,70,120,140,-150,140,345,SBD,
1,Priya M,2000,Juniors,F,Single-ply,IND,India,64.65,69,120,145,-160,145,70,80,82.5,82.5,125,140,147.5,147.5,375,SBD,
1,Pratheeksha G. Naik,2000,Juniors,F,Single-ply,IND,India,83.55,84,180,-193,193,193,95,105,-116,105,160,175,-180,175,473,SBD,
2,Amsavalli Saravanan,2001,Juniors,F,Single-ply,IND,India,80.5,84,150,152.5,157.5,157.5,60,65,70,70,145,150,157.5,157.5,385,SBD,
1,Moumita Ghosh,2002,Juniors,F,Single-ply,IND,India,99.65,84+,175,-200,200,200,90,97.5,100,100,160,185,193,193,493,SBD,
1,Sima Dutta Chatterjee,1977,Masters 1,F,Single-ply,IND,India,62.85,63,90,110,-117.5,110,60,65,-67.5,65,90,110,-125,110,285,SBD,
1,Amudha Suganthi B,1982,Masters 1,F,Single-ply,IND,India,63.4,69,-110,110,120,120,65,67.5,70,70,120,130,140,140,330,SBD,
1,Vaishali Sadashiv,1982,Masters 1,F,Single-ply,IND,India,88.45,84+,95,105,115,115,40,47.5,-52.5,47.5,95,105,117.5,117.5,280,SBD,
1,Carol Anthony,1966,Masters 2,F,Single-ply,RSA,South Africa,51.7,52,110,-120,-130.5,110,47.5,52.5,-55,52.5,110,120,127.5,127.5,290,SBD,
1,Dimple Kasana,1967,Masters 2,F,Single-ply,IND,India,61.7,63,75,-90,95,95,45,52.5,-55,52.5,80,100,112.5,112.5,260,SBD,
1,Kangabam Manikhombi Devi,1970,Masters 2,F,Single-ply,IND,India,75,76,50,-60,60,60,30,32.5,,32.5,50,67.5,72.5,72.5,165,SBD,
1,Takhelmayum Lena Devi,1969,Masters 2,F,Single-ply,IND,India,86.45,84+,50,65,-80,65,35,40,-60,40,60,72.5,82.5,82.5,187.5,SBD,
1,Jeannette Gevers,1962,Masters 3,F,Single-ply,AUS,Australia,59.65,63,140,145,150.5,150.5,85,-87.5,-87.5,85,127.5,132.5,-135,132.5,368,SBD,
1,Valerie Silver,1949,Masters 4,F,Single-ply,AUS,Australia,62.1,63,35,42.5,45,45,40,42.5,-45,42.5,85,92.5,-100,92.5,180,SBD,
DQ,Chingkhuleima Devi Kh,1948,Masters 4,F,Single-ply,IND,India,74.45,76,-30,30,-50,30,-25,,-25,-25,40,50,70,70,,SBD,
1,Zako Fong,1998,Open,M,Raw,NZL,New Zealand,65.3,66,,,,,135,-140,140,140,,,,,140,B,
2,Sidhant Nitin Kudalkar,1998,Open,M,Raw,IND,India,64.65,66,,,,,75,90,95,95,,,,,95,B,
1,Kavwa Sichone,1989,Open,M,Raw,NZL,New Zealand,72.95,74,,,,,160,170,175,175,,,,,175,B,
2,Louis Lattuca,1987,Open,M,Raw,ENG,England,72.95,74,,,,,120,-125,-125,120,,,,,120,B,
1,Wasu Jaideep,1994,Open,M,Raw,ENG,England,81.8,83,,,,,152.5,157.5,162.5,162.5,,,,,162.5,B,
2,Richard Kerr-Phillips,1990,Open,M,Raw,NZL,New Zealand,82.5,83,,,,,152.5,157.5,162.5,162.5,,,,,162.5,B,
3,Max Palmer,1997,Open,M,Raw,NZL,New Zealand,80.15,83,,,,,145,152.5,-157.5,152.5,,,,,152.5,B,
1,Peter Sanerivi,1985,Open,M,Raw,NZL,New Zealand,92.05,93,,,,,180,190,195,195,,,,,195,B,
2,Robert Perry,,Open,M,Raw,CAN,Canada,92.2,93,,,,,145,150,155,155,,,,,155,B,
1,Liam McAskie,1995,Open,M,Raw,NZL,New Zealand,104.15,105,,,,,-190,190,197.5,197.5,,,,,197.5,B,
2,Andrei Pavlov,1987,Open,M,Raw,NZL,New Zealand,103.3,105,,,,,192.5,195,-200,195,,,,,195,B,
3,Wesley McGuinness,1989,Open,M,Raw,ENG,England,100.6,105,,,,,175,190,-195,190,,,,,190,B,
4,Simon Beer,1988,Open,M,Raw,ENG,England,101.4,105,,,,,140,150,-160,150,,,,,150,B,
1,Troy Atkin,1992,Open,M,Raw,ENG,England,118.9,120,,,,,-175,175,182.5,182.5,,,,,182.5,B,
2,John Rippingale,1983,Open,M,Raw,NZL,New Zealand,115.45,120,,,,,-170,170,-175,170,,,,,170,B,
1,Ajay Gogna,1988,Open,M,Raw,IND,India,149.5,120+,,,,,120,140,-145,140,,,,,140,B,
2,Prasad Naik Kantyani,1988,Open,M,Raw,IND,India,154.65,120+,,,,,100,-110,-110,100,,,,,100,B,
1,Sean Miller #4,2004,Sub-Juniors,M,Raw,IMN,Isle of Man,68.3,74,,,,,70,90,-100,90,,,,,90,B,
1,Izak Kriel,2005,Sub-Juniors,M,Raw,RSA,South Africa,84.65,93,,,,,125,-140,-157.5,125,,,,,125,B,
2,Joseph Farrell,2005,Sub-Juniors,M,Raw,NZL,New Zealand,86.1,93,,,,,115,122.5,-127.5,122.5,,,,,122.5,B,
1,Haroon Choudhary,2001,Juniors,M,Raw,IND,India,73.15,74,,,,,120,130,-140,130,,,,,130,B,
1,Josh Signal,1999,Juniors,M,Raw,NZL,New Zealand,82.5,83,,,,,137.5,142.5,-145,142.5,,,,,142.5,B,
2,Sam Syson,2000,Juniors,M,Raw,ENG,England,79.85,83,,,,,135,140,-142.5,140,,,,,140,B,
1,Kian Doyle,2002,Juniors,M,Raw,ENG,England,90.6,93,,,,,152.5,160,170,170,,,,,170,B,
1,Ahmed Farid,2002,Juniors,M,Raw,NZL,New Zealand,102.75,105,,,,,137.5,140,-145,140,,,,,140,B,
1,Hanumanthe Gowda,1976,Masters 1,M,Raw,IND,India,57.8,59,,,,,82.5,-87.5,-87.5,82.5,,,,,82.5,B,
1,Rajesh Babu,1980,Masters 1,M,Raw,NZL,New Zealand,65.7,66,,,,,115,120,-122.5,120,,,,,120,B,
2,Satish Kharvi D K,1976,Masters 1,M,Raw,IND,India,65,66,,,,,90,100,102.5,102.5,,,,,102.5,B,
1,Chris Ritchie,1977,Masters 1,M,Raw,NZL,New Zealand,82.75,83,,,,,117.5,127.5,-135,127.5,,,,,127.5,B,
1,David Litchfield,1975,Masters 1,M,Raw,SCO,Scotland,92.2,93,,,,,160,167.5,170,170,,,,,170,B,
2,Ross Carlyle,1978,Masters 1,M,Raw,ENG,England,91.7,93,,,,,147.5,157.5,-162.5,157.5,,,,,157.5,B,
3,Daryl Harrison,1975,Masters 1,M,Raw,NZL,New Zealand,91.8,93,,,,,150,-157.5,-160,150,,,,,150,B,
4,Richard Best,1975,Masters 1,M,Raw,NZL,New Zealand,87.55,93,,,,,137.5,-142.5,142.5,142.5,,,,,142.5,B,
5,Venktesh Narayan Prabhu,1982,Masters 1,M,Raw,IND,India,90,93,,,,,130,-140,,130,,,,,130,B,
1,David Noma,1982,Masters 1,M,Raw,CAN,Canada,99,105,,,,,145,150,152.5,152.5,,,,,152.5,B,
2,Graham Luck,1973,Masters 1,M,Raw,ENG,England,104.65,105,,,,,100,-105,,100,,,,,100,B,
1,Richy George,1979,Masters 1,M,Raw,NZL,New Zealand,115.85,120,,,,,207.5,215,217.5,217.5,,,,,217.5,B,
1,David Hrynkow,1964,Masters 2,M,Raw,CAN,Canada,65.65,66,,,,,82.5,90,92.5,92.5,,,,,92.5,B,
2,Andy Liddle,1970,Masters 2,M,Raw,ENG,England,64.65,66,,,,,-85,85,90,90,,,,,90,B,
1,Jagannath Poorathankandy,1968,Masters 2,M,Raw,IND,India,71.3,74,,,,,90,100,107.5,107.5,,,,,107.5,B,
1,Phil Lacey,1969,Masters 2,M,Raw,NZL,New Zealand,81.25,83,,,,,142.5,150,157.5,157.5,,,,,157.5,B,
2,Rob Dyke,1972,Masters 2,M,Raw,CAN,Canada,80.85,83,,,,,145,150,155,155,,,,,155,B,
3,Stuart Peskett,1966,Masters 2,M,Raw,ENG,England,80.95,83,,,,,125,135,-147.5,135,,,,,135,B,
1,Stanley Day,1972,Masters 2,M,Raw,NZL,New Zealand,92.55,93,,,,,160,170,177.5,177.5,,,,,177.5,B,
2,Subhash Deshmukh,1966,Masters 2,M,Raw,IND,India,91.8,93,,,,,120,127.5,-132.5,127.5,,,,,127.5,B,
1,Malone Horn,1970,Masters 2,M,Raw,NZL,New Zealand,103.55,105,,,,,175,180,185,185,,,,,185,B,
2,Peter Stuart,1966,Masters 2,M,Raw,NZL,New Zealand,102.45,105,,,,,145,155,-160,155,,,,,155,B,
3,Mark Farrell,1969,Masters 2,M,Raw,NZL,New Zealand,104.25,105,,,,,135,142.5,-145,142.5,,,,,142.5,B,
1,Darren Ball,1970,Masters 2,M,Raw,ENG,England,118.45,120,,,,,155,-165,165,165,,,,,165,B,
2,Shivaramalingam G,1965,Masters 2,M,Raw,IND,India,109.5,120,,,,,120,,,120,,,,,120,B,
1,Paul Gattsche,1968,Masters 2,M,Raw,NZL,New Zealand,130.45,120+,,,,,190,202.5,207.5,207.5,,,,,207.5,B,
2,Mark Osborne,1972,Masters 2,M,Raw,NZL,New Zealand,149.5,120+,,,,,100,120,140,140,,,,,140,B,
1,Inderjit Singh Sabharwal,1954,Masters 3,M,Raw,IND,India,82,83,,,,,100,107.5,112.5,112.5,,,,,112.5,B,
2,Yumlembam Dhyan Singh,1959,Masters 3,M,Raw,IND,India,82.6,83,,,,,80,90,-100,90,,,,,90,B,
1,Roger Gedye,1956,Masters 3,M,Raw,NZL,New Zealand,98.3,105,,,,,120,-122.5,122.5,122.5,,,,,122.5,B,
1,William Koppe,1946,Masters 4,M,Raw,AUS,Australia,73,74,,,,,75,85,-87.5,85,,,,,85,B,
1,Kr Saha Nirmal,1948,Masters 4,M,Raw,IND,India,75.4,83,,,,,60,67.5,75,75,,,,,75,B,
2,Peter Stratford,1951,Masters 4,M,Raw,NZL,New Zealand,74.6,83,,,,,65,67.5,72.5,72.5,,,,,72.5,B,
1,Sidhant Nitin Kudalkar,1998,Open,M,Single-ply,IND,India,65.1,66,,,,,80,100,107.5,107.5,,,,,107.5,B,
1,Ansu Singh,1992,Open,M,Single-ply,IND,India,82.85,83,,,,,155,165,-172.5,165,,,,,165,B,
1,Thomas Morgan #1,1996,Open,M,Single-ply,WAL,Wales,92.05,93,,,,,-215,215,225,225,,,,,225,B,
1,Jo Shaw,1998,Open,M,Single-ply,ENG,England,104.35,105,,,,,-190,190,200,200,,,,,200,B,
2,Toby Clarke,1994,Open,M,Single-ply,NI,N.Ireland,93.25,105,,,,,140,155,-170,155,,,,,155,B,
1,Garrett Cartwright-Bentley,1988,Open,M,Single-ply,CAN,Canada,129.85,120+,,,,,315,-322.5,322.5,322.5,,,,,322.5,B,
2,Martin Marshall,1987,Open,M,Single-ply,ENG,England,129.7,120+,,,,,-230,230,-250,230,,,,,230,B,
3,Prasad Naik Kantyani,1988,Open,M,Single-ply,IND,India,154.45,120+,,,,,100,,,100,,,,,100,B,
1,Haroon Choudhary,2001,Juniors,M,Single-ply,IND,India,73.5,74,,,,,120,130,-132.5,130,,,,,130,B,
1,Angus Gardner,2000,Juniors,M,Single-ply,ENG,England,90.5,93,,,,,140,-155,157.5,157.5,,,,,157.5,B,
1,Gowda Hanumanthe,1976,Masters 1,M,Single-ply,IND,India,57.65,59,,,,,95,-100,102.5,102.5,,,,,102.5,B,
1,Satish Kharvi D K,1976,Masters 1,M,Single-ply,IND,India,65.35,66,,,,,115,122.5,-130,122.5,,,,,122.5,B,
1,Venktesh Narayan Prabhu,1982,Masters 1,M,Single-ply,IND,India,91,93,,,,,145,155,-170,155,,,,,155,B,
1,Simon Breetzke,1978,Masters 1,M,Single-ply,RSA,South Africa,138.8,120+,,,,,240,-260,-260,240,,,,,240,B,
1,David Hrynkow,1964,Masters 2,M,Single-ply,CAN,Canada,66,66,,,,,82.5,-95,-95,82.5,,,,,82.5,B,
1,Jagannath Poorathankandy,1968,Masters 2,M,Single-ply,IND,India,71.8,74,,,,,110,120,-125,120,,,,,120,B,
1,Mandia Anand,1971,Masters 2,M,Single-ply,IND,India,82.95,83,,,,,160,167.5,170,170,,,,,170,B,
2,Jim Rossborough,1972,Masters 2,M,Single-ply,NI,N.Ireland,81.5,83,,,,,145,150,-167.5,150,,,,,150,B,
1,Subhash Deshmukh,1966,Masters 2,M,Single-ply,IND,India,91.5,93,,,,,-125,125,132.5,132.5,,,,,132.5,B,
1,Darren Ball,1970,Masters 2,M,Single-ply,ENG,England,118.4,120,,,,,150,152.5,155,155,,,,,155,B,
2,Shivaramalingam G,1965,Masters 2,M,Single-ply,IND,India,109.65,120,,,,,120,-130,,120,,,,,120,B,
1,Inderjit Singh Sabharwal,1954,Masters 3,M,Single-ply,IND,India,81.6,83,,,,,-110,110,125,125,,,,,125,B,
2,Yumlembam Dhyan Singh,1959,Masters 3,M,Single-ply,IND,India,82.65,83,,,,,80,-90,90,90,,,,,90,B,
1,Tony Urlich,1960,Masters 3,M,Single-ply,NZL,New Zealand,97.15,105,,,,,110,117.5,-122.5,117.5,,,,,117.5,B,
1,Kr Saha Nirmal,1948,Masters 4,M,Single-ply,IND,India,75.35,83,,,,,-65,65,75,75,,,,,75,B,
1,Mick Ellender,1945,Masters 4,M,Single-ply,ENG,England,94.3,105,,,,,110,120,-127.5,120,,,,,120,B,
1,Jodie Cook #1,1988,Open,F,Raw,ENG,England,56.3,57,,,,,80,87.5,-95,87.5,,,,,87.5,B,
1,Charlotte MacPherson,1995,Open,F,Raw,ENG,England,62.7,63,,,,,82.5,90,97.5,97.5,,,,,97.5,B,
2,Eliza Solarska,1995,Open,F,Raw,NI,N.Ireland,62.15,63,,,,,-50,52.5,55,55,,,,,55,B,
3,Stephanie Leece,1991,Open,F,Raw,IMN,Isle of Man,61.6,63,,,,,45,50,52.5,52.5,,,,,52.5,B,
1,Carolina Dillen,1983,Open,F,Raw,NZL,New Zealand,68.2,69,,,,,87.5,92.5,-95,92.5,,,,,92.5,B,
2,Sarah Thompson,1992,Open,F,Raw,NZL,New Zealand,67.45,69,,,,,75,80,-85,80,,,,,80,B,
3,Sarah Strickland,1997,Open,F,Raw,CAN,Canada,67.95,69,,,,,67.5,72.5,75,75,,,,,75,B,
1,Chanel Williams,1995,Open,F,Raw,NZL,New Zealand,74.2,76,,,,,97.5,102.5,107.5,107.5,,,,,107.5,B,
2,Lydia North,1988,Open,F,Raw,CAN,Canada,74.45,76,,,,,90,95,100,100,,,,,100,B,
3,Morgan Gladden,1990,Open,F,Raw,SCO,Scotland,72.8,76,,,,,90,95,97.5,97.5,,,,,97.5,B,
1,Amber Russell,1993,Open,F,Raw,NZL,New Zealand,83.35,84,,,,,117.5,123,127,127,,,,,127,B,
2,Marie Wagner,1982,Open,F,Raw,CAN,Canada,82.6,84,,,,,95,100,102.5,102.5,,,,,102.5,B,
3,Claire Tocher,1984,Open,F,Raw,SCO,Scotland,83.6,84,,,,,102.5,-107.5,-107.5,102.5,,,,,102.5,B,
4,Kiri Hema,1988,Open,F,Raw,NZL,New Zealand,80.6,84,,,,,87.5,92.5,,92.5,,,,,92.5,B,
1,Rebecca Coggle,1983,Open,F,Raw,ENG,England,139.75,84+,,,,,115,120,128,128,,,,,128,B,
2,Aimee Lynch,1984,Open,F,Raw,NZL,New Zealand,182.5,84+,,,,,115,-122.5,-122.5,115,,,,,115,B,
3,Teresa Poli,1997,Open,F,Raw,NZL,New Zealand,100.9,84+,,,,,97.5,102.5,107.5,107.5,,,,,107.5,B,
4,Holly Jonson,1997,Open,F,Raw,NZL,New Zealand,94.6,84+,,,,,97.5,102.5,-107.5,102.5,,,,,102.5,B,
1,Teagan Lindsay,2006,Sub-Juniors,F,Raw,IMN,Isle of Man,49.15,52,,,,,32.5,35,-40,35,,,,,35,B,
2,Isobel Morris,2006,Sub-Juniors,F,Raw,IMN,Isle of Man,47.75,52,,,,,27.5,30,-32.5,30,,,,,30,B,
1,Krity Raj Singh,2005,Sub-Juniors,F,Raw,IND,India,55.15,57,,,,,40,45,-47.5,45,,,,,45,B,
1,Ellie Curtis,2001,Juniors,F,Raw,ENG,England,56.3,57,,,,,67.5,72.5,-80,72.5,,,,,72.5,B,
1,Yasmin Burt,2003,Juniors,F,Raw,ENG,England,62.4,63,,,,,77.5,85,90,90,,,,,90,B,
1,Bettina Hanlon,2000,Juniors,F,Raw,ENG,England,68,69,,,,,90,95,-97.5,95,,,,,95,B,
1,Pratheeksha G. Naik,2000,Juniors,F,Raw,IND,India,82.95,84,,,,,65,70,-75,70,,,,,70,B,
1,Neeta Metha,1977,Masters 1,F,Raw,IND,India,50.75,52,,,,,47.5,50,52.5,52.5,,,,,52.5,B,
1,Amanda Parish,1978,Masters 1,F,Raw,NZL,New Zealand,56.4,57,,,,,65,67.5,70,70,,,,,70,B,
2,Emma Stott,1974,Masters 1,F,Raw,ENG,England,56.3,57,,,,,65,67.5,-70,67.5,,,,,67.5,B,
3,Emma Morris #1,1980,Masters 1,F,Raw,IMN,Isle of Man,53.5,57,,,,,37.5,40,42.5,42.5,,,,,42.5,B,
1,Dutt Chatterjee Sima,1977,Masters 1,F,Raw,IND,India,62.95,63,,,,,42.5,47.5,52.5,52.5,,,,,52.5,B,
2,Kerry Lindsay,1973,Masters 1,F,Raw,IMN,Isle of Man,60.6,63,,,,,40,42.5,45,45,,,,,45,B,
1,Anita Broczek,1977,Masters 1,F,Raw,NZL,New Zealand,67.45,69,,,,,75,80,82.5,82.5,,,,,82.5,B,
2,Amudha Suganthi B,1982,Masters 1,F,Raw,IND,India,63.6,69,,,,,60,65,67.5,67.5,,,,,67.5,B,
1,Lisa Grant #2,1977,Masters 1,F,Raw,IMN,Isle of Man,83.15,84,,,,,65,67.5,-72.5,67.5,,,,,67.5,B,
1,Polly Websdell,1973,Masters 1,F,Raw,NZL,New Zealand,122.7,84+,,,,,110,115,120.5,120.5,,,,,120.5,B,
2,Siobhan Taylor,1978,Masters 1,F,Raw,ENG,England,116.5,84+,,,,,90,97.5,102.5,102.5,,,,,102.5,B,
1,Joanna Lawrence,1970,Masters 2,F,Raw,AUS,Australia,61.3,63,,,,,75,77.5,80,80,,,,,80,B,
2,Rachel Spragg,1970,Masters 2,F,Raw,ENG,England,62.2,63,,,,,60,65,-67.5,65,,,,,65,B,
3,Annette Forker,1966,Masters 2,F,Raw,NI,N.Ireland,62.2,63,,,,,52.5,55,57.5,57.5,,,,,57.5,B,
4,Dimple Kasana,1967,Masters 2,F,Raw,IND,India,61.95,63,,,,,45,50,-52.5,50,,,,,50,B,
1,Jo Tarlton,1972,Masters 2,F,Raw,NZL,New Zealand,67.9,69,,,,,67.5,70,-72.5,70,,,,,70,B,
2,Kelly Clark #1,1964,Masters 2,F,Raw,ENG,England,66.8,69,,,,,40,45,-50,45,,,,,45,B,
1,Delwyn Evans,1964,Masters 2,F,Raw,NZL,New Zealand,73.8,76,,,,,70,75,-78,75,,,,,75,B,
1,Elizabeth Welgens,1971,Masters 2,F,Raw,NZL,New Zealand,128.6,84+,,,,,110,-115,-115,110,,,,,110,B,
2,Joanne Laird,1972,Masters 2,F,Raw,ENG,England,126.5,84+,,,,,87.5,92.5,97.5,97.5,,,,,97.5,B,
3,Elaine Jackson #2,1969,Masters 2,F,Raw,ENG,England,116.3,84+,,,,,70,77.5,82.5,82.5,,,,,82.5,B,
4,Takhelmayum Lena Devl,1969,Masters 2,F,Raw,IND,India,86.55,84+,,,,,30,40,,40,,,,,40,B,
DQ,Angela Lauder,1970,Masters 2,F,Raw,SCO,Scotland,88.15,84+,,,,,-77.5,-77.5,-82.5,-77.5,,,,,,B,
1,Trish Muldrock,1954,Masters 3,F,Raw,NZL,New Zealand,45.9,47,,,,,55,60,-62.5,60,,,,,60,B,
1,Catherine Menzies,1960,Masters 3,F,Raw,NZL,New Zealand,55.9,57,,,,,55,61,64,64,,,,,64,B,
1,Judith McGauley,1948,Masters 4,F,Raw,ENG,England,48.35,52,,,,,30,32.5,-35,32.5,,,,,32.5,B,
1,Chingkhuleima Devi Kh,1948,Masters 4,F,Raw,IND,India,74.8,76,,,,,25,,,25,,,,,25,B,
1,Sudha Kumari,1979,Open,F,Single-ply,IND,India,62.15,63,,,,,90,102.5,110,110,,,,,110,B,
1,Megan Leighton,1996,Open,F,Single-ply,RSA,South Africa,65,69,,,,,-110,110,113,113,,,,,113,B,
1,Danielle Reid-Clavelle,1992,Open,F,Single-ply,CAN,Canada,75.45,76,,,,,115.5,122,123,123,,,,,123,B,
1,Krity Raj Singh,2005,Sub-Juniors,F,Single-ply,IND,India,55.5,57,,,,,40,55,60,60,,,,,60,B,
1,Reshieal Roshni Monteiro,2005,Sub-Juniors,F,Single-ply,IND,India,106.7,84+,,,,,80,90,-100,90,,,,,90,B,
1,Pratheeksha G. Naik,2000,Juniors,F,Single-ply,IND,India,82.95,84,,,,,95,100,105,105,,,,,105,B,
1,Dutt Chatterjee Sima,1977,Masters 1,F,Single-ply,IND,India,62.95,63,,,,,-62.5,62.5,-67.5,62.5,,,,,62.5,B,
1,Amudha Suganthi B,1982,Masters 1,F,Single-ply,IND,India,63.8,69,,,,,60,65,-70,65,,,,,65,B,
1,Kelly Clark #1,1964,Masters 2,F,Single-ply,ENG,England,66.05,69,,,,,60,-65,-65,60,,,,,60,B,
1,Kangabam Manikhombi Devi,1970,Masters 2,F,Single-ply,IND,India,75.65,76,,,,,-30,-30,32.5,32.5,,,,,32.5,B,
1,Takhelmayum Lena Devi,1969,Masters 2,F,Single-ply,IND,India,87.5,84+,,,,,40,47.5,57.5,57.5,,,,,57.5,B,
1,Chingkhuleima Devi Kh,1948,Masters 4,F,Single-ply,IND,India,75.75,76,,,,,25,,,25,,,,,25,B,
