Place,Name,Sex,Event,Division,WeightClassKg,Equipment,BirthYear,State,BodyweightKg,Squat1Kg,Squat2Kg,Squat3Kg,Best3SquatKg,Bench1Kg,Bench2Kg,Bench3Kg,Best3BenchKg,Deadlift1Kg,Deadlift2Kg,Deadlift3Kg,Best3DeadliftKg,TotalKg,Age,BirthDate
1,Abigail Ramsey,F,SBD,F-HS,48,Single-ply,2004,WI,47.9,90,-100,105,105,37.5,40,42.5,42.5,75,82.5,90,90,237.5,,
1,Brooklyn Mazzuca,F,SBD,F-HS,52,Single-ply,2006,WI,50.8,110,-117.5,-117.5,110,55,60,65,65,110,-117.5,120,120,295,,
2,Margaret Durand,F,SBD,F-HS,52,Single-ply,2004,WI,50.2,100,110,117.5,117.5,47.5,52.5,57.5,57.5,100,110,117.5,117.5,292.5,,
1,Sophia Kovnesky,F,SBD,F-HS,56,Single-ply,2004,WI,55.7,115,120,125,125,47.5,50,52.5,52.5,110,117.5,125,125,302.5,,
2,Hanah Seehafer,F,SBD,F-HS,56,Single-ply,2006,WI,55.75,100,110,115,115,40,-50,50,50,115,122.5,-140,122.5,287.5,,
3,Abbey Kelley,F,SBD,F-HS,56,Single-ply,2006,WI,53.8,102.5,-112.5,112.5,112.5,52.5,57.5,-65,57.5,100,-110,-110,100,270,,
4,Ava Boulware,F,SBD,F-HS,56,Single-ply,2005,WI,55.35,102.5,-112.5,-112.5,102.5,37.5,42.5,-47.5,42.5,102.5,-112.5,-112.5,102.5,247.5,,
1,Abigail Schuerman,F,SBD,F-HS,60,Single-ply,2004,WI,59.4,137.5,150,155,155,60,85,87.5,87.5,137.5,150,-155,150,392.5,,
2,Molly Wysocky,F,SBD,F-HS,60,Single-ply,2005,WI,58.4,115,122.5,127.5,127.5,57.5,60,-62.5,60,115,120,-127.5,120,307.5,,
3,Elizabeth Kroll,F,SBD,F-HS,60,Single-ply,2007,WI,58.9,102.5,112.5,120,120,55,62.5,-67.5,62.5,102.5,112.5,-125,112.5,295,,
1,Abigail Hoelzel,F,SBD,F-HS,75,Single-ply,2005,WI,74.2,-135,135,145,145,55,57.5,60,60,132.5,140,-145,140,345,,
2,Emily Mohs,F,SBD,F-HS,75,Single-ply,2005,WI,69.3,120,130,-137.5,130,55,60,-65,60,122.5,135,-150,135,325,,
3,Bri Rice,F,SBD,F-HS,75,Single-ply,2005,WI,74.3,120,125,130,130,52.5,55,57.5,57.5,122.5,130,-140,130,317.5,,
1,Chloe Cooper,F,SBD,F-HS,90,Single-ply,2004,WI,85.6,170,175,180,180,-85,90,95,95,135,140,145,145,420,,
2,Avery Dunlap,F,SBD,F-HS,90,Single-ply,2005,WI,88.9,150,162.5,-170,162.5,95,-100,-105,95,132.5,145,-165,145,402.5,,
3,Abi Kreger,F,SBD,F-HS,90,Single-ply,2004,WI,89.6,-157.5,157.5,-162.5,157.5,70,75,-80,75,140,145,-152.5,145,377.5,,
1,Arabella Gelhaar,F,SBD,F-HS,100+,Single-ply,2005,WI,106.2,170,-177.5,177.5,177.5,97.5,-102.5,102.5,102.5,147.5,160,-172.5,160,440,,
1,Angelina Battige,F,SBD,F-HS,67.5,Single-ply,2004,WI,64.15,190,205,215,215,97.5,112.5,125,125,190,205,-215,205,545,,
2,Avery Anderson #1,F,SBD,F-HS,67.5,Single-ply,2004,WI,64.6,-135,137.5,142.5,142.5,65,-72.5,-72.5,65,125,137.5,142.5,142.5,350,,
3,Julia Sherman,F,SBD,F-HS,67.5,Single-ply,2003,WI,64.65,125,135,-140,135,57.5,65,-72.5,65,117.5,127.5,-132.5,127.5,327.5,,
1,Annika Yang,F,SBD,FR-T1,44,Raw,2007,WI,43.6,65,72.5,80,80,32.5,37.5,-40,37.5,75,82.5,-87.5,82.5,200,,
2,Madeline Anderson,F,SBD,FR-T1,44,Raw,2007,WI,35.2,50,-55,55,55,27.5,30,-32.5,30,65,70,-77.5,70,155,,
DQ,Ava Mattson,F,SBD,FR-T1,44,Raw,2006,WI,42.9,-57.5,-65,-65,,30,-32.5,-32.5,30,70,75,-82.5,75,,,
1,Emma Donahue,F,SBD,FR-T1,48,Raw,2006,WI,47.4,75,82.5,-87.5,82.5,35,37.5,-40,37.5,97.5,105,-112.5,105,225,,
2,Hailey Kamphuis,F,SBD,FR-T1,48,Raw,2006,WI,46.2,70,75,80,80,37.5,40,42.5,42.5,85,90,95,95,217.5,,
3,Lyla Stecker,F,SBD,FR-T1,48,Raw,2006,WI,46,67.5,75,-80,75,27.5,32.5,-35,32.5,95,102.5,105,105,212.5,,
4,Delilah Werner,F,SBD,FR-T1,48,Raw,2007,WI,46.6,72.5,77.5,80,80,32.5,35,37.5,37.5,90,-95,-95,90,207.5,,
5,Amber Guardado-Velazco,F,SBD,FR-T1,48,Raw,2007,WI,47.2,70,75,-80,75,30,32.5,-35,32.5,82.5,87.5,92.5,92.5,200,,
6,Aaliyah Moelter,F,SBD,FR-T1,48,Raw,2006,WI,45.5,-55,67.5,-72.5,67.5,32.5,37.5,-42.5,37.5,85,-92.5,-95,85,190,,
7,Anna Coates,F,SBD,FR-T1,48,Raw,2006,WI,46,62.5,67.5,70,70,30,32.5,-35,32.5,77.5,85,-92.5,85,187.5,,
8,Kenadie Balthazor,F,SBD,FR-T1,48,Raw,2006,WI,46.75,60,65,70,70,-32.5,32.5,35,35,82.5,-87.5,-87.5,82.5,187.5,,
9,Hazel Robles,F,SBD,FR-T1,48,Raw,2006,WI,46.05,57.5,60,62.5,62.5,25,27.5,-30,27.5,80,85,90,90,180,,
10,Ella Huempfner,F,SBD,FR-T1,48,Raw,2007,WI,47.2,65,-70,-70,65,-35,-37.5,37.5,37.5,62.5,-67.5,67.5,67.5,170,,
11,Kelsey Forsythe,F,SBD,FR-T1,48,Raw,2007,WI,46.4,52.5,57.5,-62.5,57.5,30,-32.5,-32.5,30,70,77.5,-87.5,77.5,165,,
DQ,Adele Schilling,F,SBD,FR-T1,48,Raw,2007,WI,46.5,62.5,65,-67.5,65,40,42.5,45,45,-80,-80,-80,,,,
1,Siri Yuhas,F,SBD,FR-T1,52,Raw,2006,WI,50.6,80,85,90,90,47.5,50,-52.5,50,120,130,-132.5,130,270,,
2,Katelyn Doehrmann,F,SBD,FR-T1,52,Raw,2006,WI,50.7,85,90,95,95,50,-52.5,-52.5,50,112.5,117.5,125,125,270,,
3,Lanie Mallmann,F,SBD,FR-T1,52,Raw,2006,WI,49.1,75,80,-82.5,80,40,45,-47.5,45,105,112.5,125,125,250,,
4,Lauren Jansen,F,SBD,FR-T1,52,Raw,2006,WI,49,97.5,102.5,107.5,107.5,-50,50,-52.5,50,-90,-90,90,90,247.5,,
5,Hannah LaGesse,F,SBD,FR-T1,52,Raw,2006,WI,50.95,-85,85,-90,85,45,-50,-50,45,90,102.5,107.5,107.5,237.5,,
6,Payton Waidelich,F,SBD,FR-T1,52,Raw,2006,WI,50.85,72.5,77.5,82.5,82.5,37.5,40,42.5,42.5,72.5,77.5,82.5,82.5,207.5,,
7,Brianna Ankerson,F,SBD,FR-T1,52,Raw,2007,WI,51.05,65,72.5,-77.5,72.5,35,37.5,40,40,87.5,95,-97.5,95,207.5,,
8,Jenna Wiitanen,F,SBD,FR-T1,52,Raw,2006,WI,51.4,57.5,65,-67.5,65,30,32.5,35,35,90,102.5,-105,102.5,202.5,,
9,Sabrina Aune,F,SBD,FR-T1,52,Raw,2007,WI,50.9,67.5,72.5,75,75,40,42.5,45,45,70,77.5,-90,77.5,197.5,,
1,Anastasia Mujwid,F,SBD,FR-T1,56,Raw,2006,WI,54.33,85,87.5,90,90,45,47.5,52.5,52.5,90,97.5,102.5,102.5,245,,
2,Ella Klein,F,SBD,FR-T1,56,Raw,2006,WI,53.8,90,95,-100,95,42.5,45,-47.5,45,102.5,-112.5,-112.5,102.5,242.5,,
3,Cassie Cruz,F,SBD,FR-T1,56,Raw,2007,WI,52.5,67.5,75,-80,75,32.5,35,-37.5,35,100,110,112.5,112.5,222.5,,
4,Adie Paulson,F,SBD,FR-T1,56,Raw,2006,WI,53.9,65,70,-75,70,40,42.5,45,45,95,102.5,107.5,107.5,222.5,,
5,Lydia Schaal,F,SBD,FR-T1,56,Raw,2007,WI,54.95,-75,77.5,82.5,82.5,45,-47.5,-47.5,45,90,95,-100,95,222.5,,
6,Kailie Westphal,F,SBD,FR-T1,56,Raw,2007,WI,53.5,75,80,-85,80,37.5,40,42.5,42.5,-97.5,-97.5,97.5,97.5,220,,
7,Kate Heiderscheit,F,SBD,FR-T1,56,Raw,2006,WI,55.3,72.5,-80,-80,72.5,47.5,50,-52.5,50,85,-90,-90,85,207.5,,
1,Melody Rich,F,SBD,FR-T1,60,Raw,2006,WI,58.8,77.5,92.5,-95,92.5,37.5,42.5,-45,42.5,92.5,105,112.5,112.5,247.5,,
2,Greyson Plaski,F,SBD,FR-T1,60,Raw,2006,WI,59.65,72.5,-80,82.5,82.5,40,45,-47.5,45,105,110,117.5,117.5,245,,
3,Lainey Thur,F,SBD,FR-T1,60,Raw,2006,WI,59.9,75,80,-85,80,42.5,-47.5,-47.5,42.5,105,107.5,-117.5,107.5,230,,
4,Ashtyn Powers,F,SBD,FR-T1,60,Raw,2007,WI,58.6,-70,-70,70,70,35,37.5,40,40,102.5,-107.5,107.5,107.5,217.5,,
DQ,Hannah Heinen,F,SBD,FR-T1,60,Raw,2007,WI,58.1,102.5,105,-110,105,42.5,45,-52.5,45,-107.5,-110,-110,,,,
1,Ava Meyer,F,SBD,FR-T1,75,Raw,2006,WI,72.9,112.5,122.5,-130,122.5,47.5,50,52.5,52.5,130,140,147.5,147.5,322.5,,
2,Rachel Anderson #3,F,SBD,FR-T1,75,Raw,2007,WI,72.4,122.5,127.5,-130,127.5,-65,65,70,70,122.5,-127.5,-127.5,122.5,320,,
3,Deryn Coppernoll,F,SBD,FR-T1,75,Raw,2006,WI,70.5,102.5,-110,110,110,42.5,-47.5,-47.5,42.5,102.5,-115,-115,102.5,255,,
1,Faith Bonse,F,SBD,FR-T1,90,Raw,2006,WI,85.6,92.5,105,115,115,47.5,52.5,-55,52.5,125,135,-140,135,302.5,,
2,Brianna Cook,F,SBD,FR-T1,90,Raw,2006,WI,87.3,-92.5,-97.5,97.5,97.5,-42.5,-47.5,47.5,47.5,115,120,127.5,127.5,272.5,,
3,Kyden Turner,F,SBD,FR-T1,90,Raw,2006,WI,89.4,100,-107.5,-107.5,100,-47.5,50,-52.5,50,97.5,102.5,107.5,107.5,257.5,,
4,Addyson Neumann,F,SBD,FR-T1,90,Raw,2006,WI,85,92.5,-100,100,100,37.5,-42.5,-42.5,37.5,110,117.5,-125,117.5,255,,
1,Ariana Rodriguez,F,SBD,FR-T1,100,Raw,2006,WI,94.3,100,107.5,115,115,55,-60,-60,55,135,147.5,152.5,152.5,322.5,,
2,Addisyn Suhsen,F,SBD,FR-T1,100,Raw,2006,WI,96.7,85,97.5,105,105,52.5,60,-65,60,122.5,-142.5,-142.5,122.5,287.5,,
3,Aubrey Lehman,F,SBD,FR-T1,100,Raw,2006,WI,93.9,-97.5,97.5,102.5,102.5,55,-57.5,-57.5,55,100,105,112.5,112.5,270,,
1,Charlee Schroeder,F,SBD,FR-T1,100+,Raw,2006,WI,110.8,130,-137.5,-145,130,65,72.5,-80,72.5,142.5,-150,-155,142.5,345,,
2,Addison Griffiths,F,SBD,FR-T1,100+,Raw,2006,WI,103.6,105,110,117.5,117.5,70,-75,75,75,127.5,-135,137.5,137.5,330,,
3,Daytona Hensley,F,SBD,FR-T1,100+,Raw,2007,WI,103.6,132.5,140,145,145,57.5,-60,-60,57.5,115,122.5,-127.5,122.5,325,,
4,Abigail Hagen-Bade,F,SBD,FR-T1,100+,Raw,2007,WI,124.1,-90,-95,95,95,50,52.5,57.5,57.5,-127.5,135,142.5,142.5,295,,
5,Chloe Borchert,F,SBD,FR-T1,100+,Raw,2007,WI,111.6,67.5,80,92.5,92.5,42.5,47.5,-55,47.5,107.5,122.5,137.5,137.5,277.5,,
DQ,Hannah Peters,F,SBD,FR-T1,100+,Raw,2006,WI,104.6,110,117.5,-120,117.5,45,47.5,50,50,-115,-115,-115,,,,
1,Gwen Marso,F,SBD,FR-T1,67.5,Raw,2006,WI,63.85,105,110,-115,110,60,62.5,65,65,105,110,-112.5,110,285,,
2,Lily Lindus,F,SBD,FR-T1,67.5,Raw,2006,WI,65.7,-87.5,87.5,92.5,92.5,42.5,45,47.5,47.5,125,-132.5,132.5,132.5,272.5,,
3,Brianna Meyer,F,SBD,FR-T1,67.5,Raw,2007,WI,60.2,80,-85,-85,80,50,-52.5,-52.5,50,97.5,100,-102.5,100,230,,
DQ,Lydia Stowers,F,SBD,FR-T1,67.5,Raw,2006,WI,67.1,-110,-110,-110,,55,57.5,-60,57.5,110,115,-120,115,,,
1,Myah Wenzel,F,SBD,FR-T1,82.5,Raw,2006,WI,79.9,117.5,125,-130,125,52.5,55,57.5,57.5,132.5,142.5,150,150,332.5,,
2,Caroline Hensel,F,SBD,FR-T1,82.5,Raw,2006,WI,77,92.5,102.5,-107.5,102.5,52.5,57.5,-60,57.5,115,125,135,135,295,,
3,Morgan Iverson,F,SBD,FR-T1,82.5,Raw,2006,WI,76.1,97.5,-102.5,-102.5,97.5,55,-60,-60,55,125,132.5,-142.5,132.5,285,,
4,Sophia Lipp,F,SBD,FR-T1,82.5,Raw,2007,WI,81.5,80,90,102.5,102.5,47.5,52.5,57.5,57.5,90,107.5,117.5,117.5,277.5,,
5,Greta Anderson,F,SBD,FR-T1,82.5,Raw,2006,WI,80.6,102.5,110,115,115,45,50,-52.5,50,100,107.5,-112.5,107.5,272.5,,
6,Lily Harmon,F,SBD,FR-T1,82.5,Raw,2006,WI,80.3,85,92.5,97.5,97.5,47.5,52.5,-55,52.5,102.5,-107.5,-107.5,102.5,252.5,,
7,Abbie Johnson,F,SBD,FR-T1,82.5,Raw,2006,WI,81.1,90,-95,95,95,40,42.5,45,45,112.5,-117.5,-117.5,112.5,252.5,,
DQ,Iris Harlow,F,SBD,FR-T1,82.5,Raw,2006,WI,76.8,80,85,87.5,87.5,47.5,50,-52.5,50,-122.5,-122.5,-122.5,,,,
1,Elli Coulter,F,SBD,FR-T2,44,Raw,2004,WI,42.8,-72.5,72.5,77.5,77.5,37.5,40,42.5,42.5,77.5,-82.5,-82.5,77.5,197.5,,
2,Andrea Laehn,F,SBD,FR-T2,44,Raw,2005,WI,41.5,75,-82.5,-82.5,75,30,32.5,35,35,75,-82.5,-90,75,185,,
1,Julia Jansen,F,SBD,FR-T2,48,Raw,2005,WI,46.7,97.5,100,102.5,102.5,42.5,45,-47.5,45,100,-105,-105,100,247.5,,
2,Emma Forst,F,SBD,FR-T2,48,Raw,2004,WI,46.4,80,87.5,-92.5,87.5,47.5,-52.5,-52.5,47.5,95,102.5,-107.5,102.5,237.5,,
3,Elizabeth Anderson,F,SBD,FR-T2,48,Raw,2004,WI,46.45,47.5,55,-60,55,37.5,42.5,-47.5,42.5,85,92.5,100,100,197.5,,
4,Lydia Stys,F,SBD,FR-T2,48,Raw,2005,WI,47.9,55,60,-67.5,60,25,30,-35,30,70,75,-77.5,75,165,,
1,Rylee Ladd,F,SBD,FR-T2,52,Raw,2004,WI,51.1,82.5,95,97.5,97.5,57.5,62.5,67.5,67.5,117.5,125,-130,125,290,,
2,Jessica Haggerty,F,SBD,FR-T2,52,Raw,2005,WI,50.8,77.5,85,90,90,60,65,67.5,67.5,95,100,105,105,262.5,,
3,Carley Evers,F,SBD,FR-T2,52,Raw,2005,WI,51.05,67.5,-72.5,-72.5,67.5,40,-45,-45,40,110,117.5,-120,117.5,225,,
4,Ayessa Garcia,F,SBD,FR-T2,52,Raw,2005,WI,51.1,80,92.5,-102.5,92.5,30,35,-40,35,82.5,97.5,-105,97.5,225,,
5,Piper Mendez,F,SBD,FR-T2,52,Raw,2005,WI,51.2,82.5,-87.5,-87.5,82.5,40,42.5,45,45,85,90,95,95,222.5,,
6,Annie Dean,F,SBD,FR-T2,52,Raw,2005,WI,50.2,65,70,-75,70,42.5,45,-47.5,45,95,100,-102.5,100,215,,
DQ,Bethany Kroll,F,SBD,FR-T2,52,Raw,2005,WI,49.55,-62.5,-67.5,-67.5,,37.5,45,-50,45,80,92.5,-102.5,92.5,,,
1,Sierra Braund,F,SBD,FR-T2,56,Raw,2004,WI,53.95,97.5,105,110,110,50,52.5,55,55,130,-142.5,-142.5,130,295,,
2,Anna Strand,F,SBD,FR-T2,56,Raw,2004,WI,56,90,-97.5,100,100,57.5,60,62.5,62.5,120,130,-147.5,130,292.5,,
3,Emma Bohman,F,SBD,FR-T2,56,Raw,2005,WI,55.25,95,-100,-100,95,42.5,47.5,-50,47.5,135,142.5,145,145,287.5,,
4,Kylie VanDong,F,SBD,FR-T2,56,Raw,2005,WI,55.55,80,-87.5,90,90,55,60,-62.5,60,125,137.5,-142.5,137.5,287.5,,
5,Morgyn Hallum,F,SBD,FR-T2,56,Raw,2004,WI,55.9,105,115,-120,115,47.5,-50,-50,47.5,107.5,117.5,125,125,287.5,,
6,Ashley Wisnefske,F,SBD,FR-T2,56,Raw,2004,WI,54,97.5,102.5,-105,102.5,-57.5,57.5,-60,57.5,125,-135,-135,125,285,,
7,Elizabeth Pizarro,F,SBD,FR-T2,56,Raw,2004,WI,54.85,92.5,100,107.5,107.5,55,-57.5,-57.5,55,97.5,107.5,115,115,277.5,,
8,Rebecca Vanhoof,F,SBD,FR-T2,56,Raw,2004,WI,55.1,87.5,95,-97.5,95,45,50,-52.5,50,102.5,112.5,122.5,122.5,267.5,,
9,Kristin Denny,F,SBD,FR-T2,56,Raw,2005,WI,53.9,95,-100,-107.5,95,42.5,45,50,50,120,-130,-130,120,265,,
10,Mercedes Hay,F,SBD,FR-T2,56,Raw,2004,WI,54.4,82.5,87.5,92.5,92.5,52.5,-57.5,57.5,57.5,105,112.5,-120,112.5,262.5,,
11,Jada Thompson,F,SBD,FR-T2,56,Raw,2005,WI,55.95,75,82.5,87.5,87.5,42.5,-47.5,-47.5,42.5,105,112.5,115,115,245,,
12,Gabriella Ruback,F,SBD,FR-T2,56,Raw,2004,WI,55.7,67.5,77.5,82.5,82.5,52.5,57.5,-60,57.5,87.5,97.5,102.5,102.5,242.5,,
13,Claire Bohman,F,SBD,FR-T2,56,Raw,2005,WI,55.2,82.5,85,87.5,87.5,47.5,50,-52.5,50,95,102.5,-107.5,102.5,240,,
14,Faith DeLapp,F,SBD,FR-T2,56,Raw,2004,WI,55.2,77.5,87.5,90,90,45,50,52.5,52.5,80,90,-95,90,232.5,,
15,Jacqueline Tremblay,F,SBD,FR-T2,56,Raw,2004,WI,55.3,70,-82.5,-85,70,40,-47.5,-47.5,40,112.5,122.5,-137.5,122.5,232.5,,
16,Isabelle Hansch,F,SBD,FR-T2,56,Raw,2005,WI,55.95,80,85,-87.5,85,45,52.5,-55,52.5,90,95,-100,95,232.5,,
17,Madelyn Robel,F,SBD,FR-T2,56,Raw,2004,WI,55.2,72.5,80,-85,80,42.5,45,-47.5,45,-92.5,97.5,102.5,102.5,227.5,,
18,Evelyn Colombo,F,SBD,FR-T2,56,Raw,2004,WI,55.9,80,-85,-85,80,37.5,40,-42.5,40,-105,105,-115,105,225,,
19,Brianna Wilman,F,SBD,FR-T2,56,Raw,2005,WI,55.3,85,90,-100,90,37.5,-40,-40,37.5,75,87.5,-92.5,87.5,215,,
1,Chloe Suchomel,F,SBD,FR-T2,60,Raw,2005,WI,58.6,105,112.5,117.5,117.5,75,82.5,87.5,87.5,145,150,155,155,360,,
2,Alyssa Kwarciany,F,SBD,FR-T2,60,Raw,2004,WI,58.95,122.5,127.5,-132.5,127.5,70,-72.5,72.5,72.5,140,142.5,-145,142.5,342.5,,
3,Greta Aberle,F,SBD,FR-T2,60,Raw,2004,WI,57.9,-115,117.5,125,125,55,60,-62.5,60,135,150,152.5,152.5,337.5,,
4,Chloe Nielsen,F,SBD,FR-T2,60,Raw,2005,WI,57.95,95,-100,100,100,52.5,55,-57.5,55,127.5,137.5,142.5,142.5,297.5,,
5,Carly Keesler,F,SBD,FR-T2,60,Raw,2005,WI,57.95,90,97.5,102.5,102.5,47.5,52.5,55,55,107.5,117.5,125,125,282.5,,
6,Libby Dahl,F,SBD,FR-T2,60,Raw,2004,WI,59.7,87.5,-95,95,95,55,-60,60,60,125,-137.5,-140,125,280,,
7,Elise Moon,F,SBD,FR-T2,60,Raw,2004,WI,58.45,97.5,-105,105,105,50,55,57.5,57.5,97.5,107.5,115,115,277.5,,
8,Jaiden Schroeder,F,SBD,FR-T2,60,Raw,2005,WI,58.4,-92.5,92.5,95,95,50,55,-60,55,112.5,120,-130,120,270,,
9,Berit Gilbertson,F,SBD,FR-T2,60,Raw,2005,WI,58.6,87.5,-95,97.5,97.5,50,55,-57.5,55,97.5,102.5,110,110,262.5,,
10,Shelby Wiederin,F,SBD,FR-T2,60,Raw,2005,WI,57.4,80,85,-92.5,85,50,57.5,60,60,112.5,-122.5,-122.5,112.5,257.5,,
11,Jada Johnson,F,SBD,FR-T2,60,Raw,2004,WI,59,82.5,90,-92.5,90,52.5,-57.5,-57.5,52.5,102.5,107.5,115,115,257.5,,
12,Aleah Jensen,F,SBD,FR-T2,60,Raw,2004,WI,59.1,95,-100,100,100,55,-57.5,57.5,57.5,100,-110,-110,100,257.5,,
13,Ella Morenzien,F,SBD,FR-T2,60,Raw,2005,WI,59.1,85,-90,-92.5,85,52.5,-55,-55,52.5,107.5,-115,-115,107.5,245,,
14,Lexi Lehman,F,SBD,FR-T2,60,Raw,2004,WI,58.75,-90,-90,90,90,42.5,45,47.5,47.5,87.5,95,100,100,237.5,,
15,Payton Merth,F,SBD,FR-T2,60,Raw,2005,WI,59.95,-77.5,-82.5,90,90,40,45,-50,45,102.5,-125,-127.5,102.5,237.5,,
16,Mia Amador,F,SBD,FR-T2,60,Raw,2004,WI,58.5,87.5,92.5,-97.5,92.5,45,-50,-50,45,95,-102.5,-102.5,95,232.5,,
17,Abigael Webber,F,SBD,FR-T2,60,Raw,2005,WI,59,67.5,72.5,75,75,47.5,-50,-50,47.5,107.5,110,-115,110,232.5,,
18,Veronica Much,F,SBD,FR-T2,60,Raw,2005,WI,59.1,-82.5,82.5,85,85,40,42.5,-45,42.5,97.5,-102.5,102.5,102.5,230,,
19,Erika Rosario,F,SBD,FR-T2,60,Raw,2005,WI,56.15,80,82.5,87.5,87.5,35,-37.5,-37.5,35,90,102.5,-105,102.5,225,,
20,Grace Gilhousen,F,SBD,FR-T2,60,Raw,2005,WI,58.65,77.5,85,-90,85,37.5,40,-42.5,40,-90,90,-105,90,215,,
21,Keileigh Doll,F,SBD,FR-T2,60,Raw,2006,WI,57.1,65,72.5,-80,72.5,30,35,-40,35,97.5,-110,-120,97.5,205,,
DQ,Jesslyn Graf,F,SBD,FR-T2,60,Raw,2005,WI,59.8,-85,-85,-85,,45,-50,50,50,100,-107.5,-107.5,100,,,
1,Nevaeh Noonan,F,SBD,FR-T2,75,Raw,2005,WI,72.2,115,-127.5,127.5,127.5,57.5,62.5,-65,62.5,-155,155,160,160,350,,
2,Morgan Harwood,F,SBD,FR-T2,75,Raw,2005,WI,70.9,115,-125,125,125,52.5,57.5,60,60,142.5,152.5,160,160,345,,
3,Lahaela Mika,F,SBD,FR-T2,75,Raw,2005,WI,73.8,102.5,120,-125,120,80,85,-87.5,85,115,127.5,132.5,132.5,337.5,,
4,Marista Fraley,F,SBD,FR-T2,75,Raw,2005,WI,69.5,105,112.5,-117.5,112.5,57.5,62.5,-65,62.5,132.5,140,147.5,147.5,322.5,,
5,Lillian Lisko,F,SBD,FR-T2,75,Raw,2005,WI,70.9,127.5,-137.5,-137.5,127.5,57.5,60,-62.5,60,115,120,125,125,312.5,,
6,Angelina Salvino,F,SBD,FR-T2,75,Raw,2004,WI,73.45,105,115,-117.5,115,55,60,62.5,62.5,132.5,-145,-145,132.5,310,,
7,Hailey Tackman,F,SBD,FR-T2,75,Raw,2006,WI,70.9,110,120,125,125,42.5,-50,50,50,110,127.5,-130,127.5,302.5,,
8,Kara Edington,F,SBD,FR-T2,75,Raw,2004,WI,72.3,115,120,-125,120,52.5,55,-57.5,55,122.5,-130,-130,122.5,297.5,,
9,Hayden Wihlm,F,SBD,FR-T2,75,Raw,2005,WI,72.8,95,102.5,107.5,107.5,50,-52.5,-52.5,50,130,-137.5,-145,130,287.5,,
10,Hannah Person,F,SBD,FR-T2,75,Raw,2005,WI,71.65,82.5,90,97.5,97.5,52.5,57.5,60,60,125,127.5,-135,127.5,285,,
11,Paige Bielinski,F,SBD,FR-T2,75,Raw,2004,WI,68.45,92.5,97.5,-105,97.5,50,-55,55,55,105,117.5,127.5,127.5,280,,
12,Olivia Olson,F,SBD,FR-T2,75,Raw,2004,WI,74.3,90,97.5,102.5,102.5,50,52.5,55,55,115,122.5,,122.5,280,,
13,Addison Cegielski,F,SBD,FR-T2,75,Raw,2006,WI,72.8,97.5,102.5,-107.5,102.5,35,37.5,-40,37.5,-125,125,137.5,137.5,277.5,,
14,Brianna Yenter,F,SBD,FR-T2,75,Raw,2005,WI,71.8,92.5,97.5,-100,97.5,52.5,55,-60,55,115,120,-125,120,272.5,,
15,Katie Weins,F,SBD,FR-T2,75,Raw,2004,WI,70.4,75,82.5,87.5,87.5,42.5,47.5,-52.5,47.5,125,135,-140,135,270,,
16,Logan Felker,F,SBD,FR-T2,75,Raw,2004,WI,72.5,80,90,-95,90,45,50,52.5,52.5,102.5,127.5,-135,127.5,270,,
17,Ivanna Felts,F,SBD,FR-T2,75,Raw,2004,WI,69.5,92.5,100,-105,100,42.5,47.5,-50,47.5,107.5,-115,115,115,262.5,,
18,Ellie Euler,F,SBD,FR-T2,75,Raw,2006,WI,73.2,97.5,-110,-110,97.5,42.5,45,47.5,47.5,102.5,-110,-110,102.5,247.5,,
1,Hannah Alexander #2,F,SBD,FR-T2,90,Raw,2004,WI,88.8,140,145,150,150,75,77.5,-80,77.5,155,160,165,165,392.5,,
2,Piper Alberg,F,SBD,FR-T2,90,Raw,2005,WI,84.5,122.5,135,145,145,65,70,72.5,72.5,137.5,150,-157.5,150,367.5,,
3,Ace Gniot,F,SBD,FR-T2,90,Raw,2004,WI,88.9,112.5,115,-117.5,115,47.5,52.5,55,55,125,130,-132.5,130,300,,
4,Rylie Trams,F,SBD,FR-T2,90,Raw,2004,WI,89.4,-105,105,-115,105,52.5,-55,-55,52.5,112.5,122.5,127.5,127.5,285,,
5,Kaitlin Elder,F,SBD,FR-T2,90,Raw,2004,WI,85.7,-102.5,102.5,-110,102.5,45,-50,-52.5,45,110,117.5,-122.5,117.5,265,,
6,Grace Blegen,F,SBD,FR-T2,90,Raw,2006,WI,87.5,87.5,92.5,-97.5,92.5,40,-45,-45,40,117.5,-130,-130,117.5,250,,
1,Teagan Pahl,F,SBD,FR-T2,100,Raw,2004,WI,92.6,137.5,147.5,152.5,152.5,60,65,-67.5,65,150,-167.5,-185,150,367.5,,
2,Erika Stencil,F,SBD,FR-T2,100,Raw,2005,WI,98.8,102.5,115,120,120,67.5,75,-77.5,75,130,-137.5,137.5,137.5,332.5,,
3,Chelsey Yang,F,SBD,FR-T2,100,Raw,2005,WI,94.3,107.5,115,122.5,122.5,42.5,47.5,-52.5,47.5,127.5,-135,135,135,305,,
4,Magdalen Patzner,F,SBD,FR-T2,100,Raw,2004,WI,94.1,95,102.5,-112.5,102.5,45,55,-60,55,107.5,117.5,125,125,282.5,,
5,Kaydance Bikowski,F,SBD,FR-T2,100,Raw,2005,WI,95,102.5,115,-117.5,115,45,-52.5,-52.5,45,87.5,107.5,115,115,275,,
6,Sabrina Line,F,SBD,FR-T2,100,Raw,2004,WI,98.8,92.5,-97.5,-97.5,92.5,45,-52.5,-52.5,45,125,132.5,-140,132.5,270,,
1,Elizabeth Cleveland,F,SBD,FR-T2,100+,Raw,2004,WI,105.3,160,170,-175,170,65,72.5,-80,72.5,162.5,175,182.5,182.5,425,,
2,Madison Newman,F,SBD,FR-T2,100+,Raw,2004,WI,111.2,162.5,170,177.5,177.5,75,-80,-80,75,152.5,157.5,-165,157.5,410,,
3,Allison Cook,F,SBD,FR-T2,100+,Raw,2005,WI,123.1,135,150,-157.5,150,67.5,77.5,-82.5,77.5,145,-155,155,155,382.5,,
4,Lily Fintak,F,SBD,FR-T2,100+,Raw,2005,WI,125.8,142.5,147.5,152.5,152.5,65,-72.5,-72.5,65,147.5,155,-167.5,155,372.5,,
5,Abigail Murphy,F,SBD,FR-T2,100+,Raw,2005,WI,112.8,117.5,125,135,135,57.5,62.5,65,65,125,137.5,155,155,355,,
6,Camren Hericks,F,SBD,FR-T2,100+,Raw,2005,WI,115.4,82.5,102.5,115,115,75,80,-85,80,-125,137.5,-155,137.5,332.5,,
7,Sydney Layland,F,SBD,FR-T2,100+,Raw,2004,WI,110.7,100,120,125,125,60,65,70,70,120,-132.5,132.5,132.5,327.5,,
8,Kennedy Shane,F,SBD,FR-T2,100+,Raw,2005,WI,111,102.5,-120,125,125,50,-57.5,-57.5,50,130,140,150,150,325,,
9,Raeann Lehman,F,SBD,FR-T2,100+,Raw,2004,WI,104.2,-102.5,102.5,125,125,50,-52.5,52.5,52.5,125,137.5,-150,137.5,315,,
10,Callie Zastrow,F,SBD,FR-T2,100+,Raw,2004,WI,101.6,110,115,120,120,60,-62.5,-62.5,60,117.5,122.5,127.5,127.5,307.5,,
11,Katie Swanson,F,SBD,FR-T2,100+,Raw,2005,WI,110.9,110,-115,115,115,52.5,55,57.5,57.5,-115,115,-120,115,287.5,,
12,Yaritza Sanchez-Walker,F,SBD,FR-T2,100+,Raw,2005,WI,102.5,85,92.5,97.5,97.5,45,50,-52.5,50,125,132.5,-140,132.5,280,,
13,Courtney Johnson,F,SBD,FR-T2,100+,Raw,2004,WI,126.5,82.5,90,100,100,52.5,57.5,-62.5,57.5,107.5,120,-140,120,277.5,,
DQ,Skylar Olson,F,SBD,FR-T2,100+,Raw,2005,WI,100.1,112.5,117.5,125,125,47.5,52.5,57.5,57.5,-122.5,-122.5,-122.5,,,,
1,Meghann Christian,F,SBD,FR-T2,67.5,Raw,2004,WI,66.9,105,112.5,-115,112.5,55,57.5,60,60,130,142.5,147.5,147.5,320,,
2,Lillian Kuske,F,SBD,FR-T2,67.5,Raw,2004,WI,64.1,87.5,97.5,-102.5,97.5,55,60,-62.5,60,127.5,137.5,142.5,142.5,300,,
3,Madison Gingras,F,SBD,FR-T2,67.5,Raw,2004,WI,65.55,100,110,-117.5,110,50,55,-60,55,120,-130,135,135,300,,
4,Nellie Dunlap,F,SBD,FR-T2,67.5,Raw,2005,WI,64.1,95,100,105,105,47.5,52.5,55,55,120,125,130,130,290,,
5,Alexandria McCourt,F,SBD,FR-T2,67.5,Raw,2004,WI,65.35,102.5,112.5,-115,112.5,42.5,47.5,-52.5,47.5,112.5,127.5,-132.5,127.5,287.5,,
6,Madyson Janichek,F,SBD,FR-T2,67.5,Raw,2005,WI,61.35,90,95,-100,95,60,65,-67.5,65,110,120,125,125,285,,
7,Brooke Halberg,F,SBD,FR-T2,67.5,Raw,2004,WI,65.35,105,-107.5,107.5,107.5,60,62.5,-65,62.5,-115,115,-122.5,115,285,,
8,Lakely Kloetzke,F,SBD,FR-T2,67.5,Raw,2005,WI,66.2,97.5,-102.5,102.5,102.5,50,52.5,55,55,112.5,125,-132.5,125,282.5,,
9,Ashley Benysek,F,SBD,FR-T2,67.5,Raw,2005,WI,67,87.5,-90,-90,87.5,50,52.5,-55,52.5,-130,135,140,140,280,,
10,Kyah Fischer,F,SBD,FR-T2,67.5,Raw,2004,WI,67.2,-92.5,92.5,-105,92.5,47.5,52.5,55,55,120,130,-140,130,277.5,,
11,Madelyn Pritzl,F,SBD,FR-T2,67.5,Raw,2004,WI,65.2,77.5,85,87.5,87.5,50,52.5,-55,52.5,122.5,132.5,-140,132.5,272.5,,
12,Megan DeLeasky,F,SBD,FR-T2,67.5,Raw,2005,WI,67.25,80,87.5,92.5,92.5,47.5,52.5,-57.5,52.5,110,125,127.5,127.5,272.5,,
13,Lauren Tears,F,SBD,FR-T2,67.5,Raw,2005,WI,65.6,85,90,-95,90,40,42.5,45,45,120,130,-137.5,130,265,,
14,Lee Da Yang,F,SBD,FR-T2,67.5,Raw,2005,WI,62.85,97.5,105,-112.5,105,42.5,45,47.5,47.5,87.5,100,110,110,262.5,,
15,Ruby Gerhard,F,SBD,FR-T2,67.5,Raw,2006,WI,65.6,85,92.5,-95,92.5,50,-55,-55,50,107.5,112.5,117.5,117.5,260,,
16,Ashley Ebben,F,SBD,FR-T2,67.5,Raw,2004,WI,65.9,85,95,-102.5,95,45,52.5,-57.5,52.5,102.5,107.5,-117.5,107.5,255,,
17,Lydia Falke,F,SBD,FR-T2,67.5,Raw,2005,WI,66,95,100,-105,100,45,47.5,-50,47.5,107.5,-112.5,-112.5,107.5,255,,
18,Kailyn Jackowick,F,SBD,FR-T2,67.5,Raw,2005,WI,66.9,-102.5,102.5,107.5,107.5,42.5,47.5,-50,47.5,85,92.5,97.5,97.5,252.5,,
19,Chloe Colombo,F,SBD,FR-T2,67.5,Raw,2005,WI,65.25,85,-92.5,-92.5,85,47.5,-52.5,-52.5,47.5,105,115,-125,115,247.5,,
DQ,Olivia Freiberg,F,SBD,FR-T2,67.5,Raw,2004,WI,64.35,-102.5,-112.5,-112.5,,52.5,55,-57.5,55,-120,,,,,,
DQ,Mariah Palmer,F,SBD,FR-T2,67.5,Raw,2004,WI,64.6,-102.5,-102.5,-102.5,,50,52.5,-55,52.5,117.5,-122.5,125,125,,,
DQ,Ella Schweiger,F,SBD,FR-T2,67.5,Raw,2004,WI,64.8,-95,-95,-95,,52.5,55,-57.5,55,115,125,-130,125,,,
1,Brooke Ruland,F,SBD,FR-T2,82.5,Raw,2004,WI,75.9,137.5,145,-150,145,65,72.5,-77.5,72.5,137.5,142.5,-147.5,142.5,360,,
2,Sabin Steinhoff,F,SBD,FR-T2,82.5,Raw,2004,WI,80.35,-127.5,127.5,135,135,55,-60,60,60,132.5,142.5,150,150,345,,
3,Olivia Hiltner,F,SBD,FR-T2,82.5,Raw,2005,WI,80.9,107.5,-120,-120,107.5,67.5,70,72.5,72.5,142.5,147.5,155,155,335,,
4,Elisabeth Anderson,F,SBD,FR-T2,82.5,Raw,2005,WI,78.4,-120,120,125,125,55,60,-62.5,60,125,130,137.5,137.5,322.5,,
5,Alissa Barthuly,F,SBD,FR-T2,82.5,Raw,2005,WI,80.9,107.5,112.5,117.5,117.5,55,57.5,-60,57.5,130,142.5,-150,142.5,317.5,,
6,Brianna Martin,F,SBD,FR-T2,82.5,Raw,2004,WI,77.4,105,-115,-120,105,50,52.5,55,55,135,-137.5,-137.5,135,295,,
7,Alexis Weight,F,SBD,FR-T2,82.5,Raw,2004,WI,79.2,95,105,110,110,47.5,52.5,-57.5,52.5,110,125,-135,125,287.5,,
8,Madisyn Fiebiger,F,SBD,FR-T2,82.5,Raw,2005,WI,78.3,102.5,-107.5,-107.5,102.5,45,47.5,50,50,130,-135,-135,130,282.5,,
9,Erin Perry,F,SBD,FR-T2,82.5,Raw,2004,WI,82.5,97.5,102.5,-107.5,102.5,47.5,50,-55,50,117.5,125,-130,125,277.5,,
10,Olivia Laughlin,F,SBD,FR-T2,82.5,Raw,2004,WI,76.9,90,97.5,-102.5,97.5,50,-55,-55,50,120,122.5,-125,122.5,270,,
11,Abigail Johnson,F,SBD,FR-T2,82.5,Raw,2004,WI,79.45,82.5,87.5,-97.5,87.5,57.5,60,62.5,62.5,102.5,107.5,115,115,265,,
12,Shelby Hennlich,F,SBD,FR-T2,82.5,Raw,2005,WI,80.7,87.5,92.5,-97.5,92.5,40,42.5,-45,42.5,112.5,-122.5,122.5,122.5,257.5,,
1,Supriya Kocyan,F,SBD,FR-T3,44,Raw,2002,WI,42,50,57.5,60,60,37.5,-40,40,40,80,87.5,97.5,97.5,197.5,,
1,Ariana Pinder,F,SBD,FR-T3,48,Raw,2003,WI,48,47.5,55,57.5,57.5,-35,37.5,-40,37.5,85,-95,97.5,97.5,192.5,,
1,Carly Crowell,F,SBD,FR-T3,52,Raw,2003,WI,50.4,65,70,77.5,77.5,32.5,35,-40,35,85,95,100,100,212.5,,
2,Lilly Higdon,F,SBD,FR-T3,52,Raw,2003,WI,49.95,65,-77.5,-80,65,35,40,-42.5,40,70,85,92.5,92.5,197.5,,
DQ,Elizabeth Schaal,F,SBD,FR-T3,52,Raw,2003,WI,51.75,-80,-82.5,-82.5,,47.5,-50,-50,47.5,125,-130,-140,125,,,
1,Megan Thurke,F,SBD,FR-T3,56,Raw,2003,WI,54.5,82.5,90,-100,90,50,55,-57.5,55,125,140,-145,140,285,,
2,Brooke LaPlount,F,SBD,FR-T3,56,Raw,2003,WI,54.4,102.5,-110,-117.5,102.5,57.5,62.5,-65,62.5,102.5,112.5,-125,112.5,277.5,,
3,Becca Much,F,SBD,FR-T3,56,Raw,2003,WI,55.35,85,-97.5,-102.5,85,45,47.5,-50,47.5,105,112.5,122.5,122.5,255,,
4,Karly Porter,F,SBD,FR-T3,56,Raw,2003,WI,54.75,82.5,85,90,90,37.5,40,42.5,42.5,110,115,120,120,252.5,,
1,Jaidyn McAlpine,F,SBD,FR-T3,60,Raw,2004,WI,57.8,-92.5,92.5,-97.5,92.5,47.5,-52.5,52.5,52.5,117.5,120,122.5,122.5,267.5,,
2,Ariana Meunier,F,SBD,FR-T3,60,Raw,2003,WI,58.25,80,85,90,90,50,55,57.5,57.5,112.5,-120,-120,112.5,260,,
3,Indira Jiardini,F,SBD,FR-T3,60,Raw,2004,WI,57.45,85,-90,90,90,47.5,50,-55,50,102.5,112.5,-120,112.5,252.5,,
1,Kenzie Calvillo,F,SBD,FR-T3,75,Raw,2004,WI,70,100,105,112.5,112.5,52.5,55,60,60,122.5,130,137.5,137.5,310,,
2,Abbigail Zeller,F,SBD,FR-T3,75,Raw,2004,WI,71.4,100,105,-107.5,105,62.5,65,-67.5,65,130,-140,-140,130,300,,
3,Maddie Stoltz,F,SBD,FR-T3,75,Raw,2004,WI,72.9,100,110,-117.5,110,50,52.5,-57.5,52.5,120,122.5,127.5,127.5,290,,
4,Kristen Patterson,F,SBD,FR-T3,75,Raw,2004,WI,73,95,100,102.5,102.5,55,-60,-60,55,122.5,127.5,132.5,132.5,290,,
5,Bianca Arndt,F,SBD,FR-T3,75,Raw,2004,WI,72,87.5,-92.5,100,100,52.5,55,-57.5,55,112.5,122.5,-132.5,122.5,277.5,,
6,Madison Lewis,F,SBD,FR-T3,75,Raw,2003,WI,72,-100,100,-102.5,100,52.5,55,-60,55,117.5,-122.5,-122.5,117.5,272.5,,
DQ,Aimee Patch,F,SBD,FR-T3,75,Raw,2004,WI,72.05,-112.5,-115,-115,,47.5,-50,-50,47.5,142.5,147.5,150,150,,,
1,Elizabeth Dimick,F,SBD,FR-T3,90,Raw,2003,WI,87.3,127.5,132.5,135,135,65,70,72.5,72.5,152.5,157.5,162.5,162.5,370,,
2,Brynn Hundt,F,SBD,FR-T3,90,Raw,2004,WI,83.7,102.5,107.5,-110,107.5,55,-60,-60,55,132.5,137.5,-140,137.5,300,,
1,Lillie Strege,F,SBD,FR-T3,100+,Raw,2004,WI,108.1,-105,105,117.5,117.5,55,57.5,60,60,110,-120,-120,110,287.5,,
2,Liliana Perez,F,SBD,FR-T3,100+,Raw,2003,WI,100.3,85,-95,105,105,-55,55,65,65,105,-125,-125,105,275,,
1,Hannah Stahmann,F,SBD,FR-T3,67.5,Raw,2003,WI,66.75,125,-130,130,130,62.5,67.5,-70,67.5,152.5,160,-177.5,160,357.5,,
2,Taylor Johnson #8,F,SBD,FR-T3,67.5,Raw,2003,WI,65.5,102.5,112.5,117.5,117.5,42.5,47.5,-50,47.5,125,135,140,140,305,,
3,Lea Connolly,F,SBD,FR-T3,67.5,Raw,2003,WI,64.95,105,110,-117.5,110,50,52.5,55,55,125,130,132.5,132.5,297.5,,
4,Shaye Jacobson,F,SBD,FR-T3,67.5,Raw,2003,WI,64.6,87.5,-92.5,92.5,92.5,40,42.5,45,45,115,-120,-120,115,252.5,,
DQ,Elaina Seeger,F,SBD,FR-T3,67.5,Raw,2004,WI,65.6,-105,-107.5,-107.5,,-70,70,-72.5,70,100,102.5,105,105,,,
1,Katherine Bettag,F,SBD,FR-T3,82.5,Raw,2003,WI,79,92.5,102.5,110,110,50,-57.5,-57.5,50,117.5,-130,130,130,290,,
2,Bradi Bell,F,SBD,FR-T3,82.5,Raw,2004,WI,77.7,82.5,90,92.5,92.5,40,42.5,-45,42.5,122.5,-137.5,-137.5,122.5,257.5,,
3,Leeann Buhl,F,SBD,FR-T3,82.5,Raw,2003,WI,79.45,-85,85,95,95,-40,45,-47.5,45,102.5,112.5,-120,112.5,252.5,,
1,Donovan Sinthasomphone,M,SBD,M-HS,60,Single-ply,2004,WI,58.7,150,-157.5,157.5,157.5,80,82.5,-87.5,82.5,170,177.5,-185,177.5,417.5,,
1,Matthew Nguyen,M,SBD,M-HS,75,Single-ply,2005,WI,73.5,190,195,197.5,197.5,100,105,-107.5,105,187.5,192.5,197.5,197.5,500,,
1,Logan Gillespie,M,SBD,M-HS,100,Single-ply,2005,WI,98.4,260,-277.5,-277.5,260,102.5,-142.5,-142.5,102.5,207.5,227.5,237.5,237.5,600,,
DQ,Brett Sacia,M,SBD,M-HS,110,Single-ply,2004,WI,108.75,250,-260,-265,250,-147.5,-147.5,-147.5,,-237.5,-237.5,-237.5,,,,
1,Brady Reusser,M,SBD,M-HS,125,Single-ply,2003,WI,115.45,-202.5,202.5,207.5,207.5,125,132.5,-137.5,132.5,202.5,207.5,217.5,217.5,557.5,,
1,Jacob Pemberton,M,SBD,M-HS,140,Single-ply,2005,WI,129.9,250,265,275,275,155,-162.5,-162.5,155,-227.5,227.5,-240,227.5,657.5,,
1,Dylan Sinthasomphone,M,SBD,M-HS,67.5,Single-ply,2004,WI,65.4,182.5,187.5,192.5,192.5,100,-107.5,107.5,107.5,180,185,-190,185,485,,
1,Jose Hernandez #37,M,SBD,M-HS,82.5,Single-ply,2003,WI,81.3,217.5,230,-245,230,105,112.5,120,120,217.5,227.5,235,235,585,,
2,Connor Riehl,M,SBD,M-HS,82.5,Single-ply,2005,WI,79.7,197.5,-205,-210,197.5,110,122.5,130,130,200,-205,-205,200,527.5,,
1,Muluken Rucks,M,SBD,MR-HS,52,Raw,2004,WI,51.3,-137.5,137.5,-155,137.5,72.5,77.5,82.5,82.5,145,157.5,165,165,385,,
2,Lukas Quinones,M,SBD,MR-HS,52,Raw,2005,WI,49.7,105,112.5,117.5,117.5,67.5,72.5,75,75,115,125,-130,125,317.5,,
3,Alex Duel,M,SBD,MR-HS,52,Raw,2006,WI,50.7,85,95,100,100,65,72.5,-77.5,72.5,125,137.5,140,140,312.5,,
4,Leo Luckert,M,SBD,MR-HS,52,Raw,2005,WI,51.2,92.5,-100,100,100,55,60,-62.5,60,130,142.5,147.5,147.5,307.5,,
5,Aiden Schleusner,M,SBD,MR-HS,52,Raw,2006,WI,50.85,-102.5,-107.5,115,115,42.5,47.5,-55,47.5,115,122.5,142.5,142.5,305,,
6,Trey Oswald,M,SBD,MR-HS,52,Raw,2005,WI,50.5,-95,102.5,-107.5,102.5,70,75,-77.5,75,-120,-125,125,125,302.5,,
7,Evan Cardoza,M,SBD,MR-HS,52,Raw,2007,WI,50.65,92.5,100,102.5,102.5,55,-60,-60,55,112.5,122.5,130,130,287.5,,
8,Bennett Scribner,M,SBD,MR-HS,52,Raw,2006,WI,51.4,97.5,102.5,107.5,107.5,52.5,57.5,-60,57.5,95,102.5,110,110,275,,
9,Isaac Johnson,M,SBD,MR-HS,52,Raw,2006,WI,50.6,72.5,82.5,-90,82.5,55,62.5,-67.5,62.5,105,115,-122.5,115,260,,
10,Dushaun LeGrand,M,SBD,MR-HS,52,Raw,2006,WI,51.8,75,-82.5,-82.5,75,55,62.5,65,65,95,105,110,110,250,,
11,Andy Flores,M,SBD,MR-HS,52,Raw,2007,WI,51.3,65,75,77.5,77.5,42.5,-50,-50,42.5,115,120,122.5,122.5,242.5,,
12,Giovanni Maccanelli,M,SBD,MR-HS,52,Raw,2007,WI,51.25,67.5,72.5,77.5,77.5,45,50,52.5,52.5,92.5,100,107.5,107.5,237.5,,
13,Gavin Boucher,M,SBD,MR-HS,52,Raw,2007,WI,51,57.5,70,75,75,42.5,-52.5,52.5,52.5,85,102.5,107.5,107.5,235,,
14,Garrett DeLong,M,SBD,MR-HS,52,Raw,2007,WI,44.9,-72.5,77.5,-85,77.5,45,50,-52.5,50,92.5,100,105,105,232.5,,
15,Brandon Manthey,M,SBD,MR-HS,52,Raw,2006,WI,49.1,75,85,-92.5,85,-42.5,42.5,-45,42.5,100,-112.5,-112.5,100,227.5,,
16,Mason Books,M,SBD,MR-HS,52,Raw,2007,WI,46.8,70,75,-82.5,75,35,37.5,-42.5,37.5,85,95,-100,95,207.5,,
1,James Castillo,M,SBD,MR-HS,56,Raw,2005,WI,54.2,137.5,145,-152.5,145,-90,90,-95,90,175,182.5,-192.5,182.5,417.5,,
2,Ty Anderson,M,SBD,MR-HS,56,Raw,2004,WI,55.1,97.5,105,110,110,55,60,62.5,62.5,145,155,167.5,167.5,340,,
3,Tylor Reed Fuenger,M,SBD,MR-HS,56,Raw,2005,WI,55.35,105,-112.5,115,115,70,-77.5,-77.5,70,125,142.5,155,155,340,,
4,Devin Balts,M,SBD,MR-HS,56,Raw,2004,WI,54.5,107.5,-115,120,120,60,65,-67.5,65,130,140,-150,140,325,,
5,Cody Duel,M,SBD,MR-HS,56,Raw,2004,WI,55.2,110,122.5,-132.5,122.5,70,75,77.5,77.5,102.5,120,-127.5,120,320,,
6,Carson Ramirez,M,SBD,MR-HS,56,Raw,2005,WI,54.6,100,110,-117.5,110,55,57.5,70,70,115,127.5,132.5,132.5,312.5,,
7,Matthew Bauer #3,M,SBD,MR-HS,56,Raw,2005,WI,55.5,-97.5,102.5,-107.5,102.5,55,60,-65,60,120,130,137.5,137.5,300,,
8,Carter Downs,M,SBD,MR-HS,56,Raw,2007,WI,55.2,87.5,95,100,100,47.5,52.5,-55,52.5,120,130,140,140,292.5,,
9,Carson Beier,M,SBD,MR-HS,56,Raw,2003,WI,55.35,87.5,92.5,-97.5,92.5,62.5,67.5,-70,67.5,-130,132.5,-160,132.5,292.5,,
10,Austin Howard,M,SBD,MR-HS,56,Raw,2003,WI,55.3,90,92.5,95,95,57.5,60,62.5,62.5,115,122.5,130,130,287.5,,
11,Gabe Fenton,M,SBD,MR-HS,56,Raw,2007,WI,55.7,92.5,100,-105,100,50,-52.5,52.5,52.5,120,130,-137.5,130,282.5,,
12,Michael Kelly,M,SBD,MR-HS,56,Raw,2007,WI,52.75,85,-92.5,-95,85,60,62.5,65,65,105,117.5,122.5,122.5,272.5,,
13,Keegan Werth,M,SBD,MR-HS,56,Raw,2005,WI,55.65,90,-95,95,95,42.5,45,-47.5,45,125,-130,130,130,270,,
14,Isaac Moe,M,SBD,MR-HS,56,Raw,2005,WI,55.2,87.5,95,100,100,42.5,-45,-45,42.5,107.5,117.5,-125,117.5,260,,
15,Blake Troxel,M,SBD,MR-HS,56,Raw,2004,WI,54.8,60,70,80,80,45,52.5,-57.5,52.5,105,115,125,125,257.5,,
16,Emiliano Romero,M,SBD,MR-HS,56,Raw,2005,WI,55.2,87.5,95,-102.5,95,45,-55,55,55,97.5,107.5,-115,107.5,257.5,,
17,Owen Pickart,M,SBD,MR-HS,56,Raw,2006,WI,55.3,85,-90,92.5,92.5,52.5,57.5,-60,57.5,105,-112.5,-112.5,105,255,,
DQ,William Driscoll,M,SBD,MR-HS,56,Raw,2005,WI,53.8,72.5,77.5,-82.5,77.5,65,-67.5,-67.5,65,-130,-130,-132.5,,,,
DQ,Teague Holzer,M,SBD,MR-HS,56,Raw,2005,WI,55.1,-100,-107.5,-107.5,,57.5,62.5,-65,62.5,132.5,-135,,132.5,,,
DQ,Rodrigo Echanove,M,SBD,MR-HS,56,Raw,2006,WI,55.65,-82.5,82.5,85,85,-57.5,-62.5,-62.5,,105,107.5,112.5,112.5,,,
1,Keanu Duel,M,SBD,MR-HS,60,Raw,2005,WI,59.2,-152.5,157.5,-165,157.5,62.5,70,-75,70,175,182.5,187.5,187.5,415,,
2,Joshua Rogers,M,SBD,MR-HS,60,Raw,2004,WI,59.3,137.5,147.5,152.5,152.5,95,-102.5,102.5,102.5,137.5,147.5,157.5,157.5,412.5,,
3,Connor Bubolz,M,SBD,MR-HS,60,Raw,2004,WI,58,130,152.5,-165,152.5,75,82.5,-85,82.5,140,157.5,175,175,410,,
4,Timothy Story,M,SBD,MR-HS,60,Raw,2005,WI,59.15,-132.5,140,-147.5,140,82.5,85,87.5,87.5,167.5,177.5,-185,177.5,405,,
5,Devon Tasker,M,SBD,MR-HS,60,Raw,2005,WI,58.9,110,122.5,130,130,95,100,102.5,102.5,142.5,152.5,-155,152.5,385,,
6,Carson Derringer,M,SBD,MR-HS,60,Raw,2005,WI,59,110,130,145,145,70,77.5,80,80,125,-152.5,152.5,152.5,377.5,,
7,Truman Leisses,M,SBD,MR-HS,60,Raw,2003,WI,59.9,120,125,-132.5,125,-85,85,-87.5,85,150,160,167.5,167.5,377.5,,
8,Matthew Hendrix,M,SBD,MR-HS,60,Raw,2004,WI,60,-115,130,-140,130,90,97.5,-102.5,97.5,132.5,142.5,147.5,147.5,375,,
9,Dave Domingo,M,SBD,MR-HS,60,Raw,2005,WI,58.7,130,135,140,140,70,72.5,-77.5,72.5,137.5,142.5,147.5,147.5,360,,
10,James McElroy,M,SBD,MR-HS,60,Raw,2007,WI,58.7,112.5,120,-127.5,120,72.5,77.5,-82.5,77.5,142.5,150,157.5,157.5,355,,
11,Cason Pederson,M,SBD,MR-HS,60,Raw,2003,WI,59.1,115,122.5,127.5,127.5,67.5,72.5,75,75,152.5,-165,-165,152.5,355,,
12,Francis Zeller,M,SBD,MR-HS,60,Raw,2005,WI,57.8,107.5,112.5,117.5,117.5,70,75,-77.5,75,142.5,147.5,155,155,347.5,,
13,Tyler McAndrew,M,SBD,MR-HS,60,Raw,2004,WI,59.05,120,-127.5,-127.5,120,60,62.5,65,65,147.5,155,162.5,162.5,347.5,,
14,Colin Stecker,M,SBD,MR-HS,60,Raw,2004,WI,59.4,110,127.5,-132.5,127.5,62.5,67.5,-72.5,67.5,135,145,-147.5,145,340,,
15,Gavin Armstrong,M,SBD,MR-HS,60,Raw,2006,WI,59,102.5,-122.5,122.5,122.5,60,67.5,-70,67.5,107.5,125,145,145,335,,
16,Payton Bongiovanni-Pitzen,M,SBD,MR-HS,60,Raw,2006,WI,57.8,92.5,-102.5,-102.5,92.5,70,75,-77.5,75,137.5,150,165,165,332.5,,
17,Brandon Trudell,M,SBD,MR-HS,60,Raw,2005,WI,59.7,92.5,-100,105,105,65,70,-77.5,70,142.5,150,157.5,157.5,332.5,,
18,Daniel Gordon,M,SBD,MR-HS,60,Raw,2004,WI,58.1,102.5,-110,-110,102.5,75,80,85,85,115,125,135,135,322.5,,
19,Emmanuel Gomez-Vivar,M,SBD,MR-HS,60,Raw,2004,WI,59.9,75,90,95,95,77.5,-82.5,-82.5,77.5,125,137.5,150,150,322.5,,
20,Cole Vargo,M,SBD,MR-HS,60,Raw,2004,WI,59.2,100,107.5,-112.5,107.5,60,67.5,-70,67.5,125,140,145,145,320,,
21,Ethan Landgreen,M,SBD,MR-HS,60,Raw,2004,WI,58.5,95,100,105,105,62.5,65,-67.5,65,125,135,142.5,142.5,312.5,,
22,Josh Braker,M,SBD,MR-HS,60,Raw,2006,WI,59.95,82.5,-90,90,90,57.5,60,67.5,67.5,135,-150,150,150,307.5,,
23,Alex Woodford,M,SBD,MR-HS,60,Raw,2004,WI,57.9,87.5,95,100,100,55,60,-65,60,132.5,145,-155,145,305,,
24,Micah Angelo,M,SBD,MR-HS,60,Raw,2004,WI,59.75,80,90,95,95,60,67.5,-72.5,67.5,142.5,-157.5,-162.5,142.5,305,,
25,Maxim Scheu,M,SBD,MR-HS,60,Raw,2004,WI,57.85,-92.5,-102.5,102.5,102.5,52.5,57.5,-62.5,57.5,120,125,135,135,295,,
DQ,Kevin Retzlaff,M,SBD,MR-HS,60,Raw,2005,WI,58.5,102.5,107.5,112.5,112.5,75,77.5,-82.5,77.5,-120,-120,-120,,,,
DQ,Eddie Oelhafen,M,SBD,MR-HS,60,Raw,2005,WI,59.7,-120,-130,-130,,77.5,-80,-85,77.5,125,135,142.5,142.5,,,
1,Brady Flasch,M,SBD,MR-HS,75,Raw,2003,WI,73.7,210,222.5,230,230,137.5,145,-150,145,247.5,260,272.5,272.5,647.5,,
2,Bryan Fura,M,SBD,MR-HS,75,Raw,2003,WI,71.6,165,175,182.5,182.5,105,112.5,117.5,117.5,192.5,202.5,210,210,510,,
3,Jack Smestad,M,SBD,MR-HS,75,Raw,2004,WI,74.55,165,175,-182.5,175,-117.5,120,-125,120,182.5,192.5,200,200,495,,
4,Braden Turner,M,SBD,MR-HS,75,Raw,2005,WI,73.4,160,170,180,180,110,115,120,120,180,190,-197.5,190,490,,
5,Ryan Courter,M,SBD,MR-HS,75,Raw,2004,WI,74.2,157.5,-167.5,-167.5,157.5,112.5,-120,-120,112.5,192.5,207.5,220,220,490,,
6,Rory Hemp,M,SBD,MR-HS,75,Raw,2004,WI,73.8,-170,170,177.5,177.5,92.5,95,102.5,102.5,205,-215,-215,205,485,,
7,Jeremiah Dye,M,SBD,MR-HS,75,Raw,2006,WI,70.85,140,155,167.5,167.5,90,95,100,100,190,212.5,-235,212.5,480,,
8,Kyle Germain,M,SBD,MR-HS,75,Raw,2005,WI,74.6,177.5,-185,185,185,95,100,105,105,172.5,180,187.5,187.5,477.5,,
9,Trey Barnes,M,SBD,MR-HS,75,Raw,2003,WI,73.6,150,160,-172.5,160,95,102.5,105,105,190,200,210,210,475,,
10,Cade Deal,M,SBD,MR-HS,75,Raw,2004,WI,74.2,167.5,175,-182.5,175,100,102.5,107.5,107.5,185,192.5,-202.5,192.5,475,,
11,Dane Tonkinson,M,SBD,MR-HS,75,Raw,2005,WI,73.4,170,-182.5,-182.5,170,95,100,102.5,102.5,185,200,-202.5,200,472.5,,
12,Jonpaul Rguig,M,SBD,MR-HS,75,Raw,2004,WI,69.85,157.5,-165,165,165,92.5,97.5,102.5,102.5,157.5,182.5,187.5,187.5,455,,
13,Nolan Mrotek,M,SBD,MR-HS,75,Raw,2004,WI,73.1,142.5,150,152.5,152.5,82.5,87.5,-90,87.5,190,207.5,-227.5,207.5,447.5,,
14,Chad Ketelsen,M,SBD,MR-HS,75,Raw,2003,WI,71.1,150,157.5,162.5,162.5,80,85,-90,85,180,187.5,197.5,197.5,445,,
15,Christian Germain,M,SBD,MR-HS,75,Raw,2004,WI,71.9,155,-162.5,162.5,162.5,90,95,97.5,97.5,170,177.5,185,185,445,,
16,Cole Pettersen,M,SBD,MR-HS,75,Raw,2004,WI,73.85,-160,162.5,-167.5,162.5,90,95,97.5,97.5,177.5,-185,185,185,445,,
17,Cale Campbell,M,SBD,MR-HS,75,Raw,2005,WI,74.3,140,150,-160,150,87.5,95,-100,95,167.5,172.5,200,200,445,,
18,Vincent Cardoza,M,SBD,MR-HS,75,Raw,2006,WI,74.55,140,150,162.5,162.5,80,85,87.5,87.5,182.5,195,-205,195,445,,
19,Kyle Haas,M,SBD,MR-HS,75,Raw,2004,WI,69.5,137.5,147.5,-152.5,147.5,75,82.5,85,85,187.5,200,210,210,442.5,,
20,Jack Thompson,M,SBD,MR-HS,75,Raw,2005,WI,71.9,147.5,157.5,-167.5,157.5,100,107.5,-112.5,107.5,165,172.5,177.5,177.5,442.5,,
21,Evan Matuszak,M,SBD,MR-HS,75,Raw,2005,WI,72.8,142.5,147.5,-152.5,147.5,87.5,92.5,95,95,185,192.5,197.5,197.5,440,,
22,William McDermott,M,SBD,MR-HS,75,Raw,2005,WI,74.4,150,-167.5,-167.5,150,85,-97.5,-97.5,85,190,205,-217.5,205,440,,
23,Wyatt Jordan,M,SBD,MR-HS,75,Raw,2004,WI,74.7,140,150,-152.5,150,97.5,105,110,110,170,180,-200,180,440,,
24,Dominic Duncan,M,SBD,MR-HS,75,Raw,2003,WI,74.5,147.5,155,160,160,80,-85,85,85,175,185,192.5,192.5,437.5,,
25,Carson Lund,M,SBD,MR-HS,75,Raw,2004,WI,71.1,142.5,152.5,160,160,90,95,97.5,97.5,160,-177.5,177.5,177.5,435,,
26,Ben Sackett,M,SBD,MR-HS,75,Raw,2005,WI,72.7,155,-167.5,-167.5,155,95,102.5,107.5,107.5,160,172.5,-182.5,172.5,435,,
27,Colten Pergande,M,SBD,MR-HS,75,Raw,2004,WI,73.95,132.5,-140,-140,132.5,107.5,112.5,-117.5,112.5,160,172.5,187.5,187.5,432.5,,
28,Parker Gerke,M,SBD,MR-HS,75,Raw,2003,WI,71.3,-140,142.5,-152.5,142.5,90,-95,-95,90,177.5,195,-207.5,195,427.5,,
29,Anthony Moelter,M,SBD,MR-HS,75,Raw,2005,WI,73.4,135,142.5,-152.5,142.5,87.5,90,95,95,182.5,190,-200,190,427.5,,
30,Ethan Cordero,M,SBD,MR-HS,75,Raw,2004,WI,71,132.5,142.5,150,150,72.5,77.5,80,80,180,190,195,195,425,,
31,Grant Hansen,M,SBD,MR-HS,75,Raw,2004,WI,73.8,130,140,150,150,80,87.5,-92.5,87.5,175,-182.5,185,185,422.5,,
32,Jay Meyer,M,SBD,MR-HS,75,Raw,2005,WI,74.95,137.5,150,162.5,162.5,87.5,92.5,97.5,97.5,162.5,-177.5,-185,162.5,422.5,,
33,Anthony Wagner,M,SBD,MR-HS,75,Raw,2003,WI,73.3,115,125,135,135,85,92.5,-97.5,92.5,165,182.5,192.5,192.5,420,,
34,Tyler Kingston,M,SBD,MR-HS,75,Raw,2004,WI,75,-132.5,-132.5,132.5,132.5,87.5,92.5,95,95,182.5,187.5,192.5,192.5,420,,
35,Asher Pecha,M,SBD,MR-HS,75,Raw,2006,WI,72.1,130,137.5,147.5,147.5,77.5,82.5,85,85,170,185,-192.5,185,417.5,,
36,Christopher Frommell,M,SBD,MR-HS,75,Raw,2005,WI,72.3,137.5,-145,145,145,90,95,-100,95,167.5,177.5,-182.5,177.5,417.5,,
37,Bowden Mitchell,M,SBD,MR-HS,75,Raw,2005,WI,72.5,-132.5,132.5,-147.5,132.5,90,95,-102.5,95,177.5,185,-190,185,412.5,,
38,Dillon Weber,M,SBD,MR-HS,75,Raw,2005,WI,71.7,125,-137.5,-137.5,125,105,110,112.5,112.5,167.5,172.5,-185,172.5,410,,
39,Evan McCormick,M,SBD,MR-HS,75,Raw,2006,WI,72.7,147.5,162.5,-170,162.5,70,75,82.5,82.5,160,-175,-175,160,405,,
40,Giancarlo Williams,M,SBD,MR-HS,75,Raw,2004,WI,73.4,115,125,132.5,132.5,80,87.5,92.5,92.5,170,175,180,180,405,,
41,Harrison Zipperer,M,SBD,MR-HS,75,Raw,2004,WI,74.2,122.5,127.5,-132.5,127.5,87.5,92.5,-95,92.5,170,185,-192.5,185,405,,
42,Skylar Lambert,M,SBD,MR-HS,75,Raw,2005,WI,67.75,125,137.5,145,145,85,95,97.5,97.5,160,-170,-170,160,402.5,,
43,Liam Miller,M,SBD,MR-HS,75,Raw,2004,WI,69.45,135,-162.5,-162.5,135,80,85,-97.5,85,175,182.5,-197.5,182.5,402.5,,
44,Conner Perry,M,SBD,MR-HS,75,Raw,2004,WI,72.6,132.5,-140,-140,132.5,82.5,85,-92.5,85,167.5,185,-190,185,402.5,,
45,Jack Nelson,M,SBD,MR-HS,75,Raw,2004,WI,71.9,125,-137.5,137.5,137.5,87.5,92.5,-97.5,92.5,160,170,-185,170,400,,
46,Collin Albrecht,M,SBD,MR-HS,75,Raw,2005,WI,73.2,-135,-135,135,135,82.5,87.5,90,90,162.5,175,-185,175,400,,
47,Baylee Jewell,M,SBD,MR-HS,75,Raw,2003,WI,74,-115,115,125,125,85,90,92.5,92.5,167.5,182.5,-192.5,182.5,400,,
48,Brandon Esser,M,SBD,MR-HS,75,Raw,2005,WI,74.3,132.5,145,-152.5,145,57.5,70,-75,70,185,-195,-195,185,400,,
49,Calvin Boone,M,SBD,MR-HS,75,Raw,2004,WI,74.2,-127.5,135,-142.5,135,90,95,-100,95,167.5,-182.5,-182.5,167.5,397.5,,
50,Ashton Campbell,M,SBD,MR-HS,75,Raw,2003,WI,72.6,115,125,-132.5,125,95,-102.5,-102.5,95,165,172.5,-182.5,172.5,392.5,,
51,Trysten Thiede,M,SBD,MR-HS,75,Raw,2005,WI,67.9,125,132.5,137.5,137.5,85,87.5,-90,87.5,147.5,157.5,165,165,390,,
52,Ty Felle,M,SBD,MR-HS,75,Raw,2006,WI,71.85,132.5,140,-150,140,72.5,77.5,-85,77.5,155,165,172.5,172.5,390,,
53,Jake Campbell,M,SBD,MR-HS,75,Raw,2006,WI,71.4,-135,-137.5,140,140,75,77.5,82.5,82.5,-157.5,157.5,-160,157.5,380,,
DQ,Preston Emerich,M,SBD,MR-HS,75,Raw,2004,WI,70.6,-137.5,-142.5,-145,,92.5,-97.5,97.5,97.5,182.5,-197.5,-197.5,182.5,,,
DQ,Luke Lawton,M,SBD,MR-HS,75,Raw,2005,WI,73.3,-152.5,-152.5,-157.5,,-97.5,97.5,-107.5,97.5,172.5,185,-192.5,185,,,
DQ,Gavin Sanchez,M,SBD,MR-HS,75,Raw,2004,WI,74.4,115,125,-130,125,-100,-100,-100,,175,-182.5,-182.5,175,,,
1,Mason Mitchell,M,SBD,MR-HS,90,Raw,2004,WI,89.7,220,235,240,240,152.5,162.5,167.5,167.5,227.5,267.5,275,275,682.5,,
2,Justin Blechinger,M,SBD,MR-HS,90,Raw,2003,WI,85.6,210,220,227.5,227.5,142.5,147.5,150,150,267.5,272.5,-297.5,272.5,650,,
3,Benjamin Buchholtz,M,SBD,MR-HS,90,Raw,2004,WI,83.8,207.5,217.5,227.5,227.5,120,132.5,135,135,215,227.5,235,235,597.5,,
4,Alex Thao,M,SBD,MR-HS,90,Raw,2004,WI,88.7,207.5,220,-230,220,117.5,127.5,132.5,132.5,207.5,222.5,242.5,242.5,595,,
5,Zach Wegner,M,SBD,MR-HS,90,Raw,2005,WI,88,207.5,215,220,220,137.5,145,-152.5,145,210,227.5,-235,227.5,592.5,,
6,Brody Visger,M,SBD,MR-HS,90,Raw,2006,WI,84.3,180,192.5,197.5,197.5,105,110,-115,110,207.5,220,227.5,227.5,535,,
7,Carter Christy,M,SBD,MR-HS,90,Raw,2006,WI,88.8,180,-192.5,-195,180,122.5,135,140,140,192.5,-215,215,215,535,,
8,Aaron Sellhausen,M,SBD,MR-HS,90,Raw,2004,WI,87.65,175,185,190,190,110,120,125,125,182.5,200,210,210,525,,
9,Ethan Shepard,M,SBD,MR-HS,90,Raw,2003,WI,85.6,170,185,-195,185,112.5,120,-127.5,120,197.5,215,-235,215,520,,
10,Gregory Ohman,M,SBD,MR-HS,90,Raw,2004,WI,89.4,180,-190,-192.5,180,105,112.5,120,120,190,202.5,215,215,515,,
11,Owen Haseleu,M,SBD,MR-HS,90,Raw,2005,WI,88.25,-192.5,192.5,-205,192.5,120,125,127.5,127.5,175,182.5,-185,182.5,502.5,,
12,Ryan York,M,SBD,MR-HS,90,Raw,2005,WI,89,-160,160,175,175,110,120,-127.5,120,190,202.5,207.5,207.5,502.5,,
13,David Bruce,M,SBD,MR-HS,90,Raw,2004,WI,86,155,165,170,170,107.5,115,117.5,117.5,187.5,200,212.5,212.5,500,,
14,Ryan Briggs,M,SBD,MR-HS,90,Raw,2003,WI,87.6,-167.5,-170,170,170,110,112.5,117.5,117.5,200,207.5,212.5,212.5,500,,
15,Zach Spittler,M,SBD,MR-HS,90,Raw,2003,WI,87.6,165,172.5,-177.5,172.5,-102.5,102.5,105,105,220,-230,-230,220,497.5,,
16,Jacob Berends,M,SBD,MR-HS,90,Raw,2005,WI,87.6,185,-197.5,-197.5,185,107.5,-115,-115,107.5,-197.5,197.5,202.5,202.5,495,,
17,Philip Ross,M,SBD,MR-HS,90,Raw,2004,WI,88.2,147.5,-170,170,170,92.5,-97.5,97.5,97.5,182.5,205,220,220,487.5,,
18,David Patocka,M,SBD,MR-HS,90,Raw,2003,WI,88,-170,-170,170,170,-100,100,102.5,102.5,205,-215,-215,205,477.5,,
19,Brayden Sandstrom,M,SBD,MR-HS,90,Raw,2005,WI,87.2,165,170,172.5,172.5,97.5,-102.5,102.5,102.5,200,-215,-215,200,475,,
20,Nathan Stark,M,SBD,MR-HS,90,Raw,2004,WI,87,-142.5,150,160,160,105,110,-115,110,187.5,197.5,200,200,470,,
21,Hunter Chenier,M,SBD,MR-HS,90,Raw,2004,WI,86.35,-160,-160,160,160,107.5,110,112.5,112.5,-190,192.5,195,195,467.5,,
22,Ben Ashbach,M,SBD,MR-HS,90,Raw,2004,WI,88.6,145,152.5,160,160,97.5,-105,-105,97.5,195,202.5,207.5,207.5,465,,
23,Troy Greenwold,M,SBD,MR-HS,90,Raw,2004,WI,88.4,-142.5,-142.5,142.5,142.5,102.5,110,120,120,185,192.5,197.5,197.5,460,,
24,Teddy Olson,M,SBD,MR-HS,90,Raw,2005,WI,86.85,150,-157.5,157.5,157.5,100,-105,105,105,170,177.5,190,190,452.5,,
25,AJ Holmgren,M,SBD,MR-HS,90,Raw,2004,WI,88.7,-135,135,-140,135,97.5,-102.5,-102.5,97.5,215,-225,-225,215,447.5,,
26,Hunter Tamulion,M,SBD,MR-HS,90,Raw,2003,WI,86.8,137.5,152.5,-155,152.5,-90,90,-95,90,192.5,202.5,-215,202.5,445,,
27,Adrik Einum,M,SBD,MR-HS,90,Raw,2004,WI,87.2,160,-167.5,-170,160,77.5,82.5,87.5,87.5,185,192.5,-205,192.5,440,,
28,Mark Steinlage,M,SBD,MR-HS,90,Raw,2004,WI,83.4,132.5,-152.5,-152.5,132.5,90,-92.5,-92.5,90,172.5,190,202.5,202.5,425,,
DQ,Brandon Freber,M,SBD,MR-HS,90,Raw,2004,WI,87.4,-175,175,182.5,182.5,-100,-100,-100,,200,-205,-205,200,,,
DQ,Caleb Nisbit,M,SBD,MR-HS,90,Raw,2004,WI,88.55,-160,-170,-170,,107.5,115,-122.5,115,170,180,190,190,,,
1,Ben Anhalt,M,SBD,MR-HS,100,Raw,2004,WI,92.85,202.5,217.5,-225,217.5,125,132.5,135,135,-245,245,255,255,607.5,,
2,Sean Hesse,M,SBD,MR-HS,100,Raw,2003,WI,91.65,-175,185,200,200,110,-120,120,120,245,260,-275,260,580,,
3,Harrison Gegenhuber,M,SBD,MR-HS,100,Raw,2004,WI,90.6,192.5,205,-220,205,120,-125,125,125,235,247.5,-262.5,247.5,577.5,,
4,Sarkis Buchaklian,M,SBD,MR-HS,100,Raw,2004,WI,92.65,192.5,200,207.5,207.5,135,142.5,147.5,147.5,205,215,222.5,222.5,577.5,,
5,Carson Delander,M,SBD,MR-HS,100,Raw,2004,WI,97.8,207.5,217.5,-225,217.5,115,120,-127.5,120,215,225,237.5,237.5,575,,
6,Keagan Christy,M,SBD,MR-HS,100,Raw,2003,WI,98.3,210,-225,225,225,120,130,-137.5,130,220,-237.5,-237.5,220,575,,
7,Mason Bruce,M,SBD,MR-HS,100,Raw,2005,WI,98.6,182.5,195,207.5,207.5,135,140,-145,140,202.5,-210,210,210,557.5,,
8,Maddox Schaaf,M,SBD,MR-HS,100,Raw,2003,WI,99.5,-205,210,-215,210,107.5,112.5,-117.5,112.5,-205,-210,212.5,212.5,535,,
9,Aidan Schlueter,M,SBD,MR-HS,100,Raw,2005,WI,96.2,142.5,165,170,170,97.5,107.5,-110,107.5,202.5,225,-235,225,502.5,,
10,Jack Blokhhuis,M,SBD,MR-HS,100,Raw,2004,WI,94.45,155,175,185,185,95,102.5,-107.5,102.5,185,202.5,212.5,212.5,500,,
11,Sam Scheer,M,SBD,MR-HS,100,Raw,2006,WI,94.65,155,167.5,-172.5,167.5,107.5,-112.5,112.5,112.5,197.5,215,-235,215,495,,
12,Francisco Lopez,M,SBD,MR-HS,100,Raw,2005,WI,98.9,182.5,190,200,200,-85,85,-92.5,85,195,202.5,-217.5,202.5,487.5,,
13,Elijah Gadbury,M,SBD,MR-HS,100,Raw,2004,WI,96.55,177.5,-182.5,182.5,182.5,97.5,-102.5,102.5,102.5,187.5,195,-207.5,195,480,,
14,Mitch Blokhuis,M,SBD,MR-HS,100,Raw,2004,WI,91.8,152.5,167.5,180,180,95,102.5,-107.5,102.5,175,187.5,195,195,477.5,,
15,Trevor Koegler,M,SBD,MR-HS,100,Raw,2004,WI,91.1,175,-185,-185,175,105,110,-115,110,177.5,182.5,190,190,475,,
16,Carter Kammes,M,SBD,MR-HS,100,Raw,2004,WI,96.3,162.5,170,-182.5,170,105,112.5,-117.5,112.5,192.5,-210,-210,192.5,475,,
17,Seth Kiekhaefer,M,SBD,MR-HS,100,Raw,2004,WI,97.65,162.5,167.5,172.5,172.5,-102.5,102.5,-105,102.5,197.5,-200,-200,197.5,472.5,,
18,Carter Martin,M,SBD,MR-HS,100,Raw,2003,WI,98.95,-170,170,185,185,92.5,97.5,102.5,102.5,170,185,-190,185,472.5,,
19,Isaac Stafne,M,SBD,MR-HS,100,Raw,2004,WI,95.1,170,177.5,-182.5,177.5,75,80,-85,80,210,-215,-215,210,467.5,,
20,Logan Crawford,M,SBD,MR-HS,100,Raw,2005,WI,98.2,-145,145,-182.5,145,105,-115,-115,105,185,-202.5,-202.5,185,435,,
21,Owen Brossman,M,SBD,MR-HS,100,Raw,2004,WI,93.95,-147.5,150,-152.5,150,72.5,-82.5,-82.5,72.5,185,-192.5,-192.5,185,407.5,,
DQ,Nick Lueck,M,SBD,MR-HS,100,Raw,2004,WI,90.4,-207.5,-220,-220,,115,-120,-120,115,212.5,217.5,-230,217.5,,,
1,Zack Roovers,M,SBD,MR-HS,110,Raw,2004,WI,107,227.5,242.5,252.5,252.5,150,162.5,-175,162.5,272.5,292.5,-305,292.5,707.5,,
2,Matthew Schraith,M,SBD,MR-HS,110,Raw,2003,WI,106.8,212.5,220,227.5,227.5,125,130,-132.5,130,265,272.5,280,280,637.5,,
3,Kolter Borge,M,SBD,MR-HS,110,Raw,2004,WI,105.75,220,-232.5,-232.5,220,125,135,-142.5,135,232.5,240,-250,240,595,,
4,Breken Turner,M,SBD,MR-HS,110,Raw,2004,WI,107.7,220,235,-242.5,235,117.5,130,-137.5,130,205,217.5,-227.5,217.5,582.5,,
5,Ariyo Sanyaolu,M,SBD,MR-HS,110,Raw,2005,WI,104.2,167.5,180,192.5,192.5,112.5,120,127.5,127.5,240,250,260,260,580,,
6,Braedy Picard,M,SBD,MR-HS,110,Raw,2004,WI,108.4,-217.5,232.5,-242.5,232.5,125,-135,-135,125,217.5,-220,222.5,222.5,580,,
7,Payton Roder,M,SBD,MR-HS,110,Raw,2005,WI,106.9,197.5,205,212.5,212.5,110,115,122.5,122.5,-220,225,240,240,575,,
8,Sam Stoeckmann,M,SBD,MR-HS,110,Raw,2004,WI,108.75,217.5,-225,-235,217.5,127.5,135,142.5,142.5,200,207.5,-222.5,207.5,567.5,,
9,Hunter Wiese,M,SBD,MR-HS,110,Raw,2003,WI,105.6,185,195,-205,195,135,-142.5,-142.5,135,-220,-220,220,220,550,,
10,Derek Bruce,M,SBD,MR-HS,110,Raw,2005,WI,108.2,-192.5,200,207.5,207.5,-107.5,107.5,115,115,197.5,207.5,215,215,537.5,,
11,Keagen Lemler,M,SBD,MR-HS,110,Raw,2003,WI,103.25,157.5,170,185,185,95,-107.5,107.5,107.5,197.5,215,237.5,237.5,530,,
12,Bryce Ruland,M,SBD,MR-HS,110,Raw,2006,WI,103.6,187.5,-205,-210,187.5,112.5,-122.5,-127.5,112.5,227.5,-242.5,-242.5,227.5,527.5,,
13,Raymond Waszak,M,SBD,MR-HS,110,Raw,2003,WI,109.5,160,-192.5,192.5,192.5,-97.5,110,-117.5,110,182.5,212.5,-227.5,212.5,515,,
14,Kobe Stinson,M,SBD,MR-HS,110,Raw,2005,WI,107.6,-182.5,200,-210,200,102.5,110,-115,110,182.5,200,-212.5,200,510,,
15,Carter Briski,M,SBD,MR-HS,110,Raw,2005,WI,108.2,-167.5,-175,175,175,92.5,100,105,105,-210,220,-227.5,220,500,,
16,Jake Brosig,M,SBD,MR-HS,110,Raw,2004,WI,103.7,175,182.5,190,190,87.5,92.5,-100,92.5,192.5,200,205,205,487.5,,
17,Dylyn Hiitola,M,SBD,MR-HS,110,Raw,2005,WI,109.1,182.5,200,207.5,207.5,97.5,105,-112.5,105,170,-182.5,-182.5,170,482.5,,
18,Eddie Flottmeyer,M,SBD,MR-HS,110,Raw,2004,WI,104.9,160,-180,180,180,92.5,100,-105,100,-187.5,200,-207.5,200,480,,
19,Noah Graglia,M,SBD,MR-HS,110,Raw,2005,WI,108.25,147.5,157.5,162.5,162.5,92.5,100,-105,100,192.5,212.5,-227.5,212.5,475,,
20,Chris Lavasseur,M,SBD,MR-HS,110,Raw,2005,WI,108.15,180,185,187.5,187.5,90,95,-97.5,95,185,-190,-192.5,185,467.5,,
21,Jaden Parks,M,SBD,MR-HS,110,Raw,2004,WI,102.5,157.5,160,-162.5,160,105,110,-117.5,110,182.5,190,-202.5,190,460,,
22,Jeffery Wojkiewicz,M,SBD,MR-HS,110,Raw,2004,WI,104.55,-152.5,157.5,-172.5,157.5,-85,85,90,90,182.5,-197.5,-197.5,182.5,430,,
DQ,Brennan Jolin,M,SBD,MR-HS,110,Raw,2003,WI,105.7,175,182.5,192.5,192.5,95,100,-105,100,-180,-180,-180,,,,
1,Luke German,M,SBD,MR-HS,125,Raw,2004,WI,119.4,262.5,282.5,,282.5,-160,160,175,175,230,-250,-250,230,687.5,,
2,Samuel Yager,M,SBD,MR-HS,125,Raw,2003,WI,122.2,215,225,232.5,232.5,130,137.5,142.5,142.5,237.5,247.5,267.5,267.5,642.5,,
3,Santino Lentini,M,SBD,MR-HS,125,Raw,2004,WI,122.6,227.5,-235,235,235,130,135,137.5,137.5,227.5,232.5,-252.5,232.5,605,,
4,Brennan Schmeling,M,SBD,MR-HS,125,Raw,2003,WI,122.55,220,-237.5,237.5,237.5,130,-145,-145,130,215,-225,-225,215,582.5,,
5,Elias Diaz,M,SBD,MR-HS,125,Raw,2006,WI,115.6,235,-255,-255,235,102.5,110,117.5,117.5,205,217.5,227.5,227.5,580,,
6,Zach Steffensen,M,SBD,MR-HS,125,Raw,2003,WI,122.2,200,212.5,220,220,120,-125,125,125,215,225,232.5,232.5,577.5,,
7,Wyatt Stellrecht,M,SBD,MR-HS,125,Raw,2006,WI,120.7,200,210,217.5,217.5,112.5,117.5,120,120,202.5,215,220,220,557.5,,
8,Dylan Wilke,M,SBD,MR-HS,125,Raw,2004,WI,114.65,197.5,215,-227.5,215,95,102.5,-110,102.5,227.5,232.5,235,235,552.5,,
9,Connor Akey,M,SBD,MR-HS,125,Raw,2004,WI,115.4,180,197.5,205,205,105,122.5,130,130,192.5,207.5,215,215,550,,
10,Sam Ross,M,SBD,MR-HS,125,Raw,2005,WI,117.7,192.5,205,220,220,115,-125,-125,115,-200,-210,215,215,550,,
11,Hayden Eades,M,SBD,MR-HS,125,Raw,2004,WI,123.5,207.5,217.5,-227.5,217.5,112.5,-117.5,-117.5,112.5,202.5,217.5,-250,217.5,547.5,,
12,Hunter Clark,M,SBD,MR-HS,125,Raw,2003,WI,119.7,172.5,190,200,200,102.5,110,-117.5,110,192.5,215,227.5,227.5,537.5,,
13,Case Balke,M,SBD,MR-HS,125,Raw,2004,WI,115.5,210,-220,-220,210,115,-117.5,-117.5,115,197.5,202.5,-205,202.5,527.5,,
14,Robby Kedrowicz,M,SBD,MR-HS,125,Raw,2007,WI,118.5,185,200,205,205,110,120,-127.5,120,-175,187.5,200,200,525,,
15,Varik Preuss,M,SBD,MR-HS,125,Raw,2003,WI,120.4,170,182.5,-192.5,182.5,125,135,140,140,185,202.5,-205,202.5,525,,
16,Mark Solberg,M,SBD,MR-HS,125,Raw,2004,WI,113.5,172.5,185,192.5,192.5,105,115,-120,115,185,197.5,212.5,212.5,520,,
17,Wyatt Christian,M,SBD,MR-HS,125,Raw,2005,WI,122.05,182.5,190,197.5,197.5,102.5,110,117.5,117.5,205,-217.5,-227.5,205,520,,
18,Shane White,M,SBD,MR-HS,125,Raw,2004,WI,117.9,160,172.5,185,185,102.5,112.5,-120,112.5,190,210,-227.5,210,507.5,,
19,Kaiden Fuhrman,M,SBD,MR-HS,125,Raw,2006,WI,122.5,170,175,182.5,182.5,105,112.5,117.5,117.5,185,197.5,202.5,202.5,502.5,,
20,Tyler Phelps,M,SBD,MR-HS,125,Raw,2004,WI,119.3,162.5,167.5,175,175,100,105,115,115,202.5,210,-227.5,210,500,,
21,Mark Porter,M,SBD,MR-HS,125,Raw,2003,WI,116.35,155,162.5,165,165,92.5,100,-102.5,100,210,227.5,-255,227.5,492.5,,
22,Ashton Greenwell,M,SBD,MR-HS,125,Raw,2004,WI,121.5,152.5,170,182.5,182.5,110,122.5,-127.5,122.5,107.5,-175,182.5,182.5,487.5,,
23,Jack Morawetz,M,SBD,MR-HS,125,Raw,2005,WI,122.4,145,167.5,170,170,95,107.5,-112.5,107.5,185,200,205,205,482.5,,
24,Andrew Peters #3,M,SBD,MR-HS,125,Raw,2004,WI,111.1,170,175,-182.5,175,95,100,102.5,102.5,200,-215,-215,200,477.5,,
25,Johnathan Mullenberg,M,SBD,MR-HS,125,Raw,2006,WI,123.5,162.5,167.5,175,175,115,122.5,-130,122.5,-167.5,167.5,-185,167.5,465,,
26,Edgar Basoria,M,SBD,MR-HS,125,Raw,2004,WI,124.45,170,185,-187.5,185,92.5,-97.5,-102.5,92.5,182.5,-187.5,187.5,187.5,465,,
1,Alex Pethan,M,SBD,MR-HS,140,Raw,2003,WI,137.45,227.5,235,-240,235,127.5,135,140,140,227.5,235,240,240,615,,
2,Charlie Hoitink,M,SBD,MR-HS,140,Raw,2006,WI,134.65,207.5,-227.5,-227.5,207.5,152.5,160,-165,160,227.5,-235,240,240,607.5,,
3,Marquis Cagle,M,SBD,MR-HS,140,Raw,2004,WI,131.25,215,-222.5,227.5,227.5,105,122.5,-132.5,122.5,230,240,-257.5,240,590,,
4,Soren Fuchs,M,SBD,MR-HS,140,Raw,2004,WI,130.28,190,200,-207.5,200,125,132.5,-140,132.5,-210,220,-227.5,220,552.5,,
5,Henry Haverty,M,SBD,MR-HS,140,Raw,2004,WI,138.2,165,177.5,190,190,92.5,97.5,-100,97.5,202.5,222.5,-232.5,222.5,510,,
6,Jacob Gross,M,SBD,MR-HS,140,Raw,2004,WI,139.7,177.5,187.5,192.5,192.5,97.5,102.5,107.5,107.5,200,207.5,-212.5,207.5,507.5,,
7,Eion Hinkle,M,SBD,MR-HS,140,Raw,2005,WI,128.65,165,175,185,185,75,80,82.5,82.5,210,220,227.5,227.5,495,,
DQ,William Koester,M,SBD,MR-HS,140,Raw,2004,WI,138.2,200,-227.5,-227.5,200,97.5,107.5,-112.5,107.5,-187.5,-217.5,-217.5,,,,
1,Jacob Regan,M,SBD,MR-HS,140+,Raw,2004,WI,146.45,250,272.5,,272.5,142.5,-147.5,-147.5,142.5,267.5,302.5,-317.5,302.5,717.5,,
2,Jordan Puente,M,SBD,MR-HS,140+,Raw,2005,WI,160.3,247.5,252.5,-260,252.5,127.5,135,-137.5,135,-235,235,-240,235,622.5,,
3,Carter Nielsen,M,SBD,MR-HS,140+,Raw,2005,WI,158.45,-220,-220,220,220,125,132.5,-135,132.5,227.5,240,-257.5,240,592.5,,
4,Daniel Trempala II,M,SBD,MR-HS,140+,Raw,2004,WI,146.7,210,225,-235,225,97.5,105,110,110,210,225,-240,225,560,,
5,Gordon Langer,M,SBD,MR-HS,140+,Raw,2004,WI,158.9,-192.5,192.5,222.5,222.5,110,117.5,122.5,122.5,215,-235,-240,215,560,,
6,Aiden Rossa,M,SBD,MR-HS,140+,Raw,2004,WI,146.65,175,185,195,195,122.5,127.5,132.5,132.5,202.5,-215,220,220,547.5,,
7,Mitch Sullivan,M,SBD,MR-HS,140+,Raw,2004,WI,154.5,177.5,190,-202.5,190,102.5,-112.5,112.5,112.5,200,212.5,-225,212.5,515,,
8,Tom Hartl,M,SBD,MR-HS,140+,Raw,2003,WI,149.8,142.5,-155,155,155,100,105,107.5,107.5,177.5,-192.5,192.5,192.5,455,,
1,Brady Oleszak,M,SBD,MR-HS,67.5,Raw,2003,WI,66.2,167.5,175,182.5,182.5,95,100,-102.5,100,205,217.5,220,220,502.5,,
2,Jacob Bartelt,M,SBD,MR-HS,67.5,Raw,2004,WI,66.2,167.5,172.5,-182.5,172.5,102.5,110,112.5,112.5,205,215,-217.5,215,500,,
3,Keegan Saloka,M,SBD,MR-HS,67.5,Raw,2005,WI,65.2,147.5,162.5,-167.5,162.5,102.5,110,-112.5,110,177.5,187.5,-200,187.5,460,,
4,Brett Heinz,M,SBD,MR-HS,67.5,Raw,2005,WI,65.6,150,155,160,160,92.5,97.5,-102.5,97.5,175,185,200,200,457.5,,
5,Quentin Berhow,M,SBD,MR-HS,67.5,Raw,2004,WI,65.3,152.5,160,165,165,92.5,97.5,100,100,185,-190,-190,185,450,,
6,Lee Ericksen,M,SBD,MR-HS,67.5,Raw,2006,WI,66.5,160,167.5,-172.5,167.5,97.5,102.5,107.5,107.5,155,162.5,167.5,167.5,442.5,,
7,Matthew Slechta,M,SBD,MR-HS,67.5,Raw,2004,WI,63.4,147.5,160,-165,160,82.5,92.5,95,95,160,175,-177.5,175,430,,
8,Jacob Champion,M,SBD,MR-HS,67.5,Raw,2003,WI,65.65,-147.5,-147.5,147.5,147.5,82.5,87.5,90,90,177.5,-190,192.5,192.5,430,,
9,Leobardo Vargas,M,SBD,MR-HS,67.5,Raw,2003,WI,64.9,145,-152.5,-152.5,145,85,92.5,-95,92.5,177.5,185,190,190,427.5,,
10,Kruse Yuhas,M,SBD,MR-HS,67.5,Raw,2005,WI,66.5,120,127.5,132.5,132.5,92.5,100,107.5,107.5,155,172.5,180,180,420,,
11,Dayne Laney,M,SBD,MR-HS,67.5,Raw,2006,WI,65.1,130,140,-147.5,140,80,85,90,90,165,180,-192.5,180,410,,
12,Miles Burke,M,SBD,MR-HS,67.5,Raw,2006,WI,67,-147.5,147.5,155,155,75,77.5,-80,77.5,170,177.5,-190,177.5,410,,
13,Mason Levezow,M,SBD,MR-HS,67.5,Raw,2005,WI,64.9,147.5,155,-160,155,85,-92.5,-92.5,85,167.5,-175,-175,167.5,407.5,,
14,Evan Piche,M,SBD,MR-HS,67.5,Raw,2005,WI,65.5,142.5,-150,150,150,72.5,-170,-170,72.5,165,-185,185,185,407.5,,
15,Connor Sharpe,M,SBD,MR-HS,67.5,Raw,2004,WI,66,125,132.5,-140,132.5,92.5,97.5,102.5,102.5,160,172.5,-185,172.5,407.5,,
16,Sam Volkman,M,SBD,MR-HS,67.5,Raw,2005,WI,65.8,120,130,137.5,137.5,87.5,92.5,-97.5,92.5,155,165,175,175,405,,
17,Jacob San Miguel,M,SBD,MR-HS,67.5,Raw,2004,WI,67.1,-152.5,-155,155,155,82.5,85,-90,85,-165,-165,165,165,405,,
18,Damien Bell,M,SBD,MR-HS,67.5,Raw,2005,WI,66.65,117.5,127.5,132.5,132.5,92.5,97.5,100,100,137.5,160,170,170,402.5,,
19,Liam Vandezande,M,SBD,MR-HS,67.5,Raw,2004,WI,66.8,145,-152.5,-152.5,145,90,-95,-95,90,162.5,167.5,-175,167.5,402.5,,
20,Zander Barr,M,SBD,MR-HS,67.5,Raw,2004,WI,64.6,120,127.5,-130,127.5,77.5,80,85,85,175,185,-190,185,397.5,,
21,Parker Coach,M,SBD,MR-HS,67.5,Raw,2004,WI,65.05,115,122.5,-132.5,122.5,85,90,-92.5,90,160,170,182.5,182.5,395,,
22,Kevin Halvorson,M,SBD,MR-HS,67.5,Raw,2003,WI,65.5,127.5,137.5,-145,137.5,65,67.5,70,70,145,175,187.5,187.5,395,,
23,Grant Conlin,M,SBD,MR-HS,67.5,Raw,2004,WI,67,135,-140,-142.5,135,65,70,75,75,165,182.5,-187.5,182.5,392.5,,
24,Braedon Pederson,M,SBD,MR-HS,67.5,Raw,2003,WI,64.6,125,135,145,145,75,80,-85,80,145,155,165,165,390,,
25,Leonardo Rangel,M,SBD,MR-HS,67.5,Raw,2006,WI,65.3,130,145,-155,145,92.5,95,97.5,97.5,125,145,-162.5,145,387.5,,
26,Brody Harvey,M,SBD,MR-HS,67.5,Raw,2005,WI,64.25,127.5,135,140,140,82.5,85,-90,85,152.5,160,-162.5,160,385,,
27,Gavin Shepard,M,SBD,MR-HS,67.5,Raw,2007,WI,65.65,135,142.5,-150,142.5,77.5,82.5,-87.5,82.5,152.5,157.5,-182.5,157.5,382.5,,
28,William Kamphuis,M,SBD,MR-HS,67.5,Raw,2004,WI,65,135,142.5,-147.5,142.5,-62.5,62.5,67.5,67.5,-165,165,170,170,380,,
29,Drayden Hannan,M,SBD,MR-HS,67.5,Raw,2007,WI,65.7,112.5,125,130,130,82.5,87.5,-92.5,87.5,147.5,157.5,162.5,162.5,380,,
30,Jake Ulwelling,M,SBD,MR-HS,67.5,Raw,2006,WI,66,135,140,142.5,142.5,70,-72.5,72.5,72.5,160,165,-167.5,165,380,,
31,Quinton Lumsden,M,SBD,MR-HS,67.5,Raw,2006,WI,65.05,112.5,132.5,-142.5,132.5,77.5,82.5,-85,82.5,-150,157.5,162.5,162.5,377.5,,
32,Levi Atkins,M,SBD,MR-HS,67.5,Raw,2005,WI,65.95,152.5,-160,-160,152.5,82.5,87.5,-90,87.5,135,-147.5,-147.5,135,375,,
33,Prestin Brunette,M,SBD,MR-HS,67.5,Raw,2004,WI,66.1,120,-125,-125,120,70,75,77.5,77.5,177.5,-185,-185,177.5,375,,
34,Brock Foley,M,SBD,MR-HS,67.5,Raw,2006,WI,64.7,-115,-115,115,115,92.5,97.5,-102.5,97.5,130,-160,160,160,372.5,,
35,Jacob Anderson,M,SBD,MR-HS,67.5,Raw,2005,WI,66.9,130,137.5,-145,137.5,65,72.5,77.5,77.5,147.5,157.5,-187.5,157.5,372.5,,
36,Corbin Rossner,M,SBD,MR-HS,67.5,Raw,2005,WI,65.9,122.5,-132.5,-132.5,122.5,85,90,-95,90,142.5,155,-160,155,367.5,,
37,Jorge Pena,M,SBD,MR-HS,67.5,Raw,2005,WI,66,-125,125,-132.5,125,72.5,-77.5,-77.5,72.5,142.5,-150,-150,142.5,340,,
38,Colten Aune,M,SBD,MR-HS,67.5,Raw,2004,WI,64.85,120,-125,-125,120,75,80,-87.5,80,125,137.5,-140,137.5,337.5,,
DQ,Leandro Rios,M,SBD,MR-HS,67.5,Raw,2006,WI,64.3,-142.5,-145,-145,,75,-77.5,-77.5,75,170,-177.5,-177.5,170,,,
DQ,Alex Lester,M,SBD,MR-HS,67.5,Raw,2007,WI,65.1,-110,-115,-115,,85,-87.5,-87.5,85,165,172.5,-182.5,172.5,,,
DQ,Ethan Seaton,M,SBD,MR-HS,67.5,Raw,2004,WI,65.2,-160,-160,-160,,,,,,,,,,,,
DQ,Sampson Affeldt,M,SBD,MR-HS,67.5,Raw,2005,WI,65.3,120,-127.5,-127.5,120,65,67.5,72.5,72.5,-170,-170,-170,,,,
1,Mitchel Gamache,M,SBD,MR-HS,82.5,Raw,2004,WI,82.2,182.5,197.5,205,205,147.5,-155,160,160,227.5,237.5,-242.5,237.5,602.5,,
2,James Rogers #1,M,SBD,MR-HS,82.5,Raw,2004,WI,82,200,212.5,-220,212.5,142.5,152.5,155,155,215,230,-237.5,230,597.5,,
3,Dylan Johnson #2,M,SBD,MR-HS,82.5,Raw,2004,WI,79.5,177.5,192.5,207.5,207.5,115,122.5,125,125,-200,215,235,235,567.5,,
4,Leo Brostowitz,M,SBD,MR-HS,82.5,Raw,2004,WI,81.75,185,-205,205,205,125,-135,-135,125,210,230,-240,230,560,,
5,Jace Loignon,M,SBD,MR-HS,82.5,Raw,2004,WI,79.65,192.5,205,212.5,212.5,125,132.5,140,140,192.5,205,-210,205,557.5,,
6,Kennan Stowers,M,SBD,MR-HS,82.5,Raw,2003,WI,76.2,182.5,192.5,200,200,102.5,105,107.5,107.5,200,207.5,220,220,527.5,,
7,Luke Steffen,M,SBD,MR-HS,82.5,Raw,2003,WI,81.2,182.5,190,197.5,197.5,110,120,122.5,122.5,195,207.5,-215,207.5,527.5,,
8,Owen Bringe,M,SBD,MR-HS,82.5,Raw,2004,WI,81,182.5,190,-197.5,190,120,-127.5,-127.5,120,197.5,205,207.5,207.5,517.5,,
9,Colton Christensen,M,SBD,MR-HS,82.5,Raw,2006,WI,78.4,167.5,175,-182.5,175,107.5,115,122.5,122.5,200,205,210,210,507.5,,
10,Cayden Saeger,M,SBD,MR-HS,82.5,Raw,2006,WI,79.6,155,172.5,-175,172.5,115,127.5,-137.5,127.5,177.5,192.5,205,205,505,,
11,Kaelan McDonough,M,SBD,MR-HS,82.5,Raw,2004,WI,79.3,-185,185,197.5,197.5,102.5,-115,-115,102.5,187.5,200,202.5,202.5,502.5,,
12,Sam Todd,M,SBD,MR-HS,82.5,Raw,2004,WI,79.9,182.5,-187.5,-187.5,182.5,110,125,-130,125,175,192.5,-195,192.5,500,,
13,Dominic Corrente,M,SBD,MR-HS,82.5,Raw,2004,WI,80.5,175,-182.5,182.5,182.5,110,115,-120,115,202.5,-215,-215,202.5,500,,
14,Logan Paris,M,SBD,MR-HS,82.5,Raw,2004,WI,81.7,157.5,170,-182.5,170,105,112.5,117.5,117.5,162.5,182.5,205,205,492.5,,
15,Hayden Brennan,M,SBD,MR-HS,82.5,Raw,2005,WI,80,-175,175,182.5,182.5,97.5,102.5,-112.5,102.5,182.5,192.5,205,205,490,,
16,William Kaufmann,M,SBD,MR-HS,82.5,Raw,2003,WI,82.1,182.5,192.5,-202.5,192.5,92.5,95,-97.5,95,200,-215,-215,200,487.5,,
17,Brannt Balfanz,M,SBD,MR-HS,82.5,Raw,2004,WI,80.6,172.5,177.5,-185,177.5,92.5,97.5,-100,97.5,192.5,200,210,210,485,,
18,Cooper Murphy,M,SBD,MR-HS,82.5,Raw,2005,WI,80.2,157.5,170,177.5,177.5,112.5,117.5,122.5,122.5,167.5,175,180,180,480,,
19,Paul Kundert,M,SBD,MR-HS,82.5,Raw,2005,WI,80.6,157.5,165,172.5,172.5,92.5,-100,-100,92.5,200,215,-225,215,480,,
20,Cooper Burdick,M,SBD,MR-HS,82.5,Raw,2006,WI,80.7,175,182.5,-187.5,182.5,87.5,92.5,97.5,97.5,182.5,197.5,-200,197.5,477.5,,
21,Hudson Tamulion,M,SBD,MR-HS,82.5,Raw,2005,WI,80.9,155,165,170,170,82.5,87.5,92.5,92.5,-185,192.5,202.5,202.5,465,,
22,Jacob Hedinger,M,SBD,MR-HS,82.5,Raw,2004,WI,81.4,150,162.5,-175,162.5,87.5,95,100,100,177.5,190,202.5,202.5,465,,
23,Teal Lucas,M,SBD,MR-HS,82.5,Raw,2004,WI,77.5,152.5,167.5,-182.5,167.5,92.5,102.5,-107.5,102.5,165,182.5,192.5,192.5,462.5,,
24,Joe Bork,M,SBD,MR-HS,82.5,Raw,2004,WI,80.8,170,-175,-175,170,92.5,-105,-105,92.5,-197.5,-197.5,197.5,197.5,460,,
25,Rex Cassady,M,SBD,MR-HS,82.5,Raw,2004,WI,81.1,157.5,165,172.5,172.5,92.5,100,102.5,102.5,175,180,185,185,460,,
26,Finn Seaborg,M,SBD,MR-HS,82.5,Raw,2004,WI,81.6,175,-180,-180,175,95,100,105,105,175,-177.5,-177.5,175,455,,
27,Connor Granahan,M,SBD,MR-HS,82.5,Raw,2005,WI,80.5,155,167.5,-175,167.5,87.5,92.5,-97.5,92.5,175,190,-192.5,190,450,,
28,William Scheske,M,SBD,MR-HS,82.5,Raw,2004,WI,80.35,167.5,175,-182.5,175,82.5,87.5,-92.5,87.5,172.5,180,-182.5,180,442.5,,
29,Landen Rieks,M,SBD,MR-HS,82.5,Raw,2006,WI,80.9,157.5,162.5,-175,162.5,-92.5,92.5,-95,92.5,152.5,162.5,-172.5,162.5,417.5,,
DQ,Carter Hammes,M,SBD,MR-HS,82.5,Raw,2004,WI,80.85,147.5,-152.5,-152.5,147.5,-97.5,-97.5,-97.5,,-200,-205,-205,,,,
DQ,Colin Novy,M,SBD,MR-HS,82.5,Raw,2004,WI,81.2,-180,180,-195,180,-110,-112.5,-112.5,,-180,-180,-180,,,,
DQ,Emmanuel Kingston,M,SBD,MR-T2,110,Raw,2005,WI,100.7,-152.5,-152.5,-160,,102.5,-107.5,-107.5,102.5,192.5,207.5,-217.5,207.5,,,
1,Christopher Bark,M,SBD,MR-T2,140,Raw,2004,WI,131.4,175,182.5,190,190,97.5,105,115,115,170,180,182.5,182.5,487.5,,
1,Timothy Sheats,M,SBD,M-T3,100,Single-ply,2003,WI,90.4,180,-192.5,-200,180,120,127.5,135,135,215,235,-255,235,550,,
