{
    "type": "component",
    "name": "gitlab-component",
    "children": [
      {
        "name": "Breadcrumbs",
        "nodeName": "bln-breadcrumbs",
        "elementId": "",
        "attributes": [
          {
            "property": "data-id",
            "value": "C2mCmc"
          },
          {
            "property": "core",
            "value": ""
          }
        ],
        "classList": [],
        "conditionalClasses": [],
        "contentType": "text",
        "displayExpression": "",
        "events": {},
        "iterate": {
          "array": "",
          "variable": "",
          "trackByIndex": false
        },
        "styles": [],
        "children": [],
        "comments": "",
        "type": "core-component",
        "id": "breadcrumbs",
        "expressions": []
      },
      {
        "name": "Checkbox",
        "nodeName": "bln-checkbox",
        "elementId": "",
        "attributes": [
          {
            "property": "data-id",
            "value": "tFON9l"
          },
          {
            "property": "core",
            "value": ""
          }
        ],
        "classList": [],
        "conditionalClasses": [],
        "contentType": "text",
        "displayExpression": "",
        "events": {},
        "iterate": {
          "array": "",
          "variable": "",
          "trackByIndex": false
        },
        "styles": [],
        "children": [],
        "comments": "",
        "type": "core-component",
        "id": "checkbox",
        "expressions": [],
        "formControl": {
          "modelName": "checked"
        }
      },
      {
        "name": "Table",
        "nodeName": "bln-table",
        "elementId": "",
        "attributes": [
          {
            "property": "data-id",
            "value": "CrhI8m"
          },
          {
            "property": "core",
            "value": ""
          }
        ],
        "classList": [],
        "conditionalClasses": [],
        "contentType": "text",
        "displayExpression": "",
        "events": {},
        "iterate": {
          "array": "",
          "variable": "",
          "trackByIndex": false
        },
        "styles": [],
        "children": [],
        "comments": "",
        "type": "core-component",
        "id": "table",
        "expressions": []
      }
    ],
    "variables": [],
    "bindings": [],
    "modules": [],
    "externalScripts": [],
    "externalStylesheets": []
  }
  