{
  "name": "home",
  "type": "page",
  "url": "/home",
  "params": {},
  "variables": [],
  "children": [
    {
      "name": "h1",
      "nodeName": "h1",
      "elementId": "",
      "attributes": [
        {
          "property": "data-id",
          "value": "0tgszK"
        }
      ],
      "classList": [],
      "conditionalClasses": [],
      "contentType": "text",
      "displayExpression": "",
      "events": {},
      "iterate": {
        "array": "",
        "variable": ""
      },
      "styles": [],
      "children": [
        {
          "name": "text",
          "nodeName": "text",
          "textContent": "Hello World",
          "evaluate": false
        }
      ]
    }
  ]
}
