{
  "type": "component",
  "name": "demo-component-2",
  "children": [
    {
      "name": "h1",
      "nodeName": "h1",
      "elementId": "",
      "attributes": [
        {
          "property": "data-id",
          "value": "rc3Hca"
        }
      ],
      "classList": [],
      "conditionalClasses": [],
      "contentType": "text",
      "displayExpression": "",
      "events": {},
      "iterate": {
        "array": "",
        "variable": ""
      },
      "styles": [],
      "children": [
        {
          "name": "text",
          "nodeName": "text",
          "textContent": "h1",
          "evaluate": false
        }
      ]
    }
  ],
  "variables": [],
  "bindings": [],
  "modules": []
}