{
  "paragraphs": [
    {
      "text": "%md\ntesting bang",
      "user": "hdp-djp",
      "dateUpdated": "2022-08-10 16:16:05.159",
      "config": {
        "colWidth": 12.0,
        "fontSize": 9.0,
        "enabled": true,
        "results": {},
        "editorSetting": {
          "language": "markdown",
          "editOnDblClick": true,
          "completionKey": "TAB",
          "completionSupport": false
        },
        "editorMode": "ace/mode/markdown",
        "editorHide": true,
        "tableHide": false
      },
      "settings": {
        "params": {},
        "forms": {}
      },
      "results": {
        "code": "SUCCESS",
        "msg": [
          {
            "type": "HTML",
            "data": "\u003cp\u003etesting bang\u003c/p\u003e\n"
          }
        ]
      },
      "apps": [],
      "jobName": "paragraph_1660098094491_1240349923",
      "id": "20220810-092134_1111730948",
      "dateCreated": "2022-08-10 09:21:34.491",
      "dateStarted": "2022-08-10 16:16:05.164",
      "dateFinished": "2022-08-10 16:16:07.136",
      "status": "FINISHED",
      "progressUpdateIntervalMs": 500
    },
    {
      "text": "%md\n",
      "user": "admin",
      "dateUpdated": "2022-08-10 09:21:41.576",
      "config": {},
      "settings": {
        "params": {},
        "forms": {}
      },
      "apps": [],
      "jobName": "paragraph_1660098101573_-1548229002",
      "id": "20220810-092141_1276440788",
      "dateCreated": "2022-08-10 09:21:41.574",
      "status": "READY",
      "progressUpdateIntervalMs": 500
    }
  ],
  "name": "aaadddd",
  "id": "2HAWDA3UV",
  "noteParams": {},
  "noteForms": {},
  "angularObjects": {
    "md:shared_process": [],
    "spark:hdp-djp:": []
  },
  "config": {
    "isZeppelinNotebookCronEnable": false
  },
  "info": {}
}