{
    "level": 30,
    "time": 1653610485236,
    "pid": 62398,
    "hostname": "mbp.local",
    "id": "sdfsdfsdfdsfdsf",
    "event": "messages.upsert",
    "type": "conversation",
    "fromMe": false,
    "isGroupChat": false,
    "participants": {
        "recipient": "6281259968636@c.us",
        "sender": "628970002121@c.us"
    },
    "t": 1653610484,
    "message": "halo",
    "raw": {
        "key": {
            "remoteJid": "628970002121@s.whatsapp.net",
            "fromMe": false,
            "id": "ssdfsdfdsfds"
        },
        "messageTimestamp": 1653610484,
        "pushName": "Wafvel Multi Device Beta",
        "message": {
            "conversation": "halo",
            "messageContextInfo": {
                "deviceListMetadata": {
                    "senderKeyHash": "d==",
                    "senderTimestamp": "2",
                    "recipientKeyHash": "4==",
                    "recipientTimestamp": "5"
                },
                "deviceListMetadataVersion": 2
            }
        }
    }
}