{
  "project_info": {
    "project_number": "639197317200",
    "project_id": "rander-all-tfc",
    "storage_bucket": "rander-all-tfc.appspot.com"
  },
  "client": [
    {
      "client_info": {
        "mobilesdk_app_id": "1:639197317200:android:711e480f0a97cd4a4b6955",
        "android_client_info": {
          "package_name": "com.example.rander_all_tfc"
        }
      },
      "oauth_client": [
        {
          "client_id": "639197317200-59qso74obn26tnuq47gun91cnshjkeqk.apps.googleusercontent.com",
          "client_type": 3
        }
      ],
      "api_key": [
        {
          "current_key": "AIzaSyDxZ9-hoETmEDWj6SRUp6yEJXCKO1Z6Wpw"
        }
      ],
      "services": {
        "appinvite_service": {
          "other_platform_oauth_client": [
            {
              "client_id": "639197317200-59qso74obn26tnuq47gun91cnshjkeqk.apps.googleusercontent.com",
              "client_type": 3
            }
          ]
        }
      }
    }
  ],
  "configuration_version": "1"
}