<?xml version="1.0" encoding="UTF-8" standalone="no"?>
<svg
   width="297mm"
   height="100mm"
   viewBox="0 0 297 100"
   version="1.1"
   id="svg8"
   inkscape:version="1.1 (c68e22c387, 2021-05-23)"
   sodipodi:docname="ram_P.svg"
   xmlns:inkscape="http://www.inkscape.org/namespaces/inkscape"
   xmlns:sodipodi="http://sodipodi.sourceforge.net/DTD/sodipodi-0.dtd"
   xmlns="http://www.w3.org/2000/svg"
   xmlns:svg="http://www.w3.org/2000/svg"
   xmlns:rdf="http://www.w3.org/1999/02/22-rdf-syntax-ns#"
   xmlns:cc="http://creativecommons.org/ns#"
   xmlns:dc="http://purl.org/dc/elements/1.1/">
  <defs
     id="defs2">
    <rect
       x="119.33524"
       y="20.143842"
       width="10.787152"
       height="12.369035"
       id="rect5893" />
    <rect
       x="30.380323"
       y="47.386086"
       width="27.572409"
       height="12.220945"
       id="rect2883" />
    <rect
       x="36.025787"
       y="36.604439"
       width="26.460243"
       height="11.885542"
       id="rect2663" />
    <rect
       x="61.468807"
       y="51.172821"
       width="25.953676"
       height="14.500295"
       id="rect2657" />
    <marker
       style="overflow:visible"
       id="marker2009"
       refX="0"
       refY="0"
       orient="auto"
       inkscape:stockid="Arrow1Sstart"
       inkscape:isstock="true">
      <path
         transform="matrix(0.2,0,0,0.2,1.2,0)"
         style="fill:#000000;fill-opacity:1;fill-rule:evenodd;stroke:#000000;stroke-width:1pt;stroke-opacity:1"
         d="M 0,0 5,-5 -12.5,0 5,5 Z"
         id="path2007" />
    </marker>
    <marker
       style="overflow:visible"
       id="marker1939"
       refX="0"
       refY="0"
       orient="auto"
       inkscape:stockid="Arrow1Sstart"
       inkscape:isstock="true">
      <path
         transform="matrix(0.2,0,0,0.2,1.2,0)"
         style="fill:#000000;fill-opacity:1;fill-rule:evenodd;stroke:#000000;stroke-width:1pt;stroke-opacity:1"
         d="M 0,0 5,-5 -12.5,0 5,5 Z"
         id="path1937" />
    </marker>
    <marker
       style="overflow:visible"
       id="marker1875"
       refX="0"
       refY="0"
       orient="auto"
       inkscape:stockid="Arrow1Sstart"
       inkscape:isstock="true">
      <path
         transform="matrix(0.2,0,0,0.2,1.2,0)"
         style="fill:#000000;fill-opacity:1;fill-rule:evenodd;stroke:#000000;stroke-width:1pt;stroke-opacity:1"
         d="M 0,0 5,-5 -12.5,0 5,5 Z"
         id="path1873" />
    </marker>
    <marker
       style="overflow:visible"
       id="marker1817"
       refX="0"
       refY="0"
       orient="auto"
       inkscape:stockid="Arrow1Sstart"
       inkscape:isstock="true">
      <path
         transform="matrix(0.2,0,0,0.2,1.2,0)"
         style="fill:#000000;fill-opacity:1;fill-rule:evenodd;stroke:#000000;stroke-width:1pt;stroke-opacity:1"
         d="M 0,0 5,-5 -12.5,0 5,5 Z"
         id="path1815" />
    </marker>
    <marker
       style="overflow:visible"
       id="marker1765"
       refX="0"
       refY="0"
       orient="auto"
       inkscape:stockid="Arrow1Sstart"
       inkscape:isstock="true">
      <path
         transform="matrix(0.2,0,0,0.2,1.2,0)"
         style="fill:#000000;fill-opacity:1;fill-rule:evenodd;stroke:#000000;stroke-width:1pt;stroke-opacity:1"
         d="M 0,0 5,-5 -12.5,0 5,5 Z"
         id="path1763" />
    </marker>
    <marker
       style="overflow:visible"
       id="marker1719"
       refX="0"
       refY="0"
       orient="auto"
       inkscape:stockid="Arrow1Sstart"
       inkscape:isstock="true">
      <path
         transform="matrix(0.2,0,0,0.2,1.2,0)"
         style="fill:#000000;fill-opacity:1;fill-rule:evenodd;stroke:#000000;stroke-width:1pt;stroke-opacity:1"
         d="M 0,0 5,-5 -12.5,0 5,5 Z"
         id="path1717" />
    </marker>
    <marker
       style="overflow:visible"
       id="Arrow1Sstart"
       refX="0"
       refY="0"
       orient="auto"
       inkscape:stockid="Arrow1Sstart"
       inkscape:isstock="true">
      <path
         transform="matrix(0.2,0,0,0.2,1.2,0)"
         style="fill:#000000;fill-opacity:1;fill-rule:evenodd;stroke:#000000;stroke-width:1pt;stroke-opacity:1"
         d="M 0,0 5,-5 -12.5,0 5,5 Z"
         id="path1327" />
    </marker>
    <marker
       style="overflow:visible"
       id="Arrow1Lstart"
       refX="0"
       refY="0"
       orient="auto"
       inkscape:stockid="Arrow1Lstart"
       inkscape:isstock="true">
      <path
         transform="matrix(0.8,0,0,0.8,10,0)"
         style="fill:#000000;fill-opacity:1;fill-rule:evenodd;stroke:#000000;stroke-width:1pt;stroke-opacity:1"
         d="M 0,0 5,-5 -12.5,0 5,5 Z"
         id="path1315" />
    </marker>
    <marker
       style="overflow:visible"
       id="Arrow1Mend"
       refX="0"
       refY="0"
       orient="auto"
       inkscape:stockid="Arrow1Mend"
       inkscape:isstock="true">
      <path
         transform="matrix(-0.4,0,0,-0.4,-4,0)"
         style="fill:#000000;fill-opacity:1;fill-rule:evenodd;stroke:#000000;stroke-width:1pt;stroke-opacity:1"
         d="M 0,0 5,-5 -12.5,0 5,5 Z"
         id="path1324" />
    </marker>
    <marker
       style="overflow:visible"
       id="Arrow1Lend"
       refX="0"
       refY="0"
       orient="auto"
       inkscape:stockid="Arrow1Lend"
       inkscape:isstock="true">
      <path
         transform="matrix(-0.8,0,0,-0.8,-10,0)"
         style="fill:#000000;fill-opacity:1;fill-rule:evenodd;stroke:#000000;stroke-width:1pt;stroke-opacity:1"
         d="M 0,0 5,-5 -12.5,0 5,5 Z"
         id="path1318" />
    </marker>
    <marker
       style="overflow:visible"
       id="Arrow1Sstart-6"
       refX="0"
       refY="0"
       orient="auto"
       inkscape:stockid="Arrow1Sstart"
       inkscape:isstock="true">
      <path
         transform="matrix(0.2,0,0,0.2,1.2,0)"
         style="fill:#000000;fill-opacity:1;fill-rule:evenodd;stroke:#000000;stroke-width:1pt;stroke-opacity:1"
         d="M 0,0 5,-5 -12.5,0 5,5 Z"
         id="path1327-1" />
    </marker>
    <marker
       style="overflow:visible"
       id="marker1719-5"
       refX="0"
       refY="0"
       orient="auto"
       inkscape:stockid="Arrow1Sstart"
       inkscape:isstock="true">
      <path
         transform="matrix(0.2,0,0,0.2,1.2,0)"
         style="fill:#000000;fill-opacity:1;fill-rule:evenodd;stroke:#000000;stroke-width:1pt;stroke-opacity:1"
         d="M 0,0 5,-5 -12.5,0 5,5 Z"
         id="path1717-5" />
    </marker>
    <marker
       style="overflow:visible"
       id="marker1765-4"
       refX="0"
       refY="0"
       orient="auto"
       inkscape:stockid="Arrow1Sstart"
       inkscape:isstock="true">
      <path
         transform="matrix(0.2,0,0,0.2,1.2,0)"
         style="fill:#000000;fill-opacity:1;fill-rule:evenodd;stroke:#000000;stroke-width:1pt;stroke-opacity:1"
         d="M 0,0 5,-5 -12.5,0 5,5 Z"
         id="path1763-7" />
    </marker>
    <marker
       style="overflow:visible"
       id="marker1875-6"
       refX="0"
       refY="0"
       orient="auto"
       inkscape:stockid="Arrow1Sstart"
       inkscape:isstock="true">
      <path
         transform="matrix(0.2,0,0,0.2,1.2,0)"
         style="fill:#000000;fill-opacity:1;fill-rule:evenodd;stroke:#000000;stroke-width:1pt;stroke-opacity:1"
         d="M 0,0 5,-5 -12.5,0 5,5 Z"
         id="path1873-5" />
    </marker>
    <marker
       style="overflow:visible"
       id="marker2009-6"
       refX="0"
       refY="0"
       orient="auto"
       inkscape:stockid="Arrow1Sstart"
       inkscape:isstock="true">
      <path
         transform="matrix(0.2,0,0,0.2,1.2,0)"
         style="fill:#000000;fill-opacity:1;fill-rule:evenodd;stroke:#000000;stroke-width:1pt;stroke-opacity:1"
         d="M 0,0 5,-5 -12.5,0 5,5 Z"
         id="path2007-9" />
    </marker>
    <marker
       style="overflow:visible"
       id="marker1817-3"
       refX="0"
       refY="0"
       orient="auto"
       inkscape:stockid="Arrow1Sstart"
       inkscape:isstock="true">
      <path
         transform="matrix(0.2,0,0,0.2,1.2,0)"
         style="fill:#000000;fill-opacity:1;fill-rule:evenodd;stroke:#000000;stroke-width:1pt;stroke-opacity:1"
         d="M 0,0 5,-5 -12.5,0 5,5 Z"
         id="path1815-7" />
    </marker>
    <marker
       style="overflow:visible"
       id="marker1939-4"
       refX="0"
       refY="0"
       orient="auto"
       inkscape:stockid="Arrow1Sstart"
       inkscape:isstock="true">
      <path
         transform="matrix(0.2,0,0,0.2,1.2,0)"
         style="fill:#000000;fill-opacity:1;fill-rule:evenodd;stroke:#000000;stroke-width:1pt;stroke-opacity:1"
         d="M 0,0 5,-5 -12.5,0 5,5 Z"
         id="path1937-5" />
    </marker>
    <marker
       style="overflow:visible"
       id="Arrow1Sstart-2"
       refX="0"
       refY="0"
       orient="auto"
       inkscape:stockid="Arrow1Sstart"
       inkscape:isstock="true">
      <path
         transform="matrix(0.2,0,0,0.2,1.2,0)"
         style="fill:#000000;fill-opacity:1;fill-rule:evenodd;stroke:#000000;stroke-width:1pt;stroke-opacity:1"
         d="M 0,0 5,-5 -12.5,0 5,5 Z"
         id="path1327-6" />
    </marker>
    <marker
       style="overflow:visible"
       id="marker1719-1"
       refX="0"
       refY="0"
       orient="auto"
       inkscape:stockid="Arrow1Sstart"
       inkscape:isstock="true">
      <path
         transform="matrix(0.2,0,0,0.2,1.2,0)"
         style="fill:#000000;fill-opacity:1;fill-rule:evenodd;stroke:#000000;stroke-width:1pt;stroke-opacity:1"
         d="M 0,0 5,-5 -12.5,0 5,5 Z"
         id="path1717-0" />
    </marker>
    <marker
       style="overflow:visible"
       id="marker1765-6"
       refX="0"
       refY="0"
       orient="auto"
       inkscape:stockid="Arrow1Sstart"
       inkscape:isstock="true">
      <path
         transform="matrix(0.2,0,0,0.2,1.2,0)"
         style="fill:#000000;fill-opacity:1;fill-rule:evenodd;stroke:#000000;stroke-width:1pt;stroke-opacity:1"
         d="M 0,0 5,-5 -12.5,0 5,5 Z"
         id="path1763-1" />
    </marker>
    <marker
       style="overflow:visible"
       id="marker1875-5"
       refX="0"
       refY="0"
       orient="auto"
       inkscape:stockid="Arrow1Sstart"
       inkscape:isstock="true">
      <path
         transform="matrix(0.2,0,0,0.2,1.2,0)"
         style="fill:#000000;fill-opacity:1;fill-rule:evenodd;stroke:#000000;stroke-width:1pt;stroke-opacity:1"
         d="M 0,0 5,-5 -12.5,0 5,5 Z"
         id="path1873-9" />
    </marker>
    <marker
       style="overflow:visible"
       id="marker2009-4"
       refX="0"
       refY="0"
       orient="auto"
       inkscape:stockid="Arrow1Sstart"
       inkscape:isstock="true">
      <path
         transform="matrix(0.2,0,0,0.2,1.2,0)"
         style="fill:#000000;fill-opacity:1;fill-rule:evenodd;stroke:#000000;stroke-width:1pt;stroke-opacity:1"
         d="M 0,0 5,-5 -12.5,0 5,5 Z"
         id="path2007-90" />
    </marker>
    <marker
       style="overflow:visible"
       id="marker1817-9"
       refX="0"
       refY="0"
       orient="auto"
       inkscape:stockid="Arrow1Sstart"
       inkscape:isstock="true">
      <path
         transform="matrix(0.2,0,0,0.2,1.2,0)"
         style="fill:#000000;fill-opacity:1;fill-rule:evenodd;stroke:#000000;stroke-width:1pt;stroke-opacity:1"
         d="M 0,0 5,-5 -12.5,0 5,5 Z"
         id="path1815-1" />
    </marker>
    <marker
       style="overflow:visible"
       id="marker1939-7"
       refX="0"
       refY="0"
       orient="auto"
       inkscape:stockid="Arrow1Sstart"
       inkscape:isstock="true">
      <path
         transform="matrix(0.2,0,0,0.2,1.2,0)"
         style="fill:#000000;fill-opacity:1;fill-rule:evenodd;stroke:#000000;stroke-width:1pt;stroke-opacity:1"
         d="M 0,0 5,-5 -12.5,0 5,5 Z"
         id="path1937-7" />
    </marker>
    <marker
       style="overflow:visible"
       id="Arrow1Sstart-2-0"
       refX="0"
       refY="0"
       orient="auto"
       inkscape:stockid="Arrow1Sstart"
       inkscape:isstock="true">
      <path
         transform="matrix(0.2,0,0,0.2,1.2,0)"
         style="fill:#000000;fill-opacity:1;fill-rule:evenodd;stroke:#000000;stroke-width:1pt;stroke-opacity:1"
         d="M 0,0 5,-5 -12.5,0 5,5 Z"
         id="path1327-6-8" />
    </marker>
    <marker
       style="overflow:visible"
       id="marker1719-1-8"
       refX="0"
       refY="0"
       orient="auto"
       inkscape:stockid="Arrow1Sstart"
       inkscape:isstock="true">
      <path
         transform="matrix(0.2,0,0,0.2,1.2,0)"
         style="fill:#000000;fill-opacity:1;fill-rule:evenodd;stroke:#000000;stroke-width:1pt;stroke-opacity:1"
         d="M 0,0 5,-5 -12.5,0 5,5 Z"
         id="path1717-0-5" />
    </marker>
    <marker
       style="overflow:visible"
       id="marker1765-6-0"
       refX="0"
       refY="0"
       orient="auto"
       inkscape:stockid="Arrow1Sstart"
       inkscape:isstock="true">
      <path
         transform="matrix(0.2,0,0,0.2,1.2,0)"
         style="fill:#000000;fill-opacity:1;fill-rule:evenodd;stroke:#000000;stroke-width:1pt;stroke-opacity:1"
         d="M 0,0 5,-5 -12.5,0 5,5 Z"
         id="path1763-1-9" />
    </marker>
    <marker
       style="overflow:visible"
       id="marker1875-5-6"
       refX="0"
       refY="0"
       orient="auto"
       inkscape:stockid="Arrow1Sstart"
       inkscape:isstock="true">
      <path
         transform="matrix(0.2,0,0,0.2,1.2,0)"
         style="fill:#000000;fill-opacity:1;fill-rule:evenodd;stroke:#000000;stroke-width:1pt;stroke-opacity:1"
         d="M 0,0 5,-5 -12.5,0 5,5 Z"
         id="path1873-9-3" />
    </marker>
    <marker
       style="overflow:visible"
       id="marker2009-4-8"
       refX="0"
       refY="0"
       orient="auto"
       inkscape:stockid="Arrow1Sstart"
       inkscape:isstock="true">
      <path
         transform="matrix(0.2,0,0,0.2,1.2,0)"
         style="fill:#000000;fill-opacity:1;fill-rule:evenodd;stroke:#000000;stroke-width:1pt;stroke-opacity:1"
         d="M 0,0 5,-5 -12.5,0 5,5 Z"
         id="path2007-90-5" />
    </marker>
    <marker
       style="overflow:visible"
       id="marker1817-9-6"
       refX="0"
       refY="0"
       orient="auto"
       inkscape:stockid="Arrow1Sstart"
       inkscape:isstock="true">
      <path
         transform="matrix(0.2,0,0,0.2,1.2,0)"
         style="fill:#000000;fill-opacity:1;fill-rule:evenodd;stroke:#000000;stroke-width:1pt;stroke-opacity:1"
         d="M 0,0 5,-5 -12.5,0 5,5 Z"
         id="path1815-1-1" />
    </marker>
    <marker
       style="overflow:visible"
       id="marker1939-7-1"
       refX="0"
       refY="0"
       orient="auto"
       inkscape:stockid="Arrow1Sstart"
       inkscape:isstock="true">
      <path
         transform="matrix(0.2,0,0,0.2,1.2,0)"
         style="fill:#000000;fill-opacity:1;fill-rule:evenodd;stroke:#000000;stroke-width:1pt;stroke-opacity:1"
         d="M 0,0 5,-5 -12.5,0 5,5 Z"
         id="path1937-7-5" />
    </marker>
    <marker
       style="overflow:visible"
       id="Arrow1Sstart-2-1"
       refX="0"
       refY="0"
       orient="auto"
       inkscape:stockid="Arrow1Sstart"
       inkscape:isstock="true">
      <path
         transform="matrix(0.2,0,0,0.2,1.2,0)"
         style="fill:#000000;fill-opacity:1;fill-rule:evenodd;stroke:#000000;stroke-width:1pt;stroke-opacity:1"
         d="M 0,0 5,-5 -12.5,0 5,5 Z"
         id="path1327-6-7" />
    </marker>
    <marker
       style="overflow:visible"
       id="marker1719-1-85"
       refX="0"
       refY="0"
       orient="auto"
       inkscape:stockid="Arrow1Sstart"
       inkscape:isstock="true">
      <path
         transform="matrix(0.2,0,0,0.2,1.2,0)"
         style="fill:#000000;fill-opacity:1;fill-rule:evenodd;stroke:#000000;stroke-width:1pt;stroke-opacity:1"
         d="M 0,0 5,-5 -12.5,0 5,5 Z"
         id="path1717-0-7" />
    </marker>
    <marker
       style="overflow:visible"
       id="marker1765-6-4"
       refX="0"
       refY="0"
       orient="auto"
       inkscape:stockid="Arrow1Sstart"
       inkscape:isstock="true">
      <path
         transform="matrix(0.2,0,0,0.2,1.2,0)"
         style="fill:#000000;fill-opacity:1;fill-rule:evenodd;stroke:#000000;stroke-width:1pt;stroke-opacity:1"
         d="M 0,0 5,-5 -12.5,0 5,5 Z"
         id="path1763-1-1" />
    </marker>
    <marker
       style="overflow:visible"
       id="marker1875-5-8"
       refX="0"
       refY="0"
       orient="auto"
       inkscape:stockid="Arrow1Sstart"
       inkscape:isstock="true">
      <path
         transform="matrix(0.2,0,0,0.2,1.2,0)"
         style="fill:#000000;fill-opacity:1;fill-rule:evenodd;stroke:#000000;stroke-width:1pt;stroke-opacity:1"
         d="M 0,0 5,-5 -12.5,0 5,5 Z"
         id="path1873-9-5" />
    </marker>
    <marker
       style="overflow:visible"
       id="marker2009-4-9"
       refX="0"
       refY="0"
       orient="auto"
       inkscape:stockid="Arrow1Sstart"
       inkscape:isstock="true">
      <path
         transform="matrix(0.2,0,0,0.2,1.2,0)"
         style="fill:#000000;fill-opacity:1;fill-rule:evenodd;stroke:#000000;stroke-width:1pt;stroke-opacity:1"
         d="M 0,0 5,-5 -12.5,0 5,5 Z"
         id="path2007-90-7" />
    </marker>
    <marker
       style="overflow:visible"
       id="marker1817-9-5"
       refX="0"
       refY="0"
       orient="auto"
       inkscape:stockid="Arrow1Sstart"
       inkscape:isstock="true">
      <path
         transform="matrix(0.2,0,0,0.2,1.2,0)"
         style="fill:#000000;fill-opacity:1;fill-rule:evenodd;stroke:#000000;stroke-width:1pt;stroke-opacity:1"
         d="M 0,0 5,-5 -12.5,0 5,5 Z"
         id="path1815-1-3" />
    </marker>
    <marker
       style="overflow:visible"
       id="marker1939-7-8"
       refX="0"
       refY="0"
       orient="auto"
       inkscape:stockid="Arrow1Sstart"
       inkscape:isstock="true">
      <path
         transform="matrix(0.2,0,0,0.2,1.2,0)"
         style="fill:#000000;fill-opacity:1;fill-rule:evenodd;stroke:#000000;stroke-width:1pt;stroke-opacity:1"
         d="M 0,0 5,-5 -12.5,0 5,5 Z"
         id="path1937-7-8" />
    </marker>
    <marker
       style="overflow:visible"
       id="marker1765-6-09"
       refX="0"
       refY="0"
       orient="auto"
       inkscape:stockid="Arrow1Sstart"
       inkscape:isstock="true">
      <path
         transform="matrix(0.2,0,0,0.2,1.2,0)"
         style="fill:#000000;fill-opacity:1;fill-rule:evenodd;stroke:#000000;stroke-width:1pt;stroke-opacity:1"
         d="M 0,0 5,-5 -12.5,0 5,5 Z"
         id="path1763-1-3" />
    </marker>
    <rect
       x="119.33524"
       y="20.143843"
       width="10.787152"
       height="12.369035"
       id="rect5893-6" />
    <marker
       style="overflow:visible"
       id="marker1765-6-2"
       refX="0"
       refY="0"
       orient="auto"
       inkscape:stockid="Arrow1Sstart"
       inkscape:isstock="true">
      <path
         transform="matrix(0.2,0,0,0.2,1.2,0)"
         style="fill:#000000;fill-opacity:1;fill-rule:evenodd;stroke:#000000;stroke-width:1pt;stroke-opacity:1"
         d="M 0,0 5,-5 -12.5,0 5,5 Z"
         id="path1763-1-2" />
    </marker>
    <rect
       x="119.33524"
       y="20.143843"
       width="10.787152"
       height="12.369035"
       id="rect5893-8" />
    <rect
       x="119.33524"
       y="20.143843"
       width="10.787152"
       height="12.369035"
       id="rect5893-3" />
    <rect
       x="119.33524"
       y="20.143843"
       width="10.787152"
       height="12.369035"
       id="rect5893-1" />
    <rect
       x="119.33524"
       y="20.143843"
       width="10.787152"
       height="12.369035"
       id="rect5893-63" />
    <rect
       x="119.33524"
       y="20.143843"
       width="14.828895"
       height="11.512595"
       id="rect5893-0" />
    <rect
       x="119.33524"
       y="20.143843"
       width="10.787152"
       height="12.369035"
       id="rect5893-3-5" />
    <rect
       x="119.33524"
       y="20.143843"
       width="78.665728"
       height="10.781406"
       id="rect5893-3-4" />
  </defs>
  <sodipodi:namedview
     id="base"
     pagecolor="#ffffff"
     bordercolor="#666666"
     borderopacity="1.0"
     inkscape:pageopacity="0.0"
     inkscape:pageshadow="2"
     inkscape:zoom="2"
     inkscape:cx="452.25"
     inkscape:cy="133.5"
     inkscape:document-units="mm"
     inkscape:current-layer="layer1"
     inkscape:document-rotation="0"
     showgrid="false"
     inkscape:window-width="3836"
     inkscape:window-height="2119"
     inkscape:window-x="0"
     inkscape:window-y="1119"
     inkscape:window-maximized="1"
     width="100mm"
     inkscape:pagecheckerboard="0" />
  <metadata
     id="metadata5">
    <rdf:RDF>
      <cc:Work
         rdf:about="">
        <dc:format>image/svg+xml</dc:format>
        <dc:type
           rdf:resource="http://purl.org/dc/dcmitype/StillImage" />
      </cc:Work>
    </rdf:RDF>
  </metadata>
  <g
     inkscape:label="Calque 1"
     inkscape:groupmode="layer"
     id="layer1">
    <path
       style="fill:none;stroke:#000000;stroke-width:0.847033px;stroke-linecap:butt;stroke-linejoin:miter;stroke-opacity:1"
       d="m 13.620693,52.080265 0.03814,5.890315"
       id="path36-7"
       sodipodi:nodetypes="cc" />
    <path
       style="fill:none;stroke:#000000;stroke-width:0.847033px;stroke-linecap:butt;stroke-linejoin:miter;stroke-opacity:1"
       d="m 23.537169,52.001272 0.03814,5.890315"
       id="path36-7-1"
       sodipodi:nodetypes="cc" />
    <path
       style="fill:none;stroke:#000000;stroke-width:0.847033px;stroke-linecap:butt;stroke-linejoin:miter;stroke-opacity:1"
       d="m 60.145998,52.667469 0.0704,4.663122"
       id="path36-7-9"
       sodipodi:nodetypes="cc" />
    <path
       style="fill:none;stroke:#000000;stroke-width:0.847033px;stroke-linecap:butt;stroke-linejoin:miter;stroke-opacity:1"
       d="m 70.536868,52.730341 0.0704,4.663122"
       id="path36-7-9-3"
       sodipodi:nodetypes="cc" />
    <path
       style="fill:none;stroke:#000000;stroke-width:0.847033px;stroke-linecap:butt;stroke-linejoin:miter;stroke-opacity:1"
       d="m 80.927718,52.71573 0.0704,4.663122"
       id="path36-7-9-6"
       sodipodi:nodetypes="cc" />
    <path
       style="fill:none;stroke:#000000;stroke-width:0.847033px;stroke-linecap:butt;stroke-linejoin:miter;stroke-opacity:1"
       d="m 91.318569,52.727694 0.0704,4.663122"
       id="path36-7-9-7"
       sodipodi:nodetypes="cc" />
    <path
       style="fill:none;stroke:#000000;stroke-width:0.847033px;stroke-linecap:butt;stroke-linejoin:miter;stroke-opacity:1"
       d="m 101.70941,52.771998 0.0704,4.663122"
       id="path36-7-9-5"
       sodipodi:nodetypes="cc" />
    <path
       style="fill:none;stroke:#000000;stroke-width:0.847033px;stroke-linecap:butt;stroke-linejoin:miter;stroke-opacity:1"
       d="m 112.10025,52.694617 0.0704,4.663122"
       id="path36-7-9-35"
       sodipodi:nodetypes="cc" />
    <path
       style="fill:none;stroke:#000000;stroke-width:0.847033px;stroke-linecap:butt;stroke-linejoin:miter;stroke-opacity:1"
       d="m 122.62756,52.93039 0.0704,4.663122"
       id="path36-7-9-62"
       sodipodi:nodetypes="cc" />
    <path
       style="fill:none;stroke:#000000;stroke-width:0.848367;stroke-linecap:butt;stroke-linejoin:miter;stroke-miterlimit:4;stroke-dasharray:3.39347, 0.848367;stroke-dashoffset:0;stroke-opacity:1"
       d="M 23.575309,38.258992 H 49.962026"
       id="path199"
       sodipodi:nodetypes="cc" />
    <path
       style="fill:none;stroke:#000000;stroke-width:0.848367;stroke-linecap:butt;stroke-linejoin:miter;stroke-miterlimit:4;stroke-dasharray:3.39347, 0.848367;stroke-dashoffset:0;stroke-opacity:1"
       d="m 23.575309,57.891587 c -0.02889,6.6e-5 17.591145,0 26.386717,0"
       id="path199-2"
       sodipodi:nodetypes="cc" />
    <path
       style="fill:none;stroke:#000000;stroke-width:0.848367;stroke-linecap:butt;stroke-linejoin:miter;stroke-miterlimit:4;stroke-dasharray:3.39347, 0.848367;stroke-dashoffset:0;stroke-opacity:1"
       d="m 122.69796,57.593512 h 26.38671"
       id="path199-3" />
    <path
       style="fill:none;stroke:#000000;stroke-width:0.848367;stroke-linecap:butt;stroke-linejoin:miter;stroke-miterlimit:4;stroke-dasharray:3.39347, 0.848367;stroke-dashoffset:0;stroke-opacity:1"
       d="m 122.69796,37.960917 h 26.3867"
       id="path199-7" />
    <text
       xml:space="preserve"
       style="font-style:normal;font-weight:normal;font-size:13.5525px;line-height:1.25;font-family:sans-serif;fill:#000000;fill-opacity:1;stroke:none;stroke-width:0.847032"
       x="25.356766"
       y="53.05146"
       id="text1064"><tspan
         sodipodi:role="line"
         id="tspan1062"
         x="25.356766"
         y="53.05146"
         style="font-size:13.5525px;stroke-width:0.847032">(...)</tspan></text>
    <text
       xml:space="preserve"
       style="font-style:normal;font-weight:normal;font-size:13.5525px;line-height:1.25;font-family:sans-serif;fill:#000000;fill-opacity:1;stroke:none;stroke-width:0.847032"
       x="124.92576"
       y="52.291264"
       id="text1064-5"><tspan
         sodipodi:role="line"
         id="tspan1062-9"
         x="124.92576"
         y="52.291264"
         style="font-size:13.5525px;stroke-width:0.847032">(...)</tspan></text>
    <text
       xml:space="preserve"
       style="font-style:normal;font-weight:normal;font-size:13.5525px;line-height:1.25;font-family:sans-serif;fill:#000000;fill-opacity:1;stroke:none;stroke-width:0.847032"
       x="267.5603"
       y="51.816677"
       id="text1064-5-6"><tspan
         sodipodi:role="line"
         id="tspan1062-9-5"
         x="267.5603"
         y="51.816677"
         style="font-size:13.5525px;stroke-width:0.847032">(...)</tspan></text>
    <text
       xml:space="preserve"
       id="text2661"
       style="font-style:normal;font-weight:normal;font-size:10.5833px;line-height:1.25;font-family:sans-serif;white-space:pre;shape-inside:url(#rect2663);fill:#000000;fill-opacity:1;stroke:none" />
    <path
       style="fill:none;stroke:#000000;stroke-width:0.847033px;stroke-linecap:butt;stroke-linejoin:miter;stroke-opacity:1;marker-start:url(#marker1765-6)"
       d="m 76.716328,59.986867 c 0,2.397724 0,4.795448 0,7.193171"
       id="path1226-3-7" />
    <text
       xml:space="preserve"
       style="font-style:normal;font-weight:normal;font-size:6.77628px;line-height:1.25;font-family:sans-serif;fill:#000000;fill-opacity:1;stroke:none;stroke-width:0.847033"
       x="52.120678"
       y="75.165123"
       id="text1092-2-6"><tspan
         sodipodi:role="line"
         x="52.120678"
         y="75.165123"
         style="font-size:6.77628px;stroke-width:0.847033"
         id="tspan2769-5">0x7ffe78c958fc</tspan></text>
    <rect
       style="fill:#ff0000;fill-opacity:0.22016;stroke:#ff0000;stroke-width:0.811562;stroke-miterlimit:4;stroke-dasharray:none;stroke-dashoffset:0;stroke-opacity:1"
       id="rect5889"
       width="43.245861"
       height="21.19541"
       x="69.77916"
       y="37.208832" />
    <rect
       style="fill:#0000c8;fill-opacity:0.22016;stroke:#0000b4;stroke-width:0.811562;stroke-miterlimit:4;stroke-dasharray:none;stroke-dashoffset:0;stroke-opacity:1"
       id="rect5889-0"
       width="84.851067"
       height="22.364513"
       x="158.61932"
       y="36.332661"
       ry="0" />
    <text
       xml:space="preserve"
       id="text5891"
       style="font-style:normal;font-variant:normal;font-weight:bold;font-stretch:normal;font-size:8.46667px;line-height:1.25;font-family:sans-serif;-inkscape-font-specification:'sans-serif Bold';white-space:pre;shape-inside:url(#rect5893);fill:#ff0000"
       transform="translate(-31.281334,7.7422099)"><tspan
         x="119.33594"
         y="27.63555"
         id="tspan1604">A</tspan></text>
    <text
       xml:space="preserve"
       id="text5891-6"
       style="font-style:normal;font-variant:normal;font-weight:bold;font-stretch:normal;font-size:8.46667px;line-height:1.25;font-family:sans-serif;-inkscape-font-specification:'sans-serif Bold';white-space:pre;shape-inside:url(#rect5893-3);fill:#0000c8"
       transform="translate(78.965339,7.2292409)"><tspan
         x="119.33594"
         y="27.63555"
         id="tspan1606">P</tspan></text>
    <path
       style="fill:none;stroke:#000000;stroke-width:0.847;stroke-linecap:butt;stroke-linejoin:miter;stroke-miterlimit:4;stroke-dasharray:none;stroke-opacity:1"
       d="M 23.575308,38.258993 H 3.229848"
       id="path4220" />
    <path
       style="fill:none;stroke:#000000;stroke-width:0.847;stroke-linecap:butt;stroke-linejoin:miter;stroke-miterlimit:4;stroke-dasharray:none;stroke-opacity:1"
       d="M 3.229848,57.891586 V 38.258993"
       id="path4220-9"
       sodipodi:nodetypes="cc" />
    <path
       style="fill:none;stroke:#000000;stroke-width:0.847;stroke-linecap:butt;stroke-linejoin:miter;stroke-miterlimit:4;stroke-dasharray:none;stroke-opacity:1"
       d="m 3.229848,57.891586 h 20.34546"
       id="path4222" />
    <path
       style="fill:none;stroke:#000000;stroke-width:0.847;stroke-linecap:butt;stroke-linejoin:miter;stroke-miterlimit:4;stroke-dasharray:none;stroke-opacity:1"
       d="M 49.962026,57.891587 122.69796,57.593512"
       id="path4222-2"
       sodipodi:nodetypes="cc" />
    <path
       style="fill:none;stroke:#000000;stroke-width:0.847;stroke-linecap:butt;stroke-linejoin:miter;stroke-miterlimit:4;stroke-dasharray:none;stroke-opacity:1"
       d="M 49.962026,38.258992 122.69796,37.960917"
       id="path4222-2-7"
       sodipodi:nodetypes="cc" />
    <path
       style="fill:none;stroke:#000000;stroke-width:0.847033px;stroke-linecap:butt;stroke-linejoin:miter;stroke-opacity:1"
       d="m 159.26865,52.369394 0.0704,4.663122"
       id="path36-7-9-0"
       sodipodi:nodetypes="cc" />
    <path
       style="fill:none;stroke:#000000;stroke-width:0.847033px;stroke-linecap:butt;stroke-linejoin:miter;stroke-opacity:1"
       d="m 169.65951,52.432266 0.0704,4.663122"
       id="path36-7-9-3-6"
       sodipodi:nodetypes="cc" />
    <path
       style="fill:none;stroke:#000000;stroke-width:0.847033px;stroke-linecap:butt;stroke-linejoin:miter;stroke-opacity:1"
       d="m 180.05036,52.417655 0.0704,4.663122"
       id="path36-7-9-6-2"
       sodipodi:nodetypes="cc" />
    <path
       style="fill:none;stroke:#000000;stroke-width:0.847033px;stroke-linecap:butt;stroke-linejoin:miter;stroke-opacity:1"
       d="m 190.44122,52.429619 0.0704,4.663122"
       id="path36-7-9-7-6"
       sodipodi:nodetypes="cc" />
    <path
       style="fill:none;stroke:#000000;stroke-width:0.847033px;stroke-linecap:butt;stroke-linejoin:miter;stroke-opacity:1"
       d="m 200.83206,52.473923 0.0704,4.663122"
       id="path36-7-9-5-1"
       sodipodi:nodetypes="cc" />
    <path
       style="fill:none;stroke:#000000;stroke-width:0.847033px;stroke-linecap:butt;stroke-linejoin:miter;stroke-opacity:1"
       d="m 211.2229,52.396542 0.0704,4.663122"
       id="path36-7-9-35-8"
       sodipodi:nodetypes="cc" />
    <path
       style="fill:none;stroke:#000000;stroke-width:0.847033px;stroke-linecap:butt;stroke-linejoin:miter;stroke-opacity:1"
       d="m 221.75021,52.632315 0.0704,4.663122"
       id="path36-7-9-62-7"
       sodipodi:nodetypes="cc" />
    <path
       style="fill:none;stroke:#000000;stroke-width:0.847;stroke-linecap:butt;stroke-linejoin:miter;stroke-miterlimit:4;stroke-dasharray:none;stroke-opacity:1"
       d="m 149.08467,57.593512 72.73594,-0.298075"
       id="path4222-2-75"
       sodipodi:nodetypes="cc" />
    <path
       style="fill:none;stroke:#000000;stroke-width:0.847;stroke-linecap:butt;stroke-linejoin:miter;stroke-miterlimit:4;stroke-dasharray:none;stroke-opacity:1"
       d="m 149.08467,37.960917 72.73594,-0.298075"
       id="path4222-2-7-9"
       sodipodi:nodetypes="cc" />
    <path
       style="fill:none;stroke:#000000;stroke-width:0.847033px;stroke-linecap:butt;stroke-linejoin:miter;stroke-opacity:1"
       d="m 232.00458,52.071319 0.0704,4.663122"
       id="path36-7-9-9"
       sodipodi:nodetypes="cc" />
    <path
       style="fill:none;stroke:#000000;stroke-width:0.847033px;stroke-linecap:butt;stroke-linejoin:miter;stroke-opacity:1"
       d="m 242.39545,52.134191 0.0704,4.663122"
       id="path36-7-9-3-7"
       sodipodi:nodetypes="cc" />
    <path
       style="fill:none;stroke:#000000;stroke-width:0.847033px;stroke-linecap:butt;stroke-linejoin:miter;stroke-opacity:1"
       d="m 252.7863,52.11958 0.0704,4.663122"
       id="path36-7-9-6-3"
       sodipodi:nodetypes="cc" />
    <path
       style="fill:none;stroke:#000000;stroke-width:0.847033px;stroke-linecap:butt;stroke-linejoin:miter;stroke-opacity:1"
       d="m 263.17715,52.131544 0.0704,4.663122"
       id="path36-7-9-7-61"
       sodipodi:nodetypes="cc" />
    <path
       style="fill:none;stroke:#000000;stroke-width:0.847033px;stroke-linecap:butt;stroke-linejoin:miter;stroke-opacity:1"
       d="M 294.55654,37.364767 V 56.997362"
       id="path36-7-9-62-3"
       sodipodi:nodetypes="cc" />
    <path
       style="fill:none;stroke:#000000;stroke-width:0.847;stroke-linecap:butt;stroke-linejoin:miter;stroke-miterlimit:4;stroke-dasharray:none;stroke-opacity:1"
       d="m 221.82061,57.295437 72.73593,-0.298075"
       id="path4222-2-4"
       sodipodi:nodetypes="cc" />
    <path
       style="fill:none;stroke:#000000;stroke-width:0.847;stroke-linecap:butt;stroke-linejoin:miter;stroke-miterlimit:4;stroke-dasharray:none;stroke-opacity:1"
       d="m 221.82061,37.662842 72.73593,-0.298075"
       id="path4222-2-7-5"
       sodipodi:nodetypes="cc" />
    <text
       xml:space="preserve"
       id="text5891-61"
       style="font-style:normal;font-variant:normal;font-weight:bold;font-stretch:normal;font-size:8.46667px;line-height:1.25;font-family:sans-serif;-inkscape-font-specification:'sans-serif Bold';white-space:pre;shape-inside:url(#rect5893-0);fill:#ff0000"
       transform="translate(-34.718833,21.490781)"><tspan
         x="119.33594"
         y="27.63555"
         id="tspan1608">42</tspan></text>
    <text
       xml:space="preserve"
       id="text5891-6-7"
       style="font-style:normal;font-variant:normal;font-weight:bold;font-stretch:normal;font-size:8.46667px;line-height:1.25;font-family:sans-serif;-inkscape-font-specification:'sans-serif Bold';white-space:pre;shape-inside:url(#rect5893-3-4);fill:#0000c8"
       transform="translate(45.4946,20.527051)"><tspan
         x="119.33594"
         y="27.63555"
         id="tspan1610">0x7ffe78c958fc</tspan></text>
  </g>
</svg>
