<?xml version="1.0" encoding="UTF-8" standalone="no"?>
<svg
   xmlns:dc="http://purl.org/dc/elements/1.1/"
   xmlns:cc="http://creativecommons.org/ns#"
   xmlns:rdf="http://www.w3.org/1999/02/22-rdf-syntax-ns#"
   xmlns:svg="http://www.w3.org/2000/svg"
   xmlns="http://www.w3.org/2000/svg"
   xmlns:sodipodi="http://sodipodi.sourceforge.net/DTD/sodipodi-0.dtd"
   xmlns:inkscape="http://www.inkscape.org/namespaces/inkscape"
   width="297mm"
   height="210mm"
   viewBox="0 0 297 210"
   version="1.1"
   id="svg8"
   inkscape:version="1.0.2 (e86c870879, 2021-01-15)"
   sodipodi:docname="mmu.svg">
  <defs
     id="defs2">
    <rect
       x="-0.0093737651"
       y="-50.203451"
       width="28.557978"
       height="8.7761157"
       id="rect1487" />
    <rect
       x="-0.0093737654"
       y="-50.203449"
       width="28.557978"
       height="8.7761154"
       id="rect1487-3" />
    <rect
       x="-0.0093737654"
       y="-50.203449"
       width="28.557978"
       height="8.7761154"
       id="rect1500" />
    <rect
       x="-0.0093737654"
       y="-50.203449"
       width="28.557978"
       height="8.7761154"
       id="rect1487-3-7" />
    <rect
       x="-0.0093737654"
       y="-50.203449"
       width="28.557978"
       height="8.7761154"
       id="rect1536" />
    <rect
       x="-0.0093737654"
       y="-50.203449"
       width="28.557978"
       height="8.7761154"
       id="rect1487-35" />
    <rect
       x="-0.0093737654"
       y="-50.203449"
       width="28.557978"
       height="8.7761154"
       id="rect1573" />
    <rect
       x="-0.0093737654"
       y="-50.203449"
       width="53.943336"
       height="6.0650554"
       id="rect1487-9" />
    <rect
       x="-0.0093737654"
       y="-50.203449"
       width="28.557978"
       height="8.7761154"
       id="rect1609" />
    <rect
       x="-0.0093737654"
       y="-50.203449"
       width="53.943336"
       height="6.0650554"
       id="rect1487-9-2" />
    <rect
       x="-0.0093737654"
       y="-50.203449"
       width="53.943336"
       height="6.0650554"
       id="rect3614" />
  </defs>
  <sodipodi:namedview
     id="base"
     pagecolor="#ffffff"
     bordercolor="#666666"
     borderopacity="1.0"
     inkscape:pageopacity="0.0"
     inkscape:pageshadow="2"
     inkscape:zoom="1.6239665"
     inkscape:cx="698.61304"
     inkscape:cy="361.84928"
     inkscape:document-units="mm"
     inkscape:current-layer="layer1"
     inkscape:document-rotation="0"
     showgrid="false"
     inkscape:window-width="3836"
     inkscape:window-height="2097"
     inkscape:window-x="0"
     inkscape:window-y="61"
     inkscape:window-maximized="0" />
  <metadata
     id="metadata5">
    <rdf:RDF>
      <cc:Work
         rdf:about="">
        <dc:format>image/svg+xml</dc:format>
        <dc:type
           rdf:resource="http://purl.org/dc/dcmitype/StillImage" />
        <dc:title></dc:title>
      </cc:Work>
    </rdf:RDF>
  </metadata>
  <g
     inkscape:label="Calque 1"
     inkscape:groupmode="layer"
     id="layer1">
    <rect
       style="fill:#ff0000;fill-opacity:0.22016;stroke:#ff0000;stroke-width:0.486382"
       id="rect833"
       width="39.988049"
       height="162.98712"
       x="68.715401"
       y="19.8547"
       rx="4.6454883" />
    <rect
       style="fill:#0000ff;fill-opacity:0.22016;stroke:#0000ff;stroke-width:0.486382"
       id="rect833-3"
       width="39.988049"
       height="162.98712"
       x="190.9061"
       y="19.8547"
       rx="4.6454883" />
    <rect
       style="fill:#ff0000;fill-opacity:0.22016;stroke:#ff0000;stroke-width:0.486382"
       id="rect833-6"
       width="39.988049"
       height="15.731958"
       x="68.857567"
       y="37.044155"
       rx="4.4612098" />
    <rect
       style="fill:#0000ff;fill-opacity:0.22016;stroke:#0000ff;stroke-width:0.486382"
       id="rect833-6-7"
       width="39.988049"
       height="15.731958"
       x="190.9061"
       y="161.11443"
       rx="4.4612098" />
    <rect
       style="fill:#ff0000;fill-opacity:0.22016;stroke:#ff0000;stroke-width:0.486382"
       id="rect833-6-5"
       width="39.988045"
       height="37.657063"
       x="68.833473"
       y="80.087814"
       rx="4.4612098" />
    <rect
       style="fill:#0000ff;fill-opacity:0.22016;stroke:#0000ff;stroke-width:0.486382"
       id="rect833-6-5-3"
       width="39.988045"
       height="37.657063"
       x="190.9061"
       y="115.04082"
       rx="4.4612098" />
    <rect
       style="fill:#ff0000;fill-opacity:0.22016;stroke:#ff0000;stroke-width:0.486382"
       id="rect833-6-56"
       width="39.988049"
       height="15.731958"
       x="68.852913"
       y="129.13007"
       rx="4.4612098" />
    <rect
       style="fill:#0000ff;fill-opacity:0.22016;stroke:#0000ff;stroke-width:0.486382"
       id="rect833-6-2"
       width="39.988049"
       height="15.731958"
       x="190.9028"
       y="96.261658"
       rx="4.4612098" />
    <g
       id="g1483"
       transform="matrix(0.66000615,0,0,0.66000615,84.935894,18.523394)">
      <circle
         style="fill:#ffffff;fill-opacity:1;stroke:#1a1a1a;stroke-width:0.529167"
         id="path2118"
         cx="219.43953"
         cy="4.1381702"
         r="12.660189" />
      <g
         id="ram"
         transform="matrix(0.03087913,0,0,0.03087913,211.36489,-4.7097212)">
        <g
           id="g1339">
          <path
             fill="#a0d468"
             d="M 278.625,361.594 256,338.969 v 0 c -4.172,-4.156 -4.172,-10.922 0,-15.094 4.156,-4.156 10.922,-4.156 15.078,0 v 0 L 293.703,346.516 512,128.227 459.203,75.43 c -4.172,4.164 -10.922,4.164 -15.094,0 -4.156,-4.164 -4.156,-10.922 0,-15.086 l -7.531,-7.539 c -4.172,4.164 -10.922,4.164 -15.094,-0.008 -4.156,-4.164 -4.156,-10.914 0,-15.078 L 383.781,0 0,383.781 37.703,421.5 c 4.172,-4.172 10.922,-4.172 15.094,0 4.156,4.156 4.156,10.906 0,15.078 l 7.531,7.547 c 4.172,-4.172 10.922,-4.172 15.094,0 4.156,4.156 4.172,10.906 0,15.078 L 128.219,512 Z"
             id="path1337" />
        </g>
        <g
           id="g1345">
          <polygon
             fill="#8cc153"
             points="105.594,489.375 128.219,512 278.625,361.594 256,338.969 "
             id="polygon1341" />
          <polygon
             fill="#8cc153"
             points="489.375,105.602 271.078,323.875 293.703,346.516 512,128.227 "
             id="polygon1343" />
        </g>
        <g
           id="g1377">
          <path
             fill="#ffce54"
             d="m 482.266,142.867 c -4.156,4.164 -4.156,10.922 0,15.086 l 15.094,-15.086 c -4.172,-4.164 -10.922,-4.164 -15.094,0 z"
             id="path1347" />
          <path
             fill="#ffce54"
             d="m 459.641,165.492 c -4.156,4.164 -4.156,10.922 0,15.086 l 15.094,-15.086 c -4.173,-4.164 -10.923,-4.164 -15.094,0 z"
             id="path1349" />
          <path
             fill="#ffce54"
             d="m 437.016,188.117 c -4.172,4.172 -4.172,10.922 0,15.086 l 15.078,-15.086 c -4.156,-4.164 -10.906,-4.164 -15.078,0 z"
             id="path1351" />
          <path
             fill="#ffce54"
             d="m 414.391,210.75 c -4.172,4.164 -4.172,10.922 0,15.086 l 15.078,-15.086 c -4.157,-4.164 -10.922,-4.164 -15.078,0 z"
             id="path1353" />
          <path
             fill="#ffce54"
             d="m 391.766,233.375 c -4.172,4.164 -4.172,10.922 0,15.086 l 15.078,-15.086 c -4.156,-4.164 -10.922,-4.164 -15.078,0 z"
             id="path1355" />
          <path
             fill="#ffce54"
             d="m 369.125,256 c -4.156,4.172 -4.156,10.922 0,15.086 L 384.219,256 c -4.172,-4.164 -10.922,-4.164 -15.094,0 z"
             id="path1357" />
          <path
             fill="#ffce54"
             d="m 346.5,278.625 c -4.156,4.172 -4.156,10.938 0,15.094 l 15.094,-15.094 c -4.172,-4.156 -10.922,-4.156 -15.094,0 z"
             id="path1359" />
          <path
             fill="#ffce54"
             d="m 323.875,301.25 c -4.156,4.172 -4.156,10.938 0,15.094 l 15.094,-15.094 c -4.172,-4.156 -10.922,-4.156 -15.094,0 z"
             id="path1361" />
          <path
             fill="#ffce54"
             d="m 301.25,323.875 c -4.156,4.188 -4.172,10.938 0,15.094 l 15.094,-15.094 c -4.172,-4.156 -10.922,-4.156 -15.094,0 z"
             id="path1363" />
          <path
             fill="#ffce54"
             d="m 256,369.141 c -4.172,4.172 -4.172,10.922 0,15.078 l 15.078,-15.078 c -4.156,-4.172 -10.922,-4.172 -15.078,0 z"
             id="path1365" />
          <path
             fill="#ffce54"
             d="m 233.375,391.766 c -4.172,4.172 -4.172,10.922 0,15.078 l 15.078,-15.078 c -4.172,-4.172 -10.922,-4.172 -15.078,0 z"
             id="path1367" />
          <path
             fill="#ffce54"
             d="m 210.734,414.406 c -4.156,4.156 -4.156,10.906 0,15.078 l 15.094,-15.078 c -4.172,-4.187 -10.922,-4.187 -15.094,0 z"
             id="path1369" />
          <path
             fill="#ffce54"
             d="m 188.109,437.031 c -4.156,4.156 -4.156,10.906 0,15.078 l 15.094,-15.078 c -4.172,-4.172 -10.922,-4.172 -15.094,0 z"
             id="path1371" />
          <path
             fill="#ffce54"
             d="m 165.484,459.656 c -4.156,4.156 -4.156,10.906 0,15.078 l 15.094,-15.078 c -4.172,-4.172 -10.922,-4.172 -15.094,0 z"
             id="path1373" />
          <path
             fill="#ffce54"
             d="m 142.859,482.281 c -4.172,4.156 -4.172,10.906 0,15.078 l 15.078,-15.078 c -4.156,-4.172 -10.906,-4.172 -15.078,0 z"
             id="path1375" />
        </g>
        <rect
           x="84.259003"
           y="362.44699"
           transform="matrix(0.7071,0.7071,-0.7071,0.7071,302.302,37.7409)"
           fill="#656d78"
           width="42.668999"
           height="42.668999"
           id="rect1379" />
        <polygon
           fill="#656d78"
           points="165.938,293.281 196.094,323.438 165.938,353.609 135.766,323.438 "
           id="polygon1381" />
        <polygon
           fill="#656d78"
           points="256.438,202.766 286.609,232.93 256.438,263.102 226.266,232.93 "
           id="polygon1383" />
        <rect
           x="295.44699"
           y="151.259"
           transform="matrix(0.7071,0.7071,-0.7071,0.7071,214.8253,-173.4466)"
           fill="#656d78"
           width="42.668999"
           height="42.668999"
           id="rect1385" />
        <g
           id="g1395">
          <path
             fill="#434a54"
             d="m 60.328,383.781 45.266,45.25 45.25,-45.25 -45.25,-45.25 z m 45.266,15.094 -15.094,-15.094 15.094,-15.094 15.078,15.094 z"
             id="path1387" />
          <path
             fill="#434a54"
             d="m 120.672,323.438 45.266,45.25 45.25,-45.25 -45.25,-45.25 z m 45.266,15.093 -15.094,-15.094 15.094,-15.078 15.078,15.078 z"
             id="path1389" />
          <path
             fill="#434a54"
             d="m 211.188,232.93 45.25,45.258 45.25,-45.258 -45.25,-45.25 z m 45.25,15.086 -15.078,-15.086 15.078,-15.086 15.094,15.086 z"
             id="path1391" />
          <path
             fill="#434a54"
             d="m 316.781,127.336 -45.25,45.258 45.25,45.25 45.25,-45.25 z m -15.093,45.258 15.094,-15.086 15.078,15.086 -15.078,15.086 z"
             id="path1393" />
        </g>
        <polygon
           fill="#656d78"
           points="377.125,82.086 407.281,112.25 377.125,142.422 346.953,112.25 "
           id="polygon1397" />
        <path
           fill="#434a54"
           d="m 377.125,67 -45.266,45.25 45.266,45.258 45.25,-45.258 z m 0,60.336 -15.094,-15.086 15.094,-15.078 15.078,15.078 z"
           id="path1399" />
      </g>
    </g>
    <text
       xml:space="preserve"
       id="text1485"
       style="font-size:4.23333px;line-height:1.25;font-family:sans-serif;white-space:pre;shape-inside:url(#rect1487);fill:#ff0000"
       transform="translate(47.14681,69.893894)"><tspan
         sodipodi:role="line"
         id="tspan1489"
         style="fill:#ff0000">0xFFF ...</tspan></text>
    <text
       xml:space="preserve"
       id="text1485-6"
       style="font-size:4.23333px;line-height:1.25;font-family:sans-serif;white-space:pre;shape-inside:url(#rect1487-3);fill:#ff0000"
       transform="translate(49.970407,228.04783)"><tspan
         x="-0.009765625"
         y="-46.389935"
         id="tspan1513"><tspan
           style="fill:#ff0000"
           id="tspan1511">0x0000</tspan></tspan></text>
    <text
       xml:space="preserve"
       id="text1485-6-5"
       style="font-size:4.23333px;line-height:1.25;font-family:sans-serif;white-space:pre;shape-inside:url(#rect1487-3-7);fill:#0000ff"
       transform="translate(171.46741,229.99639)"><tspan
         x="-0.009765625"
         y="-46.389935"
         id="tspan1550"
         style="fill:#0000ff"><tspan
           style="fill:#0000ff"
           id="tspan1548">0x0000</tspan></tspan></text>
    <text
       xml:space="preserve"
       id="text1485-62"
       style="font-size:4.23333px;line-height:1.25;font-family:sans-serif;white-space:pre;shape-inside:url(#rect1487-35);fill:#0000ff"
       transform="translate(168.81087,69.718142)"><tspan
         x="-0.009765625"
         y="-46.389935"
         id="tspan1586"
         style="fill:#0000ff"><tspan
           style="fill:#0000ff"
           id="tspan1584">0xFFF ...</tspan></tspan></text>
    <text
       xml:space="preserve"
       id="text1485-1"
       style="font-size:4.23333px;line-height:1.25;font-family:sans-serif;white-space:pre;shape-inside:url(#rect1487-9);fill:#ff0000"
       transform="translate(66.571724,242.14832)"><tspan
         x="-0.009765625"
         y="-46.389935"
         id="tspan1622"><tspan
           style="fill:#ff0000"
           id="tspan1620">Espace mémoire virtuel</tspan></tspan></text>
    <text
       xml:space="preserve"
       id="text1485-1-7"
       style="font-size:4.23333px;line-height:1.25;font-family:sans-serif;white-space:pre;shape-inside:url(#rect1487-9-2);fill:#0000ff"
       transform="translate(206.2063,240.90019)"><tspan
         x="-0.009765625"
         y="-46.389935"
         id="tspan3628"
         style="fill:#0000ff">RAM<tspan
   style="fill:#0000ff"
   id="tspan3626" /></tspan></text>
    <path
       d="m 170.44216,268.17981 c 0.89918,0.73717 1.62409,1.66419 2.12275,2.71456 1.27046,2.62025 1.27046,5.82652 1.27046,8.9271 0,6.43294 0.26975,9.525 6.35,9.525 1.169,0 2.11666,0.94767 2.11666,2.11667 0,1.169 -0.94766,2.11667 -2.11666,2.11667 -4.6253,0 -7.7587,-1.62548 -9.31287,-4.83123 -1.27047,-2.62026 -1.27047,-5.82652 -1.27047,-8.92711 0,-6.43294 -0.26975,-9.525 -6.35,-9.525 -1.169,0 -2.11666,-0.94766 -2.11666,-2.11666 0,-1.16901 0.94766,-2.11667 2.11666,-2.11667 6.08025,0 6.35,-3.09206 6.35,-9.525 0,-3.10059 0,-6.30685 1.27047,-8.9271 1.55417,-3.20575 4.68757,-4.83123 9.31287,-4.83123 1.169,0 2.11666,0.94766 2.11666,2.11666 0,1.16901 -0.94766,2.11667 -2.11666,2.11667 -6.08025,0 -6.35,3.09206 -6.35,9.525 0,3.10059 0,6.30685 -1.27047,8.9271 -0.49866,1.05037 -1.22357,1.97739 -2.12274,2.71457 z"
       id="path4391"
       sodipodi:nodetypes="ccsssscssssscsssscc"
       style="stroke-width:0.264583" />
  </g>
</svg>
