<?xml version="1.0" encoding="UTF-8" standalone="no"?>
<!-- Created with Inkscape (http://www.inkscape.org/) -->

<svg
   width="297mm"
   height="210mm"
   viewBox="0 0 297 210"
   version="1.1"
   id="svg5"
   inkscape:version="1.1 (c68e22c387, 2021-05-23)"
   sodipodi:docname="archi.svg"
   xmlns:inkscape="http://www.inkscape.org/namespaces/inkscape"
   xmlns:sodipodi="http://sodipodi.sourceforge.net/DTD/sodipodi-0.dtd"
   xmlns="http://www.w3.org/2000/svg"
   xmlns:svg="http://www.w3.org/2000/svg">
  <sodipodi:namedview
     id="namedview7"
     pagecolor="#ffffff"
     bordercolor="#666666"
     borderopacity="1.0"
     inkscape:pageshadow="2"
     inkscape:pageopacity="0.0"
     inkscape:pagecheckerboard="0"
     inkscape:document-units="mm"
     showgrid="false"
     inkscape:zoom="1.0973349"
     inkscape:cx="38.27455"
     inkscape:cy="396.41499"
     inkscape:window-width="3836"
     inkscape:window-height="2119"
     inkscape:window-x="0"
     inkscape:window-y="1119"
     inkscape:window-maximized="1"
     inkscape:current-layer="layer1"
     showguides="true"
     inkscape:guide-bbox="true" />
  <defs
     id="defs2">
    <rect
       x="127.49201"
       y="125.11442"
       width="126.95899"
       height="50.499214"
       id="rect2227" />
    <rect
       x="127.49201"
       y="125.11442"
       width="126.95899"
       height="50.499214"
       id="rect2227-3" />
    <rect
       x="127.49201"
       y="125.11442"
       width="126.95899"
       height="50.499214"
       id="rect2227-35" />
    <rect
       x="127.49201"
       y="125.11442"
       width="126.95899"
       height="50.499214"
       id="rect2227-35-3" />
    <rect
       x="127.49201"
       y="125.11442"
       width="126.95899"
       height="50.499214"
       id="rect2227-35-3-3" />
    <rect
       x="127.49201"
       y="125.11442"
       width="126.95899"
       height="50.499214"
       id="rect2227-35-9" />
    <rect
       x="127.49201"
       y="125.11442"
       width="126.95899"
       height="50.499214"
       id="rect2227-35-9-9" />
    <rect
       x="127.49201"
       y="125.11442"
       width="126.95899"
       height="50.499214"
       id="rect2227-35-9-6" />
    <rect
       x="127.49201"
       y="125.11442"
       width="126.95899"
       height="50.499214"
       id="rect2227-35-9-7" />
    <rect
       x="127.49201"
       y="125.11442"
       width="126.95899"
       height="50.499214"
       id="rect2227-35-3-3-7" />
  </defs>
  <g
     inkscape:label="Calque 1"
     inkscape:groupmode="layer"
     id="layer1">
    <g
       id="g3018-62"
       inkscape:label="RAM"
       transform="matrix(0.82735843,0,0,0.82735843,114.30304,4.7974289)"
       style="display:inline">
      <rect
         style="fill:#808080;fill-opacity:0.121991;stroke:#ff0000;stroke-width:0.765"
         id="rect339-9"
         width="46.953453"
         height="32.953465"
         x="23.841173"
         y="21.070242"
         rx="1.0000006" />
      <text
         xml:space="preserve"
         transform="matrix(0.26458333,0,0,0.26458333,2.9893398,-1.0677233)"
         id="text2225-1"
         style="font-style:normal;font-weight:normal;font-size:40px;line-height:1.25;font-family:sans-serif;white-space:pre;shape-inside:url(#rect2227-35);fill:#000000;fill-opacity:1;stroke:none"><tspan
           x="127.49219"
           y="160.50586"
           id="tspan38989">RAM</tspan></text>
    </g>
    <rect
       style="fill:#808080;fill-opacity:0.121991;stroke:#0000ff;stroke-width:0.632929"
       id="rect339-9-7"
       width="38.847336"
       height="27.264326"
       x="75.394081"
       y="66.441704"
       rx="0.8273589" />
    <text
       xml:space="preserve"
       transform="matrix(0.21890525,0,0,0.21890525,58.142141,48.125675)"
       id="text2225-1-5"
       style="font-style:normal;font-weight:normal;font-size:40px;line-height:1.25;font-family:sans-serif;white-space:pre;shape-inside:url(#rect2227-35-3);fill:#000000;fill-opacity:1;stroke:none"><tspan
         x="127.49219"
         y="160.50586"
         id="tspan38991">PCIe</tspan></text>
    <g
       id="g3018-62-6-5"
       inkscape:label="PCH"
       transform="matrix(0.82735843,0,0,0.82735843,115.04185,120.33372)"
       style="display:inline">
      <rect
         style="fill:#808080;fill-opacity:0.121991;stroke:#0000ff;stroke-width:0.765"
         id="rect339-9-7-6"
         width="43.987289"
         height="86.668304"
         x="24.431273"
         y="-12.370058"
         rx="1.0000006" />
      <text
         xml:space="preserve"
         transform="matrix(0.26458333,0,0,0.26458333,1.8276419,-7.6506026)"
         id="text2225-1-5-2"
         style="font-style:normal;font-weight:normal;font-size:40px;line-height:1.25;font-family:sans-serif;white-space:pre;shape-inside:url(#rect2227-35-3-3);fill:#000000;fill-opacity:1;stroke:none"><tspan
           x="127.49219"
           y="160.50586"
           id="tspan38993">PCH</tspan></text>
    </g>
    <g
       id="g3018"
       inkscape:label="CPU"
       style="display:inline"
       transform="matrix(0.82735843,0,0,0.82735843,114.30304,48.613653)">
      <rect
         style="fill:#808080;fill-opacity:0.121991;stroke:#ff0000;stroke-width:0.765"
         id="rect339"
         width="46.953453"
         height="32.953465"
         x="23.841173"
         y="21.070242"
         rx="1.0000006" />
      <text
         xml:space="preserve"
         transform="matrix(0.26458333,0,0,0.26458333,2.9893398,-1.0677233)"
         id="text2225"
         style="font-style:normal;font-weight:normal;font-size:40px;line-height:1.25;font-family:sans-serif;white-space:pre;shape-inside:url(#rect2227);fill:#000000;fill-opacity:1;stroke:none"><tspan
           x="127.49219"
           y="160.50586"
           id="tspan38995">CPU</tspan></text>
    </g>
    <g
       id="g3018-62-1"
       inkscape:label="SATA"
       transform="matrix(0.82735843,0,0,0.82735843,56.522227,91.994912)"
       style="display:inline">
      <rect
         style="fill:#808080;fill-opacity:0.121991;stroke:#0000ff;stroke-width:0.765"
         id="rect339-9-2"
         width="46.952999"
         height="32.953465"
         x="23.841173"
         y="21.070242"
         rx="1.0000006" />
      <text
         xml:space="preserve"
         transform="matrix(0.26458333,0,0,0.26458333,0.17274738,-1.0677226)"
         id="text2225-1-7"
         style="font-style:normal;font-weight:normal;font-size:40px;line-height:1.25;font-family:sans-serif;white-space:pre;shape-inside:url(#rect2227-35-9);fill:#000000;fill-opacity:1;stroke:none"><tspan
           x="127.49219"
           y="160.50586"
           id="tspan38997">SATA</tspan></text>
    </g>
    <g
       id="g3018-62-1-3"
       inkscape:label="PCI"
       transform="matrix(-0.82735843,0,0,0.82735843,252.22734,130.03169)"
       style="display:inline">
      <rect
         style="fill:#808080;fill-opacity:0.121991;stroke:#0000ff;stroke-width:0.765"
         id="rect339-9-2-6"
         width="46.952999"
         height="32.953465"
         x="21.69166"
         y="21.070242"
         rx="1.0000006" />
      <text
         xml:space="preserve"
         transform="matrix(-0.26458333,0,0,0.26458333,87.346982,-1.0677233)"
         id="text2225-1-7-0"
         style="font-style:normal;font-weight:normal;font-size:40px;line-height:1.25;font-family:sans-serif;white-space:pre;shape-inside:url(#rect2227-35-9-9);fill:#000000;fill-opacity:1;stroke:none"><tspan
           x="127.49219"
           y="160.50586"
           id="tspan38999">PCI</tspan></text>
    </g>
    <g
       id="g3018-62-1-2"
       inkscape:label="USB"
       transform="matrix(0.82735843,0,0,0.82735843,56.522229,130.0317)"
       style="display:inline">
      <rect
         style="fill:#808080;fill-opacity:0.121991;stroke:#0000ff;stroke-width:0.765"
         id="rect339-9-2-61"
         width="46.952999"
         height="32.953465"
         x="23.841173"
         y="21.070242"
         rx="1.0000006" />
      <text
         xml:space="preserve"
         transform="matrix(0.26458333,0,0,0.26458333,2.6377132,-1.0677226)"
         id="text2225-1-7-8"
         style="font-style:normal;font-weight:normal;font-size:40px;line-height:1.25;font-family:sans-serif;white-space:pre;shape-inside:url(#rect2227-35-9-6);fill:#000000;fill-opacity:1;stroke:none"><tspan
           x="127.49219"
           y="160.50586"
           id="tspan39001">USB</tspan></text>
    </g>
    <g
       id="g3018-62-1-9"
       inkscape:label="BIOS"
       transform="matrix(-0.82735843,0,0,0.82735843,255.94489,91.994907)"
       style="display:inline">
      <rect
         style="fill:#808080;fill-opacity:0.121991;stroke:#0000ff;stroke-width:0.765"
         id="rect339-9-2-2"
         width="46.952999"
         height="32.953465"
         x="26.184927"
         y="21.070242"
         rx="1.0000006" />
      <text
         xml:space="preserve"
         transform="matrix(-0.26458333,0,0,0.26458333,96.333512,-1.0677233)"
         id="text2225-1-7-02"
         style="font-style:normal;font-weight:normal;font-size:40px;line-height:1.25;font-family:sans-serif;white-space:pre;shape-inside:url(#rect2227-35-9-7);fill:#000000;fill-opacity:1;stroke:none"><tspan
           x="127.49219"
           y="160.50586"
           id="tspan39003">BIOS</tspan></text>
    </g>
    <g
       id="g4555"
       transform="matrix(0.60038209,0,0,0.43190451,140.25483,61.39808)">
      <g
         id="g4382"
         transform="translate(0,-3.1750001)">
        <path
           style="fill:none;stroke:#000000;stroke-width:0.264583px;stroke-linecap:butt;stroke-linejoin:miter;stroke-opacity:1"
           d="m 14.777768,99.298989 7.179249,11.344361"
           id="path3829" />
        <path
           style="fill:none;stroke:#000000;stroke-width:0.264583px;stroke-linecap:butt;stroke-linejoin:miter;stroke-opacity:1"
           d="m 29.136266,99.29899 -7.179249,11.34436"
           id="path3829-3" />
        <path
           style="fill:none;stroke:#000000;stroke-width:0.264583px;stroke-linecap:butt;stroke-linejoin:miter;stroke-opacity:1"
           d="m 14.777768,99.298989 h 3.715013"
           id="path4161" />
        <path
           style="fill:none;stroke:#000000;stroke-width:0.264583px;stroke-linecap:butt;stroke-linejoin:miter;stroke-opacity:1"
           d="m 25.421253,99.29899 h 3.715013"
           id="path4161-7" />
      </g>
      <g
         id="g4382-5"
         transform="matrix(1,0,0,-1,0.04822621,189.27398)">
        <path
           style="fill:none;stroke:#000000;stroke-width:0.264583px;stroke-linecap:butt;stroke-linejoin:miter;stroke-opacity:1"
           d="m 14.777768,99.298989 7.179249,11.344361"
           id="path3829-9" />
        <path
           style="fill:none;stroke:#000000;stroke-width:0.264583px;stroke-linecap:butt;stroke-linejoin:miter;stroke-opacity:1"
           d="m 29.136266,99.29899 -7.179249,11.34436"
           id="path3829-3-2" />
        <path
           style="fill:none;stroke:#000000;stroke-width:0.264583px;stroke-linecap:butt;stroke-linejoin:miter;stroke-opacity:1"
           d="m 14.777768,99.298989 h 3.715013"
           id="path4161-2" />
        <path
           style="fill:none;stroke:#000000;stroke-width:0.264583px;stroke-linecap:butt;stroke-linejoin:miter;stroke-opacity:1"
           d="m 25.421253,99.29899 h 3.715013"
           id="path4161-7-8" />
      </g>
      <path
         style="fill:none;stroke:#000000;stroke-width:0.264583px;stroke-linecap:butt;stroke-linejoin:miter;stroke-opacity:1"
         d="m 18.541007,89.97499 -0.04823,6.148999"
         id="path4459" />
      <path
         style="fill:none;stroke:#000000;stroke-width:0.264583px;stroke-linecap:butt;stroke-linejoin:miter;stroke-opacity:1"
         d="m 25.469479,89.974988 -0.04823,6.149001"
         id="path4461" />
    </g>
    <g
       id="g4555-9"
       transform="matrix(0.60038209,0,0,0.43190451,140.25483,17.581853)">
      <g
         id="g4382-7"
         transform="translate(0,-3.1750001)">
        <path
           style="fill:none;stroke:#000000;stroke-width:0.264583px;stroke-linecap:butt;stroke-linejoin:miter;stroke-opacity:1"
           d="m 14.777768,99.298989 7.179249,11.344361"
           id="path3829-36" />
        <path
           style="fill:none;stroke:#000000;stroke-width:0.264583px;stroke-linecap:butt;stroke-linejoin:miter;stroke-opacity:1"
           d="m 29.136266,99.29899 -7.179249,11.34436"
           id="path3829-3-1" />
        <path
           style="fill:none;stroke:#000000;stroke-width:0.264583px;stroke-linecap:butt;stroke-linejoin:miter;stroke-opacity:1"
           d="m 14.777768,99.298989 h 3.715013"
           id="path4161-29" />
        <path
           style="fill:none;stroke:#000000;stroke-width:0.264583px;stroke-linecap:butt;stroke-linejoin:miter;stroke-opacity:1"
           d="m 25.421253,99.29899 h 3.715013"
           id="path4161-7-3" />
      </g>
      <g
         id="g4382-5-1"
         transform="matrix(1,0,0,-1,0.04822621,189.27398)">
        <path
           style="fill:none;stroke:#000000;stroke-width:0.264583px;stroke-linecap:butt;stroke-linejoin:miter;stroke-opacity:1"
           d="m 14.777768,99.298989 7.179249,11.344361"
           id="path3829-9-9" />
        <path
           style="fill:none;stroke:#000000;stroke-width:0.264583px;stroke-linecap:butt;stroke-linejoin:miter;stroke-opacity:1"
           d="m 29.136266,99.29899 -7.179249,11.34436"
           id="path3829-3-2-4" />
        <path
           style="fill:none;stroke:#000000;stroke-width:0.264583px;stroke-linecap:butt;stroke-linejoin:miter;stroke-opacity:1"
           d="m 14.777768,99.298989 h 3.715013"
           id="path4161-2-7" />
        <path
           style="fill:none;stroke:#000000;stroke-width:0.264583px;stroke-linecap:butt;stroke-linejoin:miter;stroke-opacity:1"
           d="m 25.421253,99.29899 h 3.715013"
           id="path4161-7-8-8" />
      </g>
      <path
         style="fill:none;stroke:#000000;stroke-width:0.264583px;stroke-linecap:butt;stroke-linejoin:miter;stroke-opacity:1"
         d="m 18.541007,89.97499 -0.04823,6.148999"
         id="path4459-4" />
      <path
         style="fill:none;stroke:#000000;stroke-width:0.264583px;stroke-linecap:butt;stroke-linejoin:miter;stroke-opacity:1"
         d="m 25.469479,89.974988 -0.04823,6.149001"
         id="path4461-5" />
    </g>
    <g
       id="g4555-9-0"
       transform="matrix(0,-0.60038209,0.43190451,0,84.274654,93.270947)">
      <g
         id="g4382-7-3"
         transform="translate(0,-3.1750001)">
        <path
           style="fill:none;stroke:#000000;stroke-width:0.264583px;stroke-linecap:butt;stroke-linejoin:miter;stroke-opacity:1"
           d="m 14.777768,99.298989 7.179249,11.344361"
           id="path3829-36-6" />
        <path
           style="fill:none;stroke:#000000;stroke-width:0.264583px;stroke-linecap:butt;stroke-linejoin:miter;stroke-opacity:1"
           d="m 29.136266,99.29899 -7.179249,11.34436"
           id="path3829-3-1-1" />
        <path
           style="fill:none;stroke:#000000;stroke-width:0.264583px;stroke-linecap:butt;stroke-linejoin:miter;stroke-opacity:1"
           d="m 14.777768,99.298989 h 3.715013"
           id="path4161-29-0" />
        <path
           style="fill:none;stroke:#000000;stroke-width:0.264583px;stroke-linecap:butt;stroke-linejoin:miter;stroke-opacity:1"
           d="m 25.421253,99.29899 h 3.715013"
           id="path4161-7-3-6" />
      </g>
      <g
         id="g4382-5-1-3"
         transform="matrix(1,0,0,-1,0.04822621,189.27398)">
        <path
           style="fill:none;stroke:#000000;stroke-width:0.264583px;stroke-linecap:butt;stroke-linejoin:miter;stroke-opacity:1"
           d="m 14.777768,99.298989 7.179249,11.344361"
           id="path3829-9-9-2" />
        <path
           style="fill:none;stroke:#000000;stroke-width:0.264583px;stroke-linecap:butt;stroke-linejoin:miter;stroke-opacity:1"
           d="m 29.136266,99.29899 -7.179249,11.34436"
           id="path3829-3-2-4-0" />
        <path
           style="fill:none;stroke:#000000;stroke-width:0.264583px;stroke-linecap:butt;stroke-linejoin:miter;stroke-opacity:1"
           d="m 14.777768,99.298989 h 3.715013"
           id="path4161-2-7-6" />
        <path
           style="fill:none;stroke:#000000;stroke-width:0.264583px;stroke-linecap:butt;stroke-linejoin:miter;stroke-opacity:1"
           d="m 25.421253,99.29899 h 3.715013"
           id="path4161-7-8-8-1" />
      </g>
      <path
         style="fill:none;stroke:#000000;stroke-width:0.264583px;stroke-linecap:butt;stroke-linejoin:miter;stroke-opacity:1"
         d="m 18.541007,89.97499 -0.04823,6.148999"
         id="path4459-4-5" />
      <path
         style="fill:none;stroke:#000000;stroke-width:0.264583px;stroke-linecap:butt;stroke-linejoin:miter;stroke-opacity:1"
         d="m 25.469479,89.974988 -0.04823,6.149001"
         id="path4461-5-5" />
    </g>
    <g
       id="g4555-9-0-8"
       transform="matrix(0,-0.60038209,0.43190451,0,23.810737,93.270947)">
      <g
         id="g4382-7-3-79"
         transform="translate(0,-3.1750001)">
        <path
           style="fill:none;stroke:#000000;stroke-width:0.264583px;stroke-linecap:butt;stroke-linejoin:miter;stroke-opacity:1"
           d="m 14.777768,99.298989 7.179249,11.344361"
           id="path3829-36-6-20" />
        <path
           style="fill:none;stroke:#000000;stroke-width:0.264583px;stroke-linecap:butt;stroke-linejoin:miter;stroke-opacity:1"
           d="m 29.136266,99.29899 -7.179249,11.34436"
           id="path3829-3-1-1-2" />
        <path
           style="fill:none;stroke:#000000;stroke-width:0.264583px;stroke-linecap:butt;stroke-linejoin:miter;stroke-opacity:1"
           d="m 14.777768,99.298989 h 3.715013"
           id="path4161-29-0-3" />
        <path
           style="fill:none;stroke:#000000;stroke-width:0.264583px;stroke-linecap:butt;stroke-linejoin:miter;stroke-opacity:1"
           d="m 25.421253,99.29899 h 3.715013"
           id="path4161-7-3-6-75" />
      </g>
      <g
         id="g4382-5-1-3-9"
         transform="matrix(1,0,0,-1,0.04822621,189.27398)">
        <path
           style="fill:none;stroke:#000000;stroke-width:0.264583px;stroke-linecap:butt;stroke-linejoin:miter;stroke-opacity:1"
           d="m 14.777768,99.298989 7.179249,11.344361"
           id="path3829-9-9-2-2" />
        <path
           style="fill:none;stroke:#000000;stroke-width:0.264583px;stroke-linecap:butt;stroke-linejoin:miter;stroke-opacity:1"
           d="m 29.136266,99.29899 -7.179249,11.34436"
           id="path3829-3-2-4-0-2" />
        <path
           style="fill:none;stroke:#000000;stroke-width:0.264583px;stroke-linecap:butt;stroke-linejoin:miter;stroke-opacity:1"
           d="m 14.777768,99.298989 h 3.715013"
           id="path4161-2-7-6-89" />
        <path
           style="fill:none;stroke:#000000;stroke-width:0.264583px;stroke-linecap:butt;stroke-linejoin:miter;stroke-opacity:1"
           d="m 25.421253,99.29899 h 3.715013"
           id="path4161-7-8-8-1-7" />
      </g>
      <path
         style="fill:none;stroke:#000000;stroke-width:0.264583px;stroke-linecap:butt;stroke-linejoin:miter;stroke-opacity:1"
         d="m 18.541007,89.97499 -0.04823,6.148999"
         id="path4459-4-5-36" />
      <path
         style="fill:none;stroke:#000000;stroke-width:0.264583px;stroke-linecap:butt;stroke-linejoin:miter;stroke-opacity:1"
         d="m 25.469479,89.974988 -0.04823,6.149001"
         id="path4461-5-5-12" />
    </g>
    <g
       id="g4555-9-0-9"
       transform="matrix(0,-0.60038209,0.43190451,0,23.810737,137.8823)">
      <g
         id="g4382-7-3-3"
         transform="translate(0,-3.1750001)">
        <path
           style="fill:none;stroke:#000000;stroke-width:0.264583px;stroke-linecap:butt;stroke-linejoin:miter;stroke-opacity:1"
           d="m 14.777768,99.298989 7.179249,11.344361"
           id="path3829-36-6-1" />
        <path
           style="fill:none;stroke:#000000;stroke-width:0.264583px;stroke-linecap:butt;stroke-linejoin:miter;stroke-opacity:1"
           d="m 29.136266,99.29899 -7.179249,11.34436"
           id="path3829-3-1-1-9" />
        <path
           style="fill:none;stroke:#000000;stroke-width:0.264583px;stroke-linecap:butt;stroke-linejoin:miter;stroke-opacity:1"
           d="m 14.777768,99.298989 h 3.715013"
           id="path4161-29-0-4" />
        <path
           style="fill:none;stroke:#000000;stroke-width:0.264583px;stroke-linecap:butt;stroke-linejoin:miter;stroke-opacity:1"
           d="m 25.421253,99.29899 h 3.715013"
           id="path4161-7-3-6-78" />
      </g>
      <g
         id="g4382-5-1-3-4"
         transform="matrix(1,0,0,-1,0.04822621,189.27398)">
        <path
           style="fill:none;stroke:#000000;stroke-width:0.264583px;stroke-linecap:butt;stroke-linejoin:miter;stroke-opacity:1"
           d="m 14.777768,99.298989 7.179249,11.344361"
           id="path3829-9-9-2-5" />
        <path
           style="fill:none;stroke:#000000;stroke-width:0.264583px;stroke-linecap:butt;stroke-linejoin:miter;stroke-opacity:1"
           d="m 29.136266,99.29899 -7.179249,11.34436"
           id="path3829-3-2-4-0-0" />
        <path
           style="fill:none;stroke:#000000;stroke-width:0.264583px;stroke-linecap:butt;stroke-linejoin:miter;stroke-opacity:1"
           d="m 14.777768,99.298989 h 3.715013"
           id="path4161-2-7-6-3" />
        <path
           style="fill:none;stroke:#000000;stroke-width:0.264583px;stroke-linecap:butt;stroke-linejoin:miter;stroke-opacity:1"
           d="m 25.421253,99.29899 h 3.715013"
           id="path4161-7-8-8-1-6" />
      </g>
      <path
         style="fill:none;stroke:#000000;stroke-width:0.264583px;stroke-linecap:butt;stroke-linejoin:miter;stroke-opacity:1"
         d="m 18.541007,89.97499 -0.04823,6.148999"
         id="path4459-4-5-10" />
      <path
         style="fill:none;stroke:#000000;stroke-width:0.264583px;stroke-linecap:butt;stroke-linejoin:miter;stroke-opacity:1"
         d="m 25.469479,89.974988 -0.04823,6.149001"
         id="path4461-5-5-6" />
    </g>
    <g
       id="g4555-9-0-4"
       transform="matrix(0,-0.60038209,0.43190451,0,84.986304,136.25678)">
      <g
         id="g4382-7-3-7"
         transform="translate(0,-3.1750001)">
        <path
           style="fill:none;stroke:#000000;stroke-width:0.264583px;stroke-linecap:butt;stroke-linejoin:miter;stroke-opacity:1"
           d="m 14.777768,99.298989 7.179249,11.344361"
           id="path3829-36-6-6" />
        <path
           style="fill:none;stroke:#000000;stroke-width:0.264583px;stroke-linecap:butt;stroke-linejoin:miter;stroke-opacity:1"
           d="m 29.136266,99.29899 -7.179249,11.34436"
           id="path3829-3-1-1-5" />
        <path
           style="fill:none;stroke:#000000;stroke-width:0.264583px;stroke-linecap:butt;stroke-linejoin:miter;stroke-opacity:1"
           d="m 14.777768,99.298989 h 3.715013"
           id="path4161-29-0-6" />
        <path
           style="fill:none;stroke:#000000;stroke-width:0.264583px;stroke-linecap:butt;stroke-linejoin:miter;stroke-opacity:1"
           d="m 25.421253,99.29899 h 3.715013"
           id="path4161-7-3-6-9" />
      </g>
      <g
         id="g4382-5-1-3-3"
         transform="matrix(1,0,0,-1,0.04822621,189.27398)">
        <path
           style="fill:none;stroke:#000000;stroke-width:0.264583px;stroke-linecap:butt;stroke-linejoin:miter;stroke-opacity:1"
           d="m 14.777768,99.298989 7.179249,11.344361"
           id="path3829-9-9-2-7" />
        <path
           style="fill:none;stroke:#000000;stroke-width:0.264583px;stroke-linecap:butt;stroke-linejoin:miter;stroke-opacity:1"
           d="m 29.136266,99.29899 -7.179249,11.34436"
           id="path3829-3-2-4-0-4" />
        <path
           style="fill:none;stroke:#000000;stroke-width:0.264583px;stroke-linecap:butt;stroke-linejoin:miter;stroke-opacity:1"
           d="m 14.777768,99.298989 h 3.715013"
           id="path4161-2-7-6-5" />
        <path
           style="fill:none;stroke:#000000;stroke-width:0.264583px;stroke-linecap:butt;stroke-linejoin:miter;stroke-opacity:1"
           d="m 25.421253,99.29899 h 3.715013"
           id="path4161-7-8-8-1-2" />
      </g>
      <path
         style="fill:none;stroke:#000000;stroke-width:0.264583px;stroke-linecap:butt;stroke-linejoin:miter;stroke-opacity:1"
         d="m 18.541007,89.97499 -0.04823,6.148999"
         id="path4459-4-5-5" />
      <path
         style="fill:none;stroke:#000000;stroke-width:0.264583px;stroke-linecap:butt;stroke-linejoin:miter;stroke-opacity:1"
         d="m 25.469479,89.974988 -0.04823,6.149001"
         id="path4461-5-5-4" />
    </g>
    <g
       id="g4555-9-0-7"
       transform="matrix(0,-0.60038209,0.43190451,0,84.986304,174.29358)">
      <g
         id="g4382-7-3-4"
         transform="translate(0,-3.1750001)">
        <path
           style="fill:none;stroke:#000000;stroke-width:0.264583px;stroke-linecap:butt;stroke-linejoin:miter;stroke-opacity:1"
           d="m 14.777768,99.298989 7.179249,11.344361"
           id="path3829-36-6-4" />
        <path
           style="fill:none;stroke:#000000;stroke-width:0.264583px;stroke-linecap:butt;stroke-linejoin:miter;stroke-opacity:1"
           d="m 29.136266,99.29899 -7.179249,11.34436"
           id="path3829-3-1-1-3" />
        <path
           style="fill:none;stroke:#000000;stroke-width:0.264583px;stroke-linecap:butt;stroke-linejoin:miter;stroke-opacity:1"
           d="m 14.777768,99.298989 h 3.715013"
           id="path4161-29-0-0" />
        <path
           style="fill:none;stroke:#000000;stroke-width:0.264583px;stroke-linecap:butt;stroke-linejoin:miter;stroke-opacity:1"
           d="m 25.421253,99.29899 h 3.715013"
           id="path4161-7-3-6-7" />
      </g>
      <g
         id="g4382-5-1-3-8"
         transform="matrix(1,0,0,-1,0.04822621,189.27398)">
        <path
           style="fill:none;stroke:#000000;stroke-width:0.264583px;stroke-linecap:butt;stroke-linejoin:miter;stroke-opacity:1"
           d="m 14.777768,99.298989 7.179249,11.344361"
           id="path3829-9-9-2-6" />
        <path
           style="fill:none;stroke:#000000;stroke-width:0.264583px;stroke-linecap:butt;stroke-linejoin:miter;stroke-opacity:1"
           d="m 29.136266,99.29899 -7.179249,11.34436"
           id="path3829-3-2-4-0-8" />
        <path
           style="fill:none;stroke:#000000;stroke-width:0.264583px;stroke-linecap:butt;stroke-linejoin:miter;stroke-opacity:1"
           d="m 14.777768,99.298989 h 3.715013"
           id="path4161-2-7-6-8" />
        <path
           style="fill:none;stroke:#000000;stroke-width:0.264583px;stroke-linecap:butt;stroke-linejoin:miter;stroke-opacity:1"
           d="m 25.421253,99.29899 h 3.715013"
           id="path4161-7-8-8-1-4" />
      </g>
      <path
         style="fill:none;stroke:#000000;stroke-width:0.264583px;stroke-linecap:butt;stroke-linejoin:miter;stroke-opacity:1"
         d="m 18.541007,89.97499 -0.04823,6.148999"
         id="path4459-4-5-3" />
      <path
         style="fill:none;stroke:#000000;stroke-width:0.264583px;stroke-linecap:butt;stroke-linejoin:miter;stroke-opacity:1"
         d="m 25.469479,89.974988 -0.04823,6.149001"
         id="path4461-5-5-1" />
    </g>
    <g
       id="g4555-9-0-49"
       transform="matrix(0,-0.60038209,-0.43190451,0,225.54169,136.25678)">
      <g
         id="g4382-7-3-2"
         transform="translate(0,-3.1750001)">
        <path
           style="fill:none;stroke:#000000;stroke-width:0.264583px;stroke-linecap:butt;stroke-linejoin:miter;stroke-opacity:1"
           d="m 14.777768,99.298989 7.179249,11.344361"
           id="path3829-36-6-0" />
        <path
           style="fill:none;stroke:#000000;stroke-width:0.264583px;stroke-linecap:butt;stroke-linejoin:miter;stroke-opacity:1"
           d="m 29.136266,99.29899 -7.179249,11.34436"
           id="path3829-3-1-1-6" />
        <path
           style="fill:none;stroke:#000000;stroke-width:0.264583px;stroke-linecap:butt;stroke-linejoin:miter;stroke-opacity:1"
           d="m 14.777768,99.298989 h 3.715013"
           id="path4161-29-0-8" />
        <path
           style="fill:none;stroke:#000000;stroke-width:0.264583px;stroke-linecap:butt;stroke-linejoin:miter;stroke-opacity:1"
           d="m 25.421253,99.29899 h 3.715013"
           id="path4161-7-3-6-92" />
      </g>
      <g
         id="g4382-5-1-3-6"
         transform="matrix(1,0,0,-1,0.04822621,189.27398)">
        <path
           style="fill:none;stroke:#000000;stroke-width:0.264583px;stroke-linecap:butt;stroke-linejoin:miter;stroke-opacity:1"
           d="m 14.777768,99.298989 7.179249,11.344361"
           id="path3829-9-9-2-64" />
        <path
           style="fill:none;stroke:#000000;stroke-width:0.264583px;stroke-linecap:butt;stroke-linejoin:miter;stroke-opacity:1"
           d="m 29.136266,99.29899 -7.179249,11.34436"
           id="path3829-3-2-4-0-9" />
        <path
           style="fill:none;stroke:#000000;stroke-width:0.264583px;stroke-linecap:butt;stroke-linejoin:miter;stroke-opacity:1"
           d="m 14.777768,99.298989 h 3.715013"
           id="path4161-2-7-6-50" />
        <path
           style="fill:none;stroke:#000000;stroke-width:0.264583px;stroke-linecap:butt;stroke-linejoin:miter;stroke-opacity:1"
           d="m 25.421253,99.29899 h 3.715013"
           id="path4161-7-8-8-1-48" />
      </g>
      <path
         style="fill:none;stroke:#000000;stroke-width:0.264583px;stroke-linecap:butt;stroke-linejoin:miter;stroke-opacity:1"
         d="m 18.541007,89.97499 -0.04823,6.148999"
         id="path4459-4-5-7" />
      <path
         style="fill:none;stroke:#000000;stroke-width:0.264583px;stroke-linecap:butt;stroke-linejoin:miter;stroke-opacity:1"
         d="m 25.469479,89.974988 -0.04823,6.149001"
         id="path4461-5-5-17" />
    </g>
    <g
       id="g4555-9-0-2"
       transform="matrix(0,-0.60038209,-0.43190451,0,225.54169,174.29358)">
      <g
         id="g4382-7-3-72"
         transform="translate(0,-3.1750001)">
        <path
           style="fill:none;stroke:#000000;stroke-width:0.264583px;stroke-linecap:butt;stroke-linejoin:miter;stroke-opacity:1"
           d="m 14.777768,99.298989 7.179249,11.344361"
           id="path3829-36-6-2" />
        <path
           style="fill:none;stroke:#000000;stroke-width:0.264583px;stroke-linecap:butt;stroke-linejoin:miter;stroke-opacity:1"
           d="m 29.136266,99.29899 -7.179249,11.34436"
           id="path3829-3-1-1-61" />
        <path
           style="fill:none;stroke:#000000;stroke-width:0.264583px;stroke-linecap:butt;stroke-linejoin:miter;stroke-opacity:1"
           d="m 14.777768,99.298989 h 3.715013"
           id="path4161-29-0-06" />
        <path
           style="fill:none;stroke:#000000;stroke-width:0.264583px;stroke-linecap:butt;stroke-linejoin:miter;stroke-opacity:1"
           d="m 25.421253,99.29899 h 3.715013"
           id="path4161-7-3-6-1" />
      </g>
      <g
         id="g4382-5-1-3-5"
         transform="matrix(1,0,0,-1,0.04822621,189.27398)">
        <path
           style="fill:none;stroke:#000000;stroke-width:0.264583px;stroke-linecap:butt;stroke-linejoin:miter;stroke-opacity:1"
           d="m 14.777768,99.298989 7.179249,11.344361"
           id="path3829-9-9-2-9" />
        <path
           style="fill:none;stroke:#000000;stroke-width:0.264583px;stroke-linecap:butt;stroke-linejoin:miter;stroke-opacity:1"
           d="m 29.136266,99.29899 -7.179249,11.34436"
           id="path3829-3-2-4-0-49" />
        <path
           style="fill:none;stroke:#000000;stroke-width:0.264583px;stroke-linecap:butt;stroke-linejoin:miter;stroke-opacity:1"
           d="m 14.777768,99.298989 h 3.715013"
           id="path4161-2-7-6-0" />
        <path
           style="fill:none;stroke:#000000;stroke-width:0.264583px;stroke-linecap:butt;stroke-linejoin:miter;stroke-opacity:1"
           d="m 25.421253,99.29899 h 3.715013"
           id="path4161-7-8-8-1-9" />
      </g>
      <path
         style="fill:none;stroke:#000000;stroke-width:0.264583px;stroke-linecap:butt;stroke-linejoin:miter;stroke-opacity:1"
         d="m 18.541007,89.97499 -0.04823,6.148999"
         id="path4459-4-5-1" />
      <path
         style="fill:none;stroke:#000000;stroke-width:0.264583px;stroke-linecap:butt;stroke-linejoin:miter;stroke-opacity:1"
         d="m 25.469479,89.974988 -0.04823,6.149001"
         id="path4461-5-5-7" />
    </g>
    <text
       xml:space="preserve"
       transform="matrix(0.16744906,0,0,0.16744906,138.24951,77.224932)"
       id="text2225-1-5-2-1"
       style="font-style:normal;font-weight:normal;font-size:40px;line-height:1.25;font-family:sans-serif;white-space:pre;shape-inside:url(#rect2227-35-3-3-7);display:inline;fill:#000000;fill-opacity:1;stroke:none"><tspan
         x="127.49219"
         y="160.50586"
         id="tspan39005">DMI</tspan></text>
    <g
       id="g1729"
       transform="matrix(0.82735843,0,0,0.82735843,13.22077,11.715469)">
      <g
         id="g1272"
         transform="matrix(0.26458333,0,0,0.26458333,9.1223331,65.523708)">
        <path
           style="fill:#549e45;stroke:#2a5f1f;stroke-width:2"
           d="M 39,19 96,2 v 38 l -7,3 V 57 L 61,70 V 54 l -14,7 v 16 l -8,4 z"
           id="path1191" />
        <path
           style="fill:#cccccc"
           d="M 77,18 90,14 V 32 L 77,37 Z M 46,26 66,20 V 42 L 46,50 Z"
           id="path1193" />
        <path
           style="fill:#333333;stroke:#111111"
           d="M 80,19 93,15 V 33 L 80,38 Z M 49,27 69,21 V 43 L 49,51 Z"
           id="path1195" />
        <path
           style="fill:#cdb754;stroke:#6a5600"
           d="m 85,45 2,-1 v 14 l -2,1 z m -5,2 2,-1 v 14 l -2,1 z m -5,2 2,-1 v 14 l -2,1 z M 70,66 V 51 l 2,-1 v 15 z m -5,2 V 53 l 2,-1 v 15 z"
           id="path1197" />
        <path
           style="fill:#888888;stroke:#333333"
           d="m 14,15 1,67 c 0,0 7,3 6,13 l 13,2 C 33,87 39,86 39,86 V 17 Z m 4,39 7,1 v 17 l -7,-1 z"
           id="path1199" />
        <path
           style="fill:#aaaaaa;stroke:#555555"
           d="M 16.7,13.7 5,17 l 9,1 4.7,-1.4 6.3,0.6 -4,1.8 9,1 10,-4 z"
           id="path1201" />
      </g>
      <g
         id="g1272-3"
         transform="matrix(0.26458333,0,0,0.26458333,20.499416,73.725791)">
        <path
           style="fill:#549e45;stroke:#2a5f1f;stroke-width:2"
           d="M 39,19 96,2 v 38 l -7,3 V 57 L 61,70 V 54 l -14,7 v 16 l -8,4 z"
           id="path1191-6" />
        <path
           style="fill:#cccccc"
           d="M 77,18 90,14 V 32 L 77,37 Z M 46,26 66,20 V 42 L 46,50 Z"
           id="path1193-7" />
        <path
           style="fill:#333333;stroke:#111111"
           d="M 80,19 93,15 V 33 L 80,38 Z M 49,27 69,21 V 43 L 49,51 Z"
           id="path1195-5" />
        <path
           style="fill:#cdb754;stroke:#6a5600"
           d="m 85,45 2,-1 v 14 l -2,1 z m -5,2 2,-1 v 14 l -2,1 z m -5,2 2,-1 v 14 l -2,1 z M 70,66 V 51 l 2,-1 v 15 z m -5,2 V 53 l 2,-1 v 15 z"
           id="path1197-3" />
        <path
           style="fill:#888888;stroke:#333333"
           d="m 14,15 1,67 c 0,0 7,3 6,13 l 13,2 C 33,87 39,86 39,86 V 17 Z m 4,39 7,1 v 17 l -7,-1 z"
           id="path1199-5" />
        <path
           style="fill:#aaaaaa;stroke:#555555"
           d="M 16.7,13.7 5,17 l 9,1 4.7,-1.4 6.3,0.6 -4,1.8 9,1 10,-4 z"
           id="path1201-6" />
      </g>
    </g>
    <g
       id="g1745"
       transform="matrix(0.82735843,0,0,0.82735843,247.22518,-62.486204)">
      <g
         id="g1272-2"
         transform="matrix(0.26458333,0,0,0.26458333,11.101889,253.13805)">
        <path
           style="fill:#549e45;stroke:#2a5f1f;stroke-width:2"
           d="M 39,19 96,2 v 38 l -7,3 V 57 L 61,70 V 54 l -14,7 v 16 l -8,4 z"
           id="path1191-9" />
        <path
           style="fill:#cccccc"
           d="M 77,18 90,14 V 32 L 77,37 Z M 46,26 66,20 V 42 L 46,50 Z"
           id="path1193-1" />
        <path
           style="fill:#333333;stroke:#111111"
           d="M 80,19 93,15 V 33 L 80,38 Z M 49,27 69,21 V 43 L 49,51 Z"
           id="path1195-2" />
        <path
           style="fill:#cdb754;stroke:#6a5600"
           d="m 85,45 2,-1 v 14 l -2,1 z m -5,2 2,-1 v 14 l -2,1 z m -5,2 2,-1 v 14 l -2,1 z M 70,66 V 51 l 2,-1 v 15 z m -5,2 V 53 l 2,-1 v 15 z"
           id="path1197-7" />
        <path
           style="fill:#888888;stroke:#333333"
           d="m 14,15 1,67 c 0,0 7,3 6,13 l 13,2 C 33,87 39,86 39,86 V 17 Z m 4,39 7,1 v 17 l -7,-1 z"
           id="path1199-0" />
        <path
           style="fill:#aaaaaa;stroke:#555555"
           d="M 16.7,13.7 5,17 l 9,1 4.7,-1.4 6.3,0.6 -4,1.8 9,1 10,-4 z"
           id="path1201-9" />
      </g>
      <g
         id="g1272-3-3"
         transform="matrix(0.26458333,0,0,0.26458333,22.478972,261.34013)">
        <path
           style="fill:#549e45;stroke:#2a5f1f;stroke-width:2"
           d="M 39,19 96,2 v 38 l -7,3 V 57 L 61,70 V 54 l -14,7 v 16 l -8,4 z"
           id="path1191-6-6" />
        <path
           style="fill:#cccccc"
           d="M 77,18 90,14 V 32 L 77,37 Z M 46,26 66,20 V 42 L 46,50 Z"
           id="path1193-7-0" />
        <path
           style="fill:#333333;stroke:#111111"
           d="M 80,19 93,15 V 33 L 80,38 Z M 49,27 69,21 V 43 L 49,51 Z"
           id="path1195-5-6" />
        <path
           style="fill:#cdb754;stroke:#6a5600"
           d="m 85,45 2,-1 v 14 l -2,1 z m -5,2 2,-1 v 14 l -2,1 z m -5,2 2,-1 v 14 l -2,1 z M 70,66 V 51 l 2,-1 v 15 z m -5,2 V 53 l 2,-1 v 15 z"
           id="path1197-3-2" />
        <path
           style="fill:#888888;stroke:#333333"
           d="m 14,15 1,67 c 0,0 7,3 6,13 l 13,2 C 33,87 39,86 39,86 V 17 Z m 4,39 7,1 v 17 l -7,-1 z"
           id="path1199-5-6" />
        <path
           style="fill:#aaaaaa;stroke:#555555"
           d="M 16.7,13.7 5,17 l 9,1 4.7,-1.4 6.3,0.6 -4,1.8 9,1 10,-4 z"
           id="path1201-6-1" />
      </g>
    </g>
    <g
       id="g4555-9-0-3"
       transform="matrix(0,-0.60038209,0.43190451,0,23.810737,173.42972)">
      <g
         id="g4382-7-3-20"
         transform="translate(0,-3.1750001)">
        <path
           style="fill:none;stroke:#000000;stroke-width:0.264583px;stroke-linecap:butt;stroke-linejoin:miter;stroke-opacity:1"
           d="m 14.777768,99.298989 7.179249,11.344361"
           id="path3829-36-6-61" />
        <path
           style="fill:none;stroke:#000000;stroke-width:0.264583px;stroke-linecap:butt;stroke-linejoin:miter;stroke-opacity:1"
           d="m 29.136266,99.29899 -7.179249,11.34436"
           id="path3829-3-1-1-55" />
        <path
           style="fill:none;stroke:#000000;stroke-width:0.264583px;stroke-linecap:butt;stroke-linejoin:miter;stroke-opacity:1"
           d="m 14.777768,99.298989 h 3.715013"
           id="path4161-29-0-47" />
        <path
           style="fill:none;stroke:#000000;stroke-width:0.264583px;stroke-linecap:butt;stroke-linejoin:miter;stroke-opacity:1"
           d="m 25.421253,99.29899 h 3.715013"
           id="path4161-7-3-6-6" />
      </g>
      <g
         id="g4382-5-1-3-56"
         transform="matrix(1,0,0,-1,0.04822621,189.27398)">
        <path
           style="fill:none;stroke:#000000;stroke-width:0.264583px;stroke-linecap:butt;stroke-linejoin:miter;stroke-opacity:1"
           d="m 14.777768,99.298989 7.179249,11.344361"
           id="path3829-9-9-2-93" />
        <path
           style="fill:none;stroke:#000000;stroke-width:0.264583px;stroke-linecap:butt;stroke-linejoin:miter;stroke-opacity:1"
           d="m 29.136266,99.29899 -7.179249,11.34436"
           id="path3829-3-2-4-0-7" />
        <path
           style="fill:none;stroke:#000000;stroke-width:0.264583px;stroke-linecap:butt;stroke-linejoin:miter;stroke-opacity:1"
           d="m 14.777768,99.298989 h 3.715013"
           id="path4161-2-7-6-4" />
        <path
           style="fill:none;stroke:#000000;stroke-width:0.264583px;stroke-linecap:butt;stroke-linejoin:miter;stroke-opacity:1"
           d="m 25.421253,99.29899 h 3.715013"
           id="path4161-7-8-8-1-5" />
      </g>
      <path
         style="fill:none;stroke:#000000;stroke-width:0.264583px;stroke-linecap:butt;stroke-linejoin:miter;stroke-opacity:1"
         d="m 18.541007,89.97499 -0.04823,6.148999"
         id="path4459-4-5-2" />
      <path
         style="fill:none;stroke:#000000;stroke-width:0.264583px;stroke-linecap:butt;stroke-linejoin:miter;stroke-opacity:1"
         d="m 25.469479,89.974988 -0.04823,6.149001"
         id="path4461-5-5-5" />
    </g>
    <g
       id="g4555-9-0-47"
       transform="matrix(0,-0.60038209,-0.43190451,0,286.71725,174.29358)">
      <g
         id="g4382-7-3-44"
         transform="translate(0,-3.1750001)">
        <path
           style="fill:none;stroke:#000000;stroke-width:0.264583px;stroke-linecap:butt;stroke-linejoin:miter;stroke-opacity:1"
           d="m 14.777768,99.298989 7.179249,11.344361"
           id="path3829-36-6-3" />
        <path
           style="fill:none;stroke:#000000;stroke-width:0.264583px;stroke-linecap:butt;stroke-linejoin:miter;stroke-opacity:1"
           d="m 29.136266,99.29899 -7.179249,11.34436"
           id="path3829-3-1-1-0" />
        <path
           style="fill:none;stroke:#000000;stroke-width:0.264583px;stroke-linecap:butt;stroke-linejoin:miter;stroke-opacity:1"
           d="m 14.777768,99.298989 h 3.715013"
           id="path4161-29-0-7" />
        <path
           style="fill:none;stroke:#000000;stroke-width:0.264583px;stroke-linecap:butt;stroke-linejoin:miter;stroke-opacity:1"
           d="m 25.421253,99.29899 h 3.715013"
           id="path4161-7-3-6-8" />
      </g>
      <g
         id="g4382-5-1-3-68"
         transform="matrix(1,0,0,-1,0.04822621,189.27398)">
        <path
           style="fill:none;stroke:#000000;stroke-width:0.264583px;stroke-linecap:butt;stroke-linejoin:miter;stroke-opacity:1"
           d="m 14.777768,99.298989 7.179249,11.344361"
           id="path3829-9-9-2-8" />
        <path
           style="fill:none;stroke:#000000;stroke-width:0.264583px;stroke-linecap:butt;stroke-linejoin:miter;stroke-opacity:1"
           d="m 29.136266,99.29899 -7.179249,11.34436"
           id="path3829-3-2-4-0-43" />
        <path
           style="fill:none;stroke:#000000;stroke-width:0.264583px;stroke-linecap:butt;stroke-linejoin:miter;stroke-opacity:1"
           d="m 14.777768,99.298989 h 3.715013"
           id="path4161-2-7-6-1" />
        <path
           style="fill:none;stroke:#000000;stroke-width:0.264583px;stroke-linecap:butt;stroke-linejoin:miter;stroke-opacity:1"
           d="m 25.421253,99.29899 h 3.715013"
           id="path4161-7-8-8-1-49" />
      </g>
      <path
         style="fill:none;stroke:#000000;stroke-width:0.264583px;stroke-linecap:butt;stroke-linejoin:miter;stroke-opacity:1"
         d="m 18.541007,89.97499 -0.04823,6.148999"
         id="path4459-4-5-20" />
      <path
         style="fill:none;stroke:#000000;stroke-width:0.264583px;stroke-linecap:butt;stroke-linejoin:miter;stroke-opacity:1"
         d="m 25.469479,89.974988 -0.04823,6.149001"
         id="path4461-5-5-68" />
    </g>
    <g
       id="g2144"
       transform="matrix(0.21890526,0,0,0.21890526,31.694864,149.69684)">
      <path
         style="fill:#333333"
         d="M 76.8,7.9 63.9,19.5 v 6.4 l 1.5,0.8 1.4,-5.1 10,-8.6 z m 20.3,9.3 -13.7,11.6 v 5.8 l 5,2.1 -13.7,13 V 68.5 L 90.6,51.2 89.1,43.3 99.3,33.1 Z M 67.5,27.4 53.1,39.7 v 14.4 l 4.4,-12.3 10,-8.7 z"
         id="path2048" />
      <path
         style="fill:#999999"
         d="M 63.9,19.5 48.1,12.3 62.5,1.16 76.8,7.9 M 83.4,28.8 66.8,21.6 80.4,10.1 97.1,17.2 M 74.7,49.7 57.5,41.8 71.9,29.5 88.4,36.7 m -35.3,3 -15.8,-7.2 13.6,-12.3 16.6,7.2"
         id="path2050" />
      <path
         style="fill:#cccccc"
         d="m 65.4,26.7 1.4,-5.1 16.6,7.2 v 5.8 l -11.5,-5.1 -4.4,3.6 v -5.7 z m -23.1,0.7 5.8,-15.1 15.8,7.2 v 6.4 l -13,-5.7 z m -10.6,18.7 5.6,-13.6 15.8,7.2 v 14.4 l 4.4,-12.3 17.2,7.9 v 18.8 z"
         id="path2052" />
      <path
         style="fill:none;stroke:#111111;stroke-width:1.5"
         d="m 76.2,36.1 c -1.5,-2.2 -4.3,-2.2 -5.1,-0.8 -0.7,1.4 3.6,2.9 1.5,5 -0.7,0.8 -4.3,0 -5.1,-2.1 M 81.2,13 l -2.9,5 4.4,-0.8 v 3.7 l 5.7,-3.7 M 63.2,9.4 63.9,12.3 M 66.1,6.49 C 64.7,5.05 61.7,5.05 59.6,7.2 c -1.5,1.5 0,3.6 2.9,3.6 2.2,0 5,-2.1 3.6,-4.31 z m -16.6,20.91 4.4,2.1 m -8,-0.7 8.6,-2.9 -2.1,6.6"
         id="path2054" />
      <path
         style="fill:none;stroke:#222222;stroke-width:1"
         d="M 42.3,27.4 48.1,12.3 62.5,1.16 76.8,7.9 V 13 M 52.4,56.9 57.5,41.8 71.9,29.5 88.4,36.7 90.6,51.2 74.7,68.5 31.7,46.1 37.3,32.5 50.9,20.2 67.5,27.4 v 5.7 m -2.1,-6.4 1.4,-5.1 13.6,-11.5 16.7,7.1 2.2,15.9 -10.2,10.2"
         id="path2056" />
      <path
         style="fill:#444444;stroke:#333333"
         d="M 19.9,46.4 C 0.918,35.2 20.7,22.3 16.2,13.5 10.6,6.5 4.43,8.59 -0.014,7.13 L -0.339,4.14 C 9.85,4.69 16.1,6.69 19.2,12.7 c 6.3,8.1 -15.28,21.9 4.1,32 0,0.6 -3.4,1.7 -3.4,1.7 z"
         id="path2058" />
      <path
         style="fill:#444444;stroke:#333333;stroke-width:1.5"
         d="M 44.9,46.4 C 55.2,51.5 62,61.8 65.4,72 c 1.2,5.7 2.3,17.1 -8,21.6 C 48.3,98.2 39.2,99.3 27.9,91.4 18.8,83.4 9.25,72 5.85,67.5 3.57,64 2.55,61.8 3,57.2 3,53.8 4.82,52.7 11.4,49.8 26.7,42.9 31.3,44 37,44 c 4.5,0 7.9,2.4 7.9,2.4 z"
         id="path2060" />
      <path
         style="fill:#626262;stroke:#cccccc"
         d="m 55.2,53.8 c 1.1,3.4 -13.7,8 -13.7,8 0,0 -8,-12 -18.2,-16.5 0,0 8,-1.3 12.5,-1.3 3.4,0 6.9,0.7 12.5,4.7 3.5,2.8 6.9,5.1 6.9,5.1 z M 6.87,51.5 C 14.2,53.8 19.9,61.8 22.2,64 c 2.2,2.3 3.4,2.3 6.8,2.3 5.7,-1.1 12.5,-4.5 12.5,-4.5 0,0 -9.1,-12 -19.3,-16.5 -3.4,1.1 -10.8,4.5 -15.33,6.2 z"
         id="path2062" />
      <path
         style="fill:#333333;stroke:#cccccc;stroke-width:1.5"
         d="m 26.7,47.5 c -2.3,2.3 5.7,8.6 8,6.3 2.3,-2.3 -4.6,-7.4 -8,-6.3 z"
         id="path2064" />
      <path
         style="fill:none;stroke:#222222;stroke-width:1.5"
         d="M 44.9,46.4 C 55.2,51.5 62,61.8 65.4,72 c 1.2,5.7 2.3,17.1 -8,21.6 C 48.3,98.2 39.2,99.3 27.9,91.4 18.8,83.4 9.25,72 5.85,67.5 3.57,64 2.55,61.8 3,57.2 3,53.8 4.82,52.7 11.4,49.8 26.7,42.9 31.3,44 37,44 c 4.5,0 7.9,2.4 7.9,2.4 z"
         id="path2066" />
      <path
         style="fill:#cccccc"
         d="m 25.6,69.7 c 7.9,16 26.2,23.9 38.7,5.7 C 54,97 30.1,90.2 25.6,69.7 Z"
         id="path2068" />
    </g>
    <g
       id="g2641"
       transform="matrix(0.18675809,0,0,0.1839931,10.014416,150.48253)">
      <path
         style="fill:#444444;stroke:#333333"
         d="m 1,0 c 4,9 8,16 13,20 5,4 0,10 -5,4 C 4,18 0,13 -2,6 -3.6,0.39 1,0 1,0 Z"
         id="path2542" />
      <path
         style="fill:#555555;stroke:#333333;stroke-width:2"
         d="m 9,28 c -1,-3 0,-5 2,-7 2,-2 5,-2 7,0 2,2 2,2 2,2 z"
         id="path2544" />
      <path
         style="fill:#444444;stroke:#333333;stroke-width:1.5"
         d="m 9.7,27 c 0,0 4.3,3 2.3,9 -1,2 1,4 4,7 4,4 18,19 18,19 0,0 -2,8 0,13 -1,0 -22,-24 -22,-24 0,0 -4,-6 -2,-15 1,-3 0,-5 -0.3,-9 z"
         id="path2546" />
      <path
         style="fill:#666666;stroke:#444444;stroke-width:2;stroke-linejoin:round"
         d="m 10,27 c 5,-4 17,-6 17,-6 0,0 5,6 16,5 L 71,48 34,62 14,41 c 0,0 -4,-4 -3,-6 2,-4 2,-5 -1,-8 z"
         id="path2548" />
      <path
         style="fill:#444444;stroke:#222222"
         d="M 72,48 34,62 c 0,0 -3,10 1,14 L 71,61 c 4,-5 1,-13 1,-13 z"
         id="path2550" />
      <path
         style="fill:#c5c3ba;stroke:#333333"
         d="M 70,53 38,65 v 8 L 58,95 92,78 v -8 z"
         id="path2552" />
      <path
         style="fill:#757368"
         d="m 38,65 20,21 v 8 L 38,73 Z"
         id="path2554" />
      <path
         style="fill:none;stroke:#ffffff"
         d="M 58,86 39,66"
         id="path2556" />
      <path
         style="fill:#444444"
         d="M 59,87 91,71 v 6 L 59,93 Z"
         id="path2558" />
      <path
         style="fill:#eeeeee"
         d="m 87,74 2,2 -28,14 -2,-2 z"
         id="path2560" />
      <path
         style="fill:#555555;stroke:#555555"
         d="m 66,64 8,-3 5,4 -8,4 z m -16,7 9,-4 5,5 -9,4 z"
         id="path2562" />
      <path
         style="fill:#d4d4d4"
         d="m 25.8,28.6 8.8,2.7 -3.6,1.7 9.8,10.3 2.3,-7 -2.1,-2.3 -1.4,0.7 -2.8,-3.1 4.4,-2 2.5,2.7 -1.5,0.9 2.8,2.8 -2.9,8.6 3.4,3.8 c 0,0 2,-0.3 3.4,1.3 1,1.1 0.8,2.1 -0.3,2.9 -1.4,0.6 -2.9,0.9 -4.4,-0.7 -1.1,-1.5 0.1,-2.5 0.1,-2.5 L 42,47 32.5,49.7 29.9,46.8 c 0,0 -2.4,0.1 -4.1,-1.7 -0.9,-1.3 -0.3,-3.2 1.4,-3.7 2.1,-0.8 3.3,0.1 4.3,1.1 1.8,1.8 -0.2,3.8 -0.2,3.8 l 1.7,1.7 7.7,-2.2 -11,-12 -3.6,1.8 z"
         id="path2564" />
    </g>
    <g
       id="g3260"
       transform="matrix(0.04736749,0,0,0.04736749,33.027243,112.63496)">
      <path
         style="fill:#363f3e"
         d="m 424.4,473.6 c 0,12 -9.6,22.4 -21.6,22.4 H 94 C 82,496 72.4,485.6 72.4,473.6 V 22.4 C 72.4,10.4 82,0 94,0 h 308.8 c 12,0 21.6,10.4 21.6,22.4 z"
         id="path3102" />
      <g
         id="g3110">
        <path
           style="fill:#151918"
           d="m 299.6,308 c 1.6,0 2.4,-0.8 3.2,-1.6 3.2,-3.2 3.2,-8 0,-12 L 290,281.6 c -3.2,-3.2 -8.8,-3.2 -12,0 -0.8,0.8 -1.6,2.4 -1.6,3.2 -32,16.8 -160,132 -168,140.8 l -12,12 c -8.8,8.8 -8.8,24 0,32.8 L 114,488 c 8.8,8.8 24,8.8 32.8,0 l 12,-12 c 8.8,-8 124,-136 140.8,-168 z"
           id="path3104" />
        <path
           style="fill:#151918"
           d="M 72.4,21.6 C 72.4,9.6 82,0 94,0 h 308.8 c 12,0 21.6,10.4 21.6,22.4 v 452 c 0,12 -9.6,22.4 -21.6,22.4"
           id="path3106" />
        <circle
           style="fill:#151918"
           cx="248.39999"
           cy="246.39999"
           r="135.2"
           id="circle3108" />
      </g>
      <circle
         style="fill:#1bceb8"
         cx="248.39999"
         cy="223.2"
         r="135.2"
         id="circle3112" />
      <g
         id="g3118">
        <path
           style="fill:#0dbfba"
           d="m 290,281.6 c -3.2,-3.2 -8.8,-3.2 -12,0 -0.8,0.8 -1.6,2.4 -1.6,3.2 -14.4,7.2 -48,34.4 -80.8,63.2 16,7.2 34.4,10.4 52.8,10.4 4.8,0 9.6,0 14.4,-0.8 17.6,-21.6 32,-40 36.8,-50.4 1.6,0 2.4,-0.8 3.2,-1.6 3.2,-3.2 3.2,-8 0,-12 z"
           id="path3114" />
        <path
           style="fill:#0dbfba"
           d="m 152.4,128 c 52.8,-52.8 138.4,-52.8 191.2,0 52.8,52.8 52.8,138.4 0,191.2"
           id="path3116" />
      </g>
      <circle
         style="fill:#151918"
         cx="248.39999"
         cy="223.2"
         r="24.799999"
         id="circle3120" />
      <path
         style="fill:#c5c9c9"
         d="m 291.6,300 c 1.6,0 2.4,-0.8 3.2,-1.6 3.2,-3.2 3.2,-8.8 0,-12 L 282,273.6 c -3.2,-3.2 -8.8,-3.2 -12,0 -0.8,0.8 -1.6,2.4 -1.6,3.2 -32,16.8 -160,132 -168,140.8 l -12,11.2 c -8.8,8.8 -8.8,24 0,32.8 l 17.6,17.6 c 8.8,8.8 24,8.8 32.8,0 l 12,-12 c 8,-8 124,-135.2 140.8,-167.2 z"
         id="path3122" />
      <g
         id="g3138">
        <path
           style="fill:#b6b7b7"
           d="m 106,480 c 8.8,8.8 24,8.8 32.8,0 l 12,-12 c 8,-8 124,-135.2 140.8,-168 1.6,0 2.4,-0.8 3.2,-1.6 3.2,-3.2 3.2,-8.8 0,-12 L 282,273.6 c -3.2,-3.2 -8.8,-3.2 -12,0 -0.8,0.8 -1.6,2.4 -1.6,3.2"
           id="path3124" />
        <path
           style="fill:#b6b7b7"
           d="m 103.6,33.6 c -4,4.8 -3.2,12 1.6,16.8 4.8,4.8 12,4.8 16.8,1.6 z"
           id="path3126" />
        <path
           style="fill:#b6b7b7"
           d="m 106,31.2 17.6,17.6 c 4,-4.8 3.2,-12 -1.6,-16.8 -3.2,-4.8 -10.4,-4.8 -16,-0.8 z"
           id="path3128" />
        <path
           style="fill:#b6b7b7"
           d="m 370.8,40 c 0.8,8 6.4,11.2 12.8,11.2 6.4,0 12,-3.2 12.8,-11.2 z"
           id="path3130" />
        <path
           style="fill:#b6b7b7"
           d="m 370.8,36.8 h 25.6 c -0.8,-8 -6.4,-11.2 -12.8,-11.2 -7.2,0 -12,3.2 -12.8,11.2 z"
           id="path3132" />
        <path
           style="fill:#b6b7b7"
           d="m 393.2,462.4 c 4,-4.8 3.2,-12 -1.6,-16.8 -4.8,-4.8 -12,-4.8 -16.8,-1.6 z"
           id="path3134" />
        <path
           style="fill:#b6b7b7"
           d="m 390.8,464.8 -17.6,-17.6 c -4,4.8 -3.2,12 1.6,16.8 3.2,4.8 10.4,4.8 16,0.8 z"
           id="path3136" />
      </g>
      <g
         id="g3144">
        <path
           style="fill:#151918"
           d="m 126,453.6 c -0.8,-8 -6.4,-11.2 -12.8,-11.2 -6.4,0 -12,3.2 -12.8,11.2 z"
           id="path3140" />
        <path
           style="fill:#151918"
           d="m 126,456 h -25.6 c 0.8,8 6.4,11.2 12.8,11.2 7.2,0 12,-3.2 12.8,-11.2 z"
           id="path3142" />
      </g>
    </g>
    <g
       id="g3260-9"
       transform="matrix(0.04736749,0,0,0.04736749,12.428745,112.88574)">
      <path
         style="fill:#363f3e"
         d="m 424.4,473.6 c 0,12 -9.6,22.4 -21.6,22.4 H 94 C 82,496 72.4,485.6 72.4,473.6 V 22.4 C 72.4,10.4 82,0 94,0 h 308.8 c 12,0 21.6,10.4 21.6,22.4 z"
         id="path3102-4" />
      <g
         id="g3110-9">
        <path
           style="fill:#151918"
           d="m 299.6,308 c 1.6,0 2.4,-0.8 3.2,-1.6 3.2,-3.2 3.2,-8 0,-12 L 290,281.6 c -3.2,-3.2 -8.8,-3.2 -12,0 -0.8,0.8 -1.6,2.4 -1.6,3.2 -32,16.8 -160,132 -168,140.8 l -12,12 c -8.8,8.8 -8.8,24 0,32.8 L 114,488 c 8.8,8.8 24,8.8 32.8,0 l 12,-12 c 8.8,-8 124,-136 140.8,-168 z"
           id="path3104-0" />
        <path
           style="fill:#151918"
           d="M 72.4,21.6 C 72.4,9.6 82,0 94,0 h 308.8 c 12,0 21.6,10.4 21.6,22.4 v 452 c 0,12 -9.6,22.4 -21.6,22.4"
           id="path3106-9" />
        <circle
           style="fill:#151918"
           cx="248.39999"
           cy="246.39999"
           r="135.2"
           id="circle3108-1" />
      </g>
      <circle
         style="fill:#1bceb8"
         cx="248.39999"
         cy="223.2"
         r="135.2"
         id="circle3112-7" />
      <g
         id="g3118-7">
        <path
           style="fill:#0dbfba"
           d="m 290,281.6 c -3.2,-3.2 -8.8,-3.2 -12,0 -0.8,0.8 -1.6,2.4 -1.6,3.2 -14.4,7.2 -48,34.4 -80.8,63.2 16,7.2 34.4,10.4 52.8,10.4 4.8,0 9.6,0 14.4,-0.8 17.6,-21.6 32,-40 36.8,-50.4 1.6,0 2.4,-0.8 3.2,-1.6 3.2,-3.2 3.2,-8 0,-12 z"
           id="path3114-1" />
        <path
           style="fill:#0dbfba"
           d="m 152.4,128 c 52.8,-52.8 138.4,-52.8 191.2,0 52.8,52.8 52.8,138.4 0,191.2"
           id="path3116-1" />
      </g>
      <circle
         style="fill:#151918"
         cx="248.39999"
         cy="223.2"
         r="24.799999"
         id="circle3120-5" />
      <path
         style="fill:#c5c9c9"
         d="m 291.6,300 c 1.6,0 2.4,-0.8 3.2,-1.6 3.2,-3.2 3.2,-8.8 0,-12 L 282,273.6 c -3.2,-3.2 -8.8,-3.2 -12,0 -0.8,0.8 -1.6,2.4 -1.6,3.2 -32,16.8 -160,132 -168,140.8 l -12,11.2 c -8.8,8.8 -8.8,24 0,32.8 l 17.6,17.6 c 8.8,8.8 24,8.8 32.8,0 l 12,-12 c 8,-8 124,-135.2 140.8,-167.2 z"
         id="path3122-9" />
      <g
         id="g3138-7">
        <path
           style="fill:#b6b7b7"
           d="m 106,480 c 8.8,8.8 24,8.8 32.8,0 l 12,-12 c 8,-8 124,-135.2 140.8,-168 1.6,0 2.4,-0.8 3.2,-1.6 3.2,-3.2 3.2,-8.8 0,-12 L 282,273.6 c -3.2,-3.2 -8.8,-3.2 -12,0 -0.8,0.8 -1.6,2.4 -1.6,3.2"
           id="path3124-7" />
        <path
           style="fill:#b6b7b7"
           d="m 103.6,33.6 c -4,4.8 -3.2,12 1.6,16.8 4.8,4.8 12,4.8 16.8,1.6 z"
           id="path3126-6" />
        <path
           style="fill:#b6b7b7"
           d="m 106,31.2 17.6,17.6 c 4,-4.8 3.2,-12 -1.6,-16.8 -3.2,-4.8 -10.4,-4.8 -16,-0.8 z"
           id="path3128-7" />
        <path
           style="fill:#b6b7b7"
           d="m 370.8,40 c 0.8,8 6.4,11.2 12.8,11.2 6.4,0 12,-3.2 12.8,-11.2 z"
           id="path3130-3" />
        <path
           style="fill:#b6b7b7"
           d="m 370.8,36.8 h 25.6 c -0.8,-8 -6.4,-11.2 -12.8,-11.2 -7.2,0 -12,3.2 -12.8,11.2 z"
           id="path3132-6" />
        <path
           style="fill:#b6b7b7"
           d="m 393.2,462.4 c 4,-4.8 3.2,-12 -1.6,-16.8 -4.8,-4.8 -12,-4.8 -16.8,-1.6 z"
           id="path3134-5" />
        <path
           style="fill:#b6b7b7"
           d="m 390.8,464.8 -17.6,-17.6 c -4,4.8 -3.2,12 1.6,16.8 3.2,4.8 10.4,4.8 16,0.8 z"
           id="path3136-6" />
      </g>
      <g
         id="g3144-3">
        <path
           style="fill:#151918"
           d="m 126,453.6 c -0.8,-8 -6.4,-11.2 -12.8,-11.2 -6.4,0 -12,3.2 -12.8,11.2 z"
           id="path3140-9" />
        <path
           style="fill:#151918"
           d="m 126,456 h -25.6 c 0.8,8 6.4,11.2 12.8,11.2 7.2,0 12,-3.2 12.8,-11.2 z"
           id="path3142-4" />
      </g>
    </g>
  </g>
</svg>
