No hay elementos repetidos.<BR>Has rellenado  2 cajas de un total de 4No hay elementos repetidos.<BR>Has rellenado  2 cajas de un total de 4No hay elementos repetidos.<BR>Has rellenado  2 cajas de un total de 4No hay elementos repetidos.<BR>Has rellenado  2 cajas de un total de 4
No hay elementos repetidos.<BR>Has rellenado  2 cajas de un total de 4
No hay elementos repetidos.<BR>Has rellenado  2 cajas de un total de 4
Los numeros introducidos: 
1,2