# Copiar aquest fitxer amb el nom databases.yml  i configurar-ho 
# ...

developement:
    database: 
        name: [nom_bbdd]
        username: [username]
        password: [pwd]
        host: [host]
        
		
# NO tocar aquestes linies !!!
		
production:
    database:
        name: bbdd2
        username: username
        password: pwd
        host: localhost
        